Build #3,886

Runs unit test and deploys artifacts to maven repo. More details of the release in https://wiki.openmrs.org/x/i4DTAw

Build: #3886 failed Changes by mgoodrich <mark.goodrich@live.com>

Stages & jobs

  1. Default Stage

  2. Release

    Requires a user to start manually

Build result summary

Details

Completed
Duration
16 minutes
Labels
None
Revisions
Git
becdde9fa4d0b21a382b2f1932b581c71cafa3c4 becdde9fa4d0b21a382b2f1932b581c71cafa3c4
Release scripts
ab83775184d5fb0f928388fa25ee675b855dd53c ab83775184d5fb0f928388fa25ee675b855dd53c
Total tests
81
Fixed in
#3887 (Changes by James Mbabazi <12864648+jmbabazi@users.noreply.github.com>)

Tests

Responsible

No one has taken responsibility for this failure

Code commits

Git
Author Commit Message Commit date
mgoodrich <mark.goodrich@live.com> mgoodrich <mark.goodrich@live.com> becdde9fa4d0b21a382b2f1932b581c71cafa3c4 becdde9fa4d0b21a382b2f1932b581c71cafa3c4 Clinician Dashboard: add bootstrap row and col around title

Tests

New test failures 27
Status Test View job Duration
Collapse Failed CodedOrFreeTextObsTagHandlerComponentTest testCodedEditedToCoded History
Default Job < 1 sec
org.dbunit.dataset.NoSuchTableException: person
Collapse Failed CodedOrFreeTextObsTagHandlerComponentTest testNonCodedEditedToCoded History
Default Job < 1 sec
org.dbunit.dataset.NoSuchTableException: person
Collapse Failed CodedOrFreeTextObsTagHandlerComponentTest testEditingToBlankVoidsObs History
Default Job < 1 sec
org.dbunit.dataset.NoSuchTableException: person
Collapse Failed CodedOrFreeTextObsTagHandlerComponentTest testBlank History
Default Job < 1 sec
org.dbunit.dataset.NoSuchTableException: person
Collapse Failed EncounterDiagnosesTagHandlerComponentTest testHandleSubmissionHandlesValidSubmissionEnteringForm History
Default Job < 1 sec
org.dbunit.dataset.NoSuchTableException: person
Collapse Failed EncounterDiagnosesTagHandlerComponentTest getSubstitution_shouldAddDiagnosisConceptClassesAttributeOnDiagnosisSearchField History
Default Job < 1 sec
org.dbunit.dataset.NoSuchTableException: person
Collapse Failed EncounterDiagnosesTagHandlerComponentTest getSubstitution_shouldAddDiagnosisConceptSourcesAttributeOnDiagnosisSearchField History
Default Job < 1 sec
org.dbunit.dataset.NoSuchTableException: person
Collapse Failed EncounterDiagnosesTagHandlerComponentTest getSubstitution_shouldNotAddDiagnosisConceptSourcesAttributeOnDiagnosisSearchFieldGivenNullAttribute History
Default Job < 1 sec
org.dbunit.dataset.NoSuchTableException: person
Collapse Failed EncounterDiagnosesTagHandlerComponentTest getSubstitution_shouldAddUuidsToDiagnosisSetsAttributeOnDiagnosisSearchFieldGivenDiagnosisMappings History
Default Job < 1 sec
org.dbunit.dataset.NoSuchTableException: person
Collapse Failed EncounterDiagnosesTagHandlerComponentTest testHandleSubmissionHandlesValidSubmissionEditingForm History
Default Job < 1 sec
org.dbunit.dataset.NoSuchTableException: person
Collapse Failed EncounterDiagnosesTagHandlerComponentTest getSubstitution_shouldAddNullValueCharToDiagnosisSetsAttributeOnDiagnosisSearchField History
Default Job < 1 sec
org.dbunit.dataset.NoSuchTableException: person
Collapse Failed EncounterDiagnosesTagHandlerComponentTest getSubstitution_shouldAddPreferredCodingSourceWithPreferredValueAttributeOnDiagnosisSearchField History
Default Job < 1 sec
org.dbunit.dataset.NoSuchTableException: person
Collapse Failed EncounterDiagnosesTagHandlerComponentTest getSubstitution_shouldNotAddDiagnosisSetsAttributeOnDiagnosisSearchFieldGivenNullAttribute History
Default Job < 1 sec
org.dbunit.dataset.NoSuchTableException: person
Collapse Failed EncounterDiagnosesTagHandlerComponentTest getSubstitution_shouldAddUuidsToDiagnosisSetsAttributeOnDiagnosisSearchFieldGivenDiagnosisUuids History
Default Job < 1 sec
org.dbunit.dataset.NoSuchTableException: person
Collapse Failed EncounterDiagnosesTagHandlerComponentTest getSubstitution_shouldNotAddDiagnosisConceptClassesAttributeOnDiagnosisSearchFieldGivenNullAttribute History
Default Job < 1 sec
org.dbunit.dataset.NoSuchTableException: person
Collapse Failed EncounterDiagnosesTagHandlerComponentTest getSubstitution_shouldThrowWhenDiagnosisSetsAttributeContainsInvalidSetsIds History
Default Job < 1 sec
org.dbunit.dataset.NoSuchTableException: person
Collapse Failed EncounterDiagnosesTagHandlerComponentTest getSubstitution_shouldAddPreferredCodingSourceWithDefaultValueAttributeOnDiagnosisSearchField History
Default Job < 1 sec
org.dbunit.dataset.NoSuchTableException: person
Collapse Failed EncounterDispositionTagHandlerComponentTest testEnteringForm History
Default Job < 1 sec
org.dbunit.dataset.NoSuchTableException: person
Collapse Failed EncounterDispositionTagHandlerComponentTest testFormOnlyShowsDispositionsInDescriptor History
Default Job < 1 sec
org.dbunit.dataset.NoSuchTableException: person
Collapse Failed EncounterDispositionTagHandlerComponentTest testShouldNotDisplayAdmissionLocationAfterEnteringDischargeDisposition History
Default Job < 1 sec
org.dbunit.dataset.NoSuchTableException: person
Collapse Failed EncounterDispositionTagHandlerComponentTest testShouldDisplayAdmissionLocationAfterEnteringAdmissionDisposition History
Default Job < 1 sec
org.dbunit.dataset.NoSuchTableException: person
Collapse Failed LatestObsRestControllerTest shouldGetRefByUuid History
Default Job < 1 sec
org.dbunit.dataset.NoSuchTableException: person
Collapse Failed LatestObsRestControllerTest shouldGetFullByUuid History
Default Job < 1 sec
org.dbunit.dataset.NoSuchTableException: person
Collapse Failed LatestObsRestControllerTest shouldGetDefaultByUuid History
Default Job < 1 sec
org.dbunit.dataset.NoSuchTableException: person
Collapse Failed LatestObsRestControllerTest testSearchForSingleConcept History
Default Job 4 mins
org.dbunit.dataset.NoSuchTableException: person
Collapse Failed LatestObsRestControllerTest shouldGetAll History
Default Job < 1 sec
org.dbunit.dataset.NoSuchTableException: person
Collapse Failed LatestObsRestControllerTest testSearchForMultipleConcept History
Default Job < 1 sec
org.dbunit.dataset.NoSuchTableException: person