Build #3,886

Runs unit test and deploys artifacts to maven repo. More details of the release in https://wiki.openmrs.org/x/i4DTAw

Build: #3886 failed

Job: Default Job failed

Stages & jobs

  1. Default Stage

  2. Release

    Requires a user to start manually

Job result summary

Completed
Duration
15 minutes
Agent
yue.openmrs.org
Revision
becdde9fa4d0b21a382b2f1932b581c71cafa3c4 becdde9fa4d0b21a382b2f1932b581c71cafa3c4
Total tests
81
Fixed in
#3887 (Code changes detected)

Tests

  • 81 tests in total
  • 27 tests failed
  • 27 failures are new
  • 5 minutes taken in total.
New test failures 27
Status Test Duration
Collapse Failed CodedOrFreeTextObsTagHandlerComponentTest testBlank History
< 1 sec
org.dbunit.dataset.NoSuchTableException: person
Collapse Failed CodedOrFreeTextObsTagHandlerComponentTest testCodedEditedToCoded History
< 1 sec
org.dbunit.dataset.NoSuchTableException: person
Collapse Failed CodedOrFreeTextObsTagHandlerComponentTest testEditingToBlankVoidsObs History
< 1 sec
org.dbunit.dataset.NoSuchTableException: person
Collapse Failed CodedOrFreeTextObsTagHandlerComponentTest testNonCodedEditedToCoded History
< 1 sec
org.dbunit.dataset.NoSuchTableException: person
Collapse Failed EncounterDiagnosesTagHandlerComponentTest getSubstitution_shouldAddDiagnosisConceptClassesAttributeOnDiagnosisSearchField History
< 1 sec
org.dbunit.dataset.NoSuchTableException: person
Collapse Failed EncounterDiagnosesTagHandlerComponentTest getSubstitution_shouldAddDiagnosisConceptSourcesAttributeOnDiagnosisSearchField History
< 1 sec
org.dbunit.dataset.NoSuchTableException: person
Collapse Failed EncounterDiagnosesTagHandlerComponentTest getSubstitution_shouldAddNullValueCharToDiagnosisSetsAttributeOnDiagnosisSearchField History
< 1 sec
org.dbunit.dataset.NoSuchTableException: person
Collapse Failed EncounterDiagnosesTagHandlerComponentTest getSubstitution_shouldAddPreferredCodingSourceWithDefaultValueAttributeOnDiagnosisSearchField History
< 1 sec
org.dbunit.dataset.NoSuchTableException: person
Collapse Failed EncounterDiagnosesTagHandlerComponentTest getSubstitution_shouldAddPreferredCodingSourceWithPreferredValueAttributeOnDiagnosisSearchField History
< 1 sec
org.dbunit.dataset.NoSuchTableException: person
Collapse Failed EncounterDiagnosesTagHandlerComponentTest getSubstitution_shouldAddUuidsToDiagnosisSetsAttributeOnDiagnosisSearchFieldGivenDiagnosisMappings History
< 1 sec
org.dbunit.dataset.NoSuchTableException: person
Collapse Failed EncounterDiagnosesTagHandlerComponentTest getSubstitution_shouldAddUuidsToDiagnosisSetsAttributeOnDiagnosisSearchFieldGivenDiagnosisUuids History
< 1 sec
org.dbunit.dataset.NoSuchTableException: person
Collapse Failed EncounterDiagnosesTagHandlerComponentTest getSubstitution_shouldNotAddDiagnosisConceptClassesAttributeOnDiagnosisSearchFieldGivenNullAttribute History
< 1 sec
org.dbunit.dataset.NoSuchTableException: person
Collapse Failed EncounterDiagnosesTagHandlerComponentTest getSubstitution_shouldNotAddDiagnosisConceptSourcesAttributeOnDiagnosisSearchFieldGivenNullAttribute History
< 1 sec
org.dbunit.dataset.NoSuchTableException: person
Collapse Failed EncounterDiagnosesTagHandlerComponentTest getSubstitution_shouldNotAddDiagnosisSetsAttributeOnDiagnosisSearchFieldGivenNullAttribute History
< 1 sec
org.dbunit.dataset.NoSuchTableException: person
Collapse Failed EncounterDiagnosesTagHandlerComponentTest getSubstitution_shouldThrowWhenDiagnosisSetsAttributeContainsInvalidSetsIds History
< 1 sec
org.dbunit.dataset.NoSuchTableException: person
Collapse Failed EncounterDiagnosesTagHandlerComponentTest testHandleSubmissionHandlesValidSubmissionEditingForm History
< 1 sec
org.dbunit.dataset.NoSuchTableException: person
Collapse Failed EncounterDiagnosesTagHandlerComponentTest testHandleSubmissionHandlesValidSubmissionEnteringForm History
< 1 sec
org.dbunit.dataset.NoSuchTableException: person
Collapse Failed EncounterDispositionTagHandlerComponentTest testEnteringForm History
< 1 sec
org.dbunit.dataset.NoSuchTableException: person
Collapse Failed EncounterDispositionTagHandlerComponentTest testFormOnlyShowsDispositionsInDescriptor History
< 1 sec
org.dbunit.dataset.NoSuchTableException: person
Collapse Failed EncounterDispositionTagHandlerComponentTest testShouldDisplayAdmissionLocationAfterEnteringAdmissionDisposition History
< 1 sec
org.dbunit.dataset.NoSuchTableException: person
Collapse Failed EncounterDispositionTagHandlerComponentTest testShouldNotDisplayAdmissionLocationAfterEnteringDischargeDisposition History
< 1 sec
org.dbunit.dataset.NoSuchTableException: person
Collapse Failed LatestObsRestControllerTest shouldGetAll History
< 1 sec
org.dbunit.dataset.NoSuchTableException: person
Collapse Failed LatestObsRestControllerTest shouldGetDefaultByUuid History
< 1 sec
org.dbunit.dataset.NoSuchTableException: person
Collapse Failed LatestObsRestControllerTest shouldGetFullByUuid History
< 1 sec
org.dbunit.dataset.NoSuchTableException: person
Collapse Failed LatestObsRestControllerTest shouldGetRefByUuid History
< 1 sec
org.dbunit.dataset.NoSuchTableException: person
Collapse Failed LatestObsRestControllerTest testSearchForMultipleConcept History
< 1 sec
org.dbunit.dataset.NoSuchTableException: person
Collapse Failed LatestObsRestControllerTest testSearchForSingleConcept History
4 mins
org.dbunit.dataset.NoSuchTableException: person

Error summary

The build generated some errors. See the full build log for more details.

SLF4J: Class path contains multiple SLF4J bindings.
SLF4J: Found binding in [jar:file:/home/bamboo-agent/.m2/repository/org/slf4j/slf4j-log4j12/1.6.0/slf4j-log4j12-1.6.0.jar!/org/slf4j/impl/StaticLoggerBinder.class]
SLF4J: Found binding in [jar:file:/home/bamboo-agent/.m2/repository/org/slf4j/slf4j-log4j12/1.6.0/slf4j-log4j12-1.6.0.jar!/org/slf4j/impl/StaticLoggerBinder.class]
SLF4J: See http://www.slf4j.org/codes.html#multiple_bindings for an explanation.