Build: #35 failed Rebuilt by Juliet Wamalwa

Stages & jobs

  1. Default Stage

  2. Release

    Requires a user to start manually

Build result summary

Details

Completed
Duration
1 minute
Flags
Rebuild
Labels
None
Revisions
openmrs-packager-maven-plugin
6a67c9d57487e2293af6079c3d847485fa02f443 6a67c9d57487e2293af6079c3d847485fa02f443
Release scripts
681f3bff12454842e7e4fae01a15ce2827d75dc7 681f3bff12454842e7e4fae01a15ce2827d75dc7
Total tests
10
Fixed in
#37 (Changes by Daniel Kayiwa)
Number of retries
1

Tests

Responsible

Code commits

openmrs-packager-maven-plugin
Author Commit Message Commit date
Ian Bacher Ian Bacher 6a67c9d57487e2293af6079c3d847485fa02f443 6a67c9d57487e2293af6079c3d847485fa02f443 Updating repository URLs to HTTPS
For details on why this change is happening see this Talk post: https://talk.openmrs.org/t/maven-3-8-1-and-http-repositories/33364

If this commit causes issues, please feel free to revert

Configuration changes

Plan configuration has changed since the last successful build. See the plan audit log for more details.

Tests

New test failures 10
Status Test View job Duration
Collapse Failed AbstractPackagerConfigTest testThatBuildArtifactsAreInExpectedDirectory History
Default Job 4 secs
org.apache.maven.it.VerificationException: Exit code was non-zero: 1; command line and log =  /usr/share/apache-maven-3.3.9/bin/mvn -N -X -e --batch-mode -Dmaven.repo.local=/home/bamboo-agent/.m2/repository org.apache.maven.plugins:maven-clean-plugin:clean compile Apache Maven 3.3.9 (bb52d8502b132ec0a5a3f4c09453c07478323dc5; 2015-11-10T16:41:47+00:00) Maven home: /usr/share/apache-maven-3.3.9 Java version: 1.8.0_292, vendor: Private Build Java home: /usr/lib/jvm/java-8-openjdk-amd64/jre Default locale: en_US, platform encoding: UTF-8 OS name: "linux", version: "4.4.0-210-generic", arch: "amd64", family: "unix" [DEBUG] Created new class realm maven.api [DEBUG] Importing foreign packages into class realm maven.api [DEBUG]   Imported: javax.enterprise.inject.* < plexus.core [DEBUG]   Imported: javax.enterprise.util.* < plexus.core [DEBUG]   Imported: javax.inject.* < plexus.core [DEBUG]   Imported: org.apache.maven.* < plexus.core [DEBUG]   Imported: org.apache.maven.artifact < plexus.core [DEBUG]   Imported: org.apache.maven.classrealm < plexus.core [DEBUG]   Imported: org.apache.maven.cli < plexus.core [DEBUG]   Imported: org.apache.maven.configuration < plexus.core [DEBUG]   Imported: org.apache.maven.exception < plexus.core [DEBUG]   Imported: org.apache.maven.execution < plexus.core [DEBUG]   Imported: org.apache.maven.execution.scope < plexus.core [DEBUG]   Imported: org.apache.maven.lifecycle < plexus.core [DEBUG]   Imported: org.apache.maven.model < plexus.core [DEBUG]   Imported: org.apache.maven.monitor < plexus.core [DEBUG]   Imported: org.apache.maven.plugin < plexus.core [DEBUG]   Imported: org.apache.maven.profiles < plexus.core [DEBUG]   Imported: org.apache.maven.project < plexus.core [DEBUG]   Imported: org.apache.maven.reporting < plexus.core [DEBUG]   Imported: org.apache.maven.repository < plexus.core [DEBUG]   Imported: org.apache.maven.rtinfo < plexus.core [DEBUG]   Imported: org.apache.maven.settings < plexus.core [DEBUG]   Imported: org.apache.maven.toolchain < plexus.core [DEBUG]   Imported: org.apache.maven.usability < plexus.core [DEBUG]   Imported: org.apache.maven.wagon.* < plexus.core [DEBUG]   Imported: org.apache.maven.wagon.authentication < plexus.core [DEBUG]   Imported: org.apache.maven.wagon.authorization < plexus.core [DEBUG]   Imported: org.apache.maven.wagon.events < plexus.core [DEBUG]   Imported: org.apache.maven.wagon.observers < plexus.core [DEBUG]   Imported: org.apache.maven.wagon.proxy < plexus.core [DEBUG]   Imported: org.apache.maven.wagon.repository < plexus.core [DEBUG]   Imported: org.apache.maven.wagon.resource < plexus.core [DEBUG]   Imported: org.codehaus.classworlds < plexus.core [DEBUG]   Imported: org.codehaus.plexus.* < plexus.core [DEBUG]   Imported: org.codehaus.plexus.classworlds < plexus.core [DEBUG]   Imported: org.codehaus.plexus.component < plexus.core [DEBUG]   Imported: org.codehaus.plexus.configuration < plexus.core [DEBUG]   Imported: org.codehaus.plexus.container < plexus.core [DEBUG]   Imported: org.codehaus.plexus.context < plexus.core [DEBUG]   Imported: org.codehaus.plexus.lifecycle < plexus.core [DEBUG]   Imported: org.codehaus.plexus.logging < plexus.core [DEBUG]   Imported: org.codehaus.plexus.personality < plexus.core [DEBUG]   Imported: org.codehaus.plexus.util.xml.Xpp3Dom < plexus.core [DEBUG]   Imported: org.codehaus.plexus.util.xml.pull.XmlPullParser < plexus.core [DEBUG]   Imported: org.codehaus.plexus.util.xml.pull.XmlPullParserException < plexus.core [DEBUG]   Imported: org.codehaus.plexus.util.xml.pull.XmlSerializer < plexus.core [DEBUG]   Imported: org.eclipse.aether.* < plexus.core [DEBUG]   Imported: org.eclipse.aether.artifact < plexus.core [DEBUG]   Imported: org.eclipse.aether.collection < plexus.core [DEBUG]   Imported: org.eclipse.aether.deployment < plexus.core [DEBUG]   Imported: org.eclipse.aether.graph < plexus.core [DEBUG]   Imported: org.eclipse.aether.impl < plexus.core [DEBUG]   Imported: org.eclipse.aether.installation < plexus.core [DEBUG]   Imported: org.eclipse.aether.internal.impl < plexus.core [DEBUG]   Imported: org.eclipse.aether.metadata < plexus.core [DEBUG]   Imported: org.eclipse.aether.repository < plexus.core [DEBUG]   Imported: org.eclipse.aether.resolution < plexus.core [DEBUG]   Imported: org.eclipse.aether.spi < plexus.core [DEBUG]   Imported: org.eclipse.aether.transfer < plexus.core [DEBUG]   Imported: org.eclipse.aether.version < plexus.core [DEBUG]   Imported: org.slf4j.* < plexus.core [DEBUG]   Imported: org.slf4j.helpers.* < plexus.core [DEBUG]   Imported: org.slf4j.spi.* < plexus.core [DEBUG] Populating class realm maven.api [INFO] Error stacktraces are turned on. [DEBUG] Reading global settings from /usr/share/apache-maven-3.3.9/conf/settings.xml [DEBUG] Reading user settings from /home/bamboo-agent/.m2/settings.xml [DEBUG] Reading global toolchains from /usr/share/apache-maven-3.3.9/conf/toolchains.xml [DEBUG] Reading user toolchains from /home/bamboo-agent/.m2/toolchains.xml [DEBUG] Using local repository at /home/bamboo-agent/.m2/repository [DEBUG] Using manager EnhancedLocalRepositoryManager with priority 10.0 for /home/bamboo-agent/.m2/repository [INFO] Scanning for projects... [DEBUG] Extension realms for project org.openmrs.maven.plugins:openmrs-packager-maven-plugin-config-test-parent:pom:1.0.0-SNAPSHOT: (none) [DEBUG] Looking up lifecyle mappings for packaging pom from ClassRealm[plexus.core, parent: null] [DEBUG] === REACTOR BUILD PLAN ================================================ [DEBUG] Project: org.openmrs.maven.plugins:openmrs-packager-maven-plugin-config-test-parent:pom:1.0.0-SNAPSHOT [DEBUG] Tasks:   [org.apache.maven.plugins:maven-clean-plugin:clean, compile] [DEBUG] Style:   Regular [DEBUG] ======================================================================= [INFO]                                                                          [INFO] ------------------------------------------------------------------------ [INFO] Building OpenMRS config parent test 1.0.0-SNAPSHOT [INFO] ------------------------------------------------------------------------ [DEBUG] Lifecycle default -> [validate, initialize, generate-sources, process-sources, generate-resources, process-resources, compile, process-classes, generate-test-sources, process-test-sources, generate-test-resources, process-test-resources, test-compile, process-test-classes, test, prepare-package, package, pre-integration-test, integration-test, post-integration-test, verify, install, deploy] [DEBUG] Lifecycle clean -> [pre-clean, clean, post-clean] [DEBUG] Lifecycle site -> [pre-site, site, post-site, site-deploy] [DEBUG] Could not find metadata org.openmrs.maven.plugins:openmrs-packager-maven-plugin:1.5.0-SNAPSHOT/maven-metadata.xml in local (/home/bamboo-agent/.m2/repository) [DEBUG] Could not find metadata org.openmrs.maven.plugins:openmrs-packager-maven-plugin:1.5.0-SNAPSHOT/maven-metadata.xml in local (/home/bamboo-agent/.m2/repository) [WARNING] The POM for org.openmrs.maven.plugins:openmrs-packager-maven-plugin:jar:1.5.0-SNAPSHOT is missing, no dependency information available [INFO] ------------------------------------------------------------------------ [INFO] BUILD FAILURE [INFO] ------------------------------------------------------------------------ [INFO] Total time: 0.196 s [INFO] Finished at: 2021-07-06T07:19:42+00:00 [INFO] Final Memory: 7M/106M [INFO] ------------------------------------------------------------------------ [ERROR] Plugin org.openmrs.maven.plugins:openmrs-packager-maven-plugin:1.5.0-SNAPSHOT or one of its dependencies could not be resolved: Could not find artifact org.openmrs.maven.plugins:openmrs-packager-maven-plugin:jar:1.5.0-SNAPSHOT -> [Help 1] org.apache.maven.plugin.PluginResolutionException: Plugin org.openmrs.maven.plugins:openmrs-packager-maven-plugin:1.5.0-SNAPSHOT or one of its dependencies could not be resolved: Could not find artifact org.openmrs.maven.plugins:openmrs-packager-maven-plugin:jar:1.5.0-SNAPSHOT  at org.apache.maven.plugin.internal.DefaultPluginDependenciesResolver.resolve(DefaultPluginDependenciesResolver.java:128)  at org.apache.maven.plugin.internal.DefaultMavenPluginManager.getPluginDescriptor(DefaultMavenPluginManager.java:179)  at org.apache.maven.plugin.internal.DefaultMavenPluginManager.getMojoDescriptor(DefaultMavenPluginManager.java:284)  at org.apache.maven.plugin.DefaultBuildPluginManager.getMojoDescriptor(DefaultBuildPluginManager.java:241)  at org.apache.maven.lifecycle.internal.DefaultLifecycleExecutionPlanCalculator.setupMojoExecution(DefaultLifecycleExecutionPlanCalculator.java:169)  at org.apache.maven.lifecycle.internal.DefaultLifecycleExecutionPlanCalculator.setupMojoExecutions(DefaultLifecycleExecutionPlanCalculator.java:155)  at org.apache.maven.lifecycle.internal.DefaultLifecycleExecutionPlanCalculator.calculateExecutionPlan(DefaultLifecycleExecutionPlanCalculator.java:131)  at org.apache.maven.lifecycle.internal.DefaultLifecycleExecutionPlanCalculator.calculateExecutionPlan(DefaultLifecycleExecutionPlanCalculator.java:145)  at org.apache.maven.lifecycle.internal.builder.BuilderCommon.resolveBuildPlan(BuilderCommon.java:96)  at org.apache.maven.lifecycle.internal.LifecycleModuleBuilder.buildProject(LifecycleModuleBuilder.java:109)  at org.apache.maven.lifecycle.internal.LifecycleModuleBuilder.buildProject(LifecycleModuleBuilder.java:80)  at org.apache.maven.lifecycle.internal.builder.singlethreaded.SingleThreadedBuilder.build(SingleThreadedBuilder.java:51)  at org.apache.maven.lifecycle.internal.LifecycleStarter.execute(LifecycleStarter.java:128)  at org.apache.maven.DefaultMaven.doExecute(DefaultMaven.java:307)  at org.apache.maven.DefaultMaven.doExecute(DefaultMaven.java:193)  at org.apache.maven.DefaultMaven.execute(DefaultMaven.java:106)  at org.apache.maven.cli.MavenCli.execute(MavenCli.java:863)  at org.apache.maven.cli.MavenCli.doMain(MavenCli.java:288)  at org.apache.maven.cli.MavenCli.main(MavenCli.java:199)  at sun.reflect.NativeMethodAccessorImpl.invoke0(Native Method)  at sun.reflect.NativeMethodAccessorImpl.invoke(NativeMethodAccessorImpl.java:62)  at sun.reflect.DelegatingMethodAccessorImpl.invoke(DelegatingMethodAccessorImpl.java:43)  at java.lang.reflect.Method.invoke(Method.java:498)  at org.codehaus.plexus.classworlds.launcher.Launcher.launchEnhanced(Launcher.java:289)  at org.codehaus.plexus.classworlds.launcher.Launcher.launch(Launcher.java:229)  at org.codehaus.plexus.classworlds.launcher.Launcher.mainWithExitCode(Launcher.java:415)  at org.codehaus.plexus.classworlds.launcher.Launcher.main(Launcher.java:356) Caused by: org.eclipse.aether.resolution.ArtifactResolutionException: Could not find artifact org.openmrs.maven.plugins:openmrs-packager-maven-plugin:jar:1.5.0-SNAPSHOT  at org.eclipse.aether.internal.impl.DefaultArtifactResolver.resolve(DefaultArtifactResolver.java:444)  at org.eclipse.aether.internal.impl.DefaultArtifactResolver.resolveArtifacts(DefaultArtifactResolver.java:246)  at org.eclipse.aether.internal.impl.DefaultArtifactResolver.resolveArtifact(DefaultArtifactResolver.java:223)  at org.eclipse.aether.internal.impl.DefaultRepositorySystem.resolveArtifact(DefaultRepositorySystem.java:294)  at org.apache.maven.plugin.internal.DefaultPluginDependenciesResolver.resolve(DefaultPluginDependenciesResolver.java:124)  ... 26 more Caused by: org.eclipse.aether.transfer.ArtifactNotFoundException: Could not find artifact org.openmrs.maven.plugins:openmrs-packager-maven-plugin:jar:1.5.0-SNAPSHOT  at org.eclipse.aether.internal.impl.DefaultArtifactResolver.resolve(DefaultArtifactResolver.java:434)  ... 30 more [ERROR]  [ERROR]  [ERROR] For more information about the errors and possible solutions, please read the following articles: [ERROR] [Help 1] http://cwiki.apache.org/confluence/display/MAVEN/PluginResolutionException 
org.apache.maven.it.VerificationException: Exit code was non-zero: 1; command line and log = 
/usr/share/apache-maven-3.3.9/bin/mvn -N -X -e --batch-mode -Dmaven.repo.local=/home/bamboo-agent/.m2/repository org.apache.maven.plugins:maven-clean-plugin:clean compile
Apache Maven 3.3.9 (bb52d8502b132ec0a5a3f4c09453c07478323dc5; 2015-11-10T16:41:47+00:00)
Maven home: /usr/share/apache-maven-3.3.9
Java version: 1.8.0_292, vendor: Private Build
Java home: /usr/lib/jvm/java-8-openjdk-amd64/jre
Default locale: en_US, platform encoding: UTF-8
(179 more lines...)
Collapse Failed CompileConfigurationsTest testDependenciesAreLoaded History
Default Job 3 secs
org.apache.maven.it.VerificationException: Exit code was non-zero: 1; command line and log =  /usr/share/apache-maven-3.3.9/bin/mvn -N -X -e --batch-mode -Dmaven.repo.local=/home/bamboo-agent/.m2/repository org.apache.maven.plugins:maven-clean-plugin:clean install Apache Maven 3.3.9 (bb52d8502b132ec0a5a3f4c09453c07478323dc5; 2015-11-10T16:41:47+00:00) Maven home: /usr/share/apache-maven-3.3.9 Java version: 1.8.0_292, vendor: Private Build Java home: /usr/lib/jvm/java-8-openjdk-amd64/jre Default locale: en_US, platform encoding: UTF-8 OS name: "linux", version: "4.4.0-210-generic", arch: "amd64", family: "unix" [DEBUG] Created new class realm maven.api [DEBUG] Importing foreign packages into class realm maven.api [DEBUG]   Imported: javax.enterprise.inject.* < plexus.core [DEBUG]   Imported: javax.enterprise.util.* < plexus.core [DEBUG]   Imported: javax.inject.* < plexus.core [DEBUG]   Imported: org.apache.maven.* < plexus.core [DEBUG]   Imported: org.apache.maven.artifact < plexus.core [DEBUG]   Imported: org.apache.maven.classrealm < plexus.core [DEBUG]   Imported: org.apache.maven.cli < plexus.core [DEBUG]   Imported: org.apache.maven.configuration < plexus.core [DEBUG]   Imported: org.apache.maven.exception < plexus.core [DEBUG]   Imported: org.apache.maven.execution < plexus.core [DEBUG]   Imported: org.apache.maven.execution.scope < plexus.core [DEBUG]   Imported: org.apache.maven.lifecycle < plexus.core [DEBUG]   Imported: org.apache.maven.model < plexus.core [DEBUG]   Imported: org.apache.maven.monitor < plexus.core [DEBUG]   Imported: org.apache.maven.plugin < plexus.core [DEBUG]   Imported: org.apache.maven.profiles < plexus.core [DEBUG]   Imported: org.apache.maven.project < plexus.core [DEBUG]   Imported: org.apache.maven.reporting < plexus.core [DEBUG]   Imported: org.apache.maven.repository < plexus.core [DEBUG]   Imported: org.apache.maven.rtinfo < plexus.core [DEBUG]   Imported: org.apache.maven.settings < plexus.core [DEBUG]   Imported: org.apache.maven.toolchain < plexus.core [DEBUG]   Imported: org.apache.maven.usability < plexus.core [DEBUG]   Imported: org.apache.maven.wagon.* < plexus.core [DEBUG]   Imported: org.apache.maven.wagon.authentication < plexus.core [DEBUG]   Imported: org.apache.maven.wagon.authorization < plexus.core [DEBUG]   Imported: org.apache.maven.wagon.events < plexus.core [DEBUG]   Imported: org.apache.maven.wagon.observers < plexus.core [DEBUG]   Imported: org.apache.maven.wagon.proxy < plexus.core [DEBUG]   Imported: org.apache.maven.wagon.repository < plexus.core [DEBUG]   Imported: org.apache.maven.wagon.resource < plexus.core [DEBUG]   Imported: org.codehaus.classworlds < plexus.core [DEBUG]   Imported: org.codehaus.plexus.* < plexus.core [DEBUG]   Imported: org.codehaus.plexus.classworlds < plexus.core [DEBUG]   Imported: org.codehaus.plexus.component < plexus.core [DEBUG]   Imported: org.codehaus.plexus.configuration < plexus.core [DEBUG]   Imported: org.codehaus.plexus.container < plexus.core [DEBUG]   Imported: org.codehaus.plexus.context < plexus.core [DEBUG]   Imported: org.codehaus.plexus.lifecycle < plexus.core [DEBUG]   Imported: org.codehaus.plexus.logging < plexus.core [DEBUG]   Imported: org.codehaus.plexus.personality < plexus.core [DEBUG]   Imported: org.codehaus.plexus.util.xml.Xpp3Dom < plexus.core [DEBUG]   Imported: org.codehaus.plexus.util.xml.pull.XmlPullParser < plexus.core [DEBUG]   Imported: org.codehaus.plexus.util.xml.pull.XmlPullParserException < plexus.core [DEBUG]   Imported: org.codehaus.plexus.util.xml.pull.XmlSerializer < plexus.core [DEBUG]   Imported: org.eclipse.aether.* < plexus.core [DEBUG]   Imported: org.eclipse.aether.artifact < plexus.core [DEBUG]   Imported: org.eclipse.aether.collection < plexus.core [DEBUG]   Imported: org.eclipse.aether.deployment < plexus.core [DEBUG]   Imported: org.eclipse.aether.graph < plexus.core [DEBUG]   Imported: org.eclipse.aether.impl < plexus.core [DEBUG]   Imported: org.eclipse.aether.installation < plexus.core [DEBUG]   Imported: org.eclipse.aether.internal.impl < plexus.core [DEBUG]   Imported: org.eclipse.aether.metadata < plexus.core [DEBUG]   Imported: org.eclipse.aether.repository < plexus.core [DEBUG]   Imported: org.eclipse.aether.resolution < plexus.core [DEBUG]   Imported: org.eclipse.aether.spi < plexus.core [DEBUG]   Imported: org.eclipse.aether.transfer < plexus.core [DEBUG]   Imported: org.eclipse.aether.version < plexus.core [DEBUG]   Imported: org.slf4j.* < plexus.core [DEBUG]   Imported: org.slf4j.helpers.* < plexus.core [DEBUG]   Imported: org.slf4j.spi.* < plexus.core [DEBUG] Populating class realm maven.api [INFO] Error stacktraces are turned on. [DEBUG] Reading global settings from /usr/share/apache-maven-3.3.9/conf/settings.xml [DEBUG] Reading user settings from /home/bamboo-agent/.m2/settings.xml [DEBUG] Reading global toolchains from /usr/share/apache-maven-3.3.9/conf/toolchains.xml [DEBUG] Reading user toolchains from /home/bamboo-agent/.m2/toolchains.xml [DEBUG] Using local repository at /home/bamboo-agent/.m2/repository [DEBUG] Using manager EnhancedLocalRepositoryManager with priority 10.0 for /home/bamboo-agent/.m2/repository [INFO] Scanning for projects... [DEBUG] Extension realms for project org.openmrs.maven.plugins:openmrs-packager-maven-plugin-config-test-parent:pom:1.0.0-SNAPSHOT: (none) [DEBUG] Looking up lifecyle mappings for packaging pom from ClassRealm[plexus.core, parent: null] [DEBUG] === REACTOR BUILD PLAN ================================================ [DEBUG] Project: org.openmrs.maven.plugins:openmrs-packager-maven-plugin-config-test-parent:pom:1.0.0-SNAPSHOT [DEBUG] Tasks:   [org.apache.maven.plugins:maven-clean-plugin:clean, install] [DEBUG] Style:   Regular [DEBUG] ======================================================================= [INFO]                                                                          [INFO] ------------------------------------------------------------------------ [INFO] Building OpenMRS config parent test 1.0.0-SNAPSHOT [INFO] ------------------------------------------------------------------------ [DEBUG] Lifecycle default -> [validate, initialize, generate-sources, process-sources, generate-resources, process-resources, compile, process-classes, generate-test-sources, process-test-sources, generate-test-resources, process-test-resources, test-compile, process-test-classes, test, prepare-package, package, pre-integration-test, integration-test, post-integration-test, verify, install, deploy] [DEBUG] Lifecycle clean -> [pre-clean, clean, post-clean] [DEBUG] Lifecycle site -> [pre-site, site, post-site, site-deploy] [DEBUG] Could not find metadata org.openmrs.maven.plugins:openmrs-packager-maven-plugin:1.5.0-SNAPSHOT/maven-metadata.xml in local (/home/bamboo-agent/.m2/repository) [DEBUG] Could not find metadata org.openmrs.maven.plugins:openmrs-packager-maven-plugin:1.5.0-SNAPSHOT/maven-metadata.xml in local (/home/bamboo-agent/.m2/repository) [WARNING] The POM for org.openmrs.maven.plugins:openmrs-packager-maven-plugin:jar:1.5.0-SNAPSHOT is missing, no dependency information available [INFO] ------------------------------------------------------------------------ [INFO] BUILD FAILURE [INFO] ------------------------------------------------------------------------ [INFO] Total time: 0.141 s [INFO] Finished at: 2021-07-06T07:20:07+00:00 [INFO] Final Memory: 7M/106M [INFO] ------------------------------------------------------------------------ [ERROR] Plugin org.openmrs.maven.plugins:openmrs-packager-maven-plugin:1.5.0-SNAPSHOT or one of its dependencies could not be resolved: Could not find artifact org.openmrs.maven.plugins:openmrs-packager-maven-plugin:jar:1.5.0-SNAPSHOT -> [Help 1] org.apache.maven.plugin.PluginResolutionException: Plugin org.openmrs.maven.plugins:openmrs-packager-maven-plugin:1.5.0-SNAPSHOT or one of its dependencies could not be resolved: Could not find artifact org.openmrs.maven.plugins:openmrs-packager-maven-plugin:jar:1.5.0-SNAPSHOT  at org.apache.maven.plugin.internal.DefaultPluginDependenciesResolver.resolve(DefaultPluginDependenciesResolver.java:128)  at org.apache.maven.plugin.internal.DefaultMavenPluginManager.getPluginDescriptor(DefaultMavenPluginManager.java:179)  at org.apache.maven.plugin.internal.DefaultMavenPluginManager.getMojoDescriptor(DefaultMavenPluginManager.java:284)  at org.apache.maven.plugin.DefaultBuildPluginManager.getMojoDescriptor(DefaultBuildPluginManager.java:241)  at org.apache.maven.lifecycle.internal.DefaultLifecycleExecutionPlanCalculator.setupMojoExecution(DefaultLifecycleExecutionPlanCalculator.java:169)  at org.apache.maven.lifecycle.internal.DefaultLifecycleExecutionPlanCalculator.setupMojoExecutions(DefaultLifecycleExecutionPlanCalculator.java:155)  at org.apache.maven.lifecycle.internal.DefaultLifecycleExecutionPlanCalculator.calculateExecutionPlan(DefaultLifecycleExecutionPlanCalculator.java:131)  at org.apache.maven.lifecycle.internal.DefaultLifecycleExecutionPlanCalculator.calculateExecutionPlan(DefaultLifecycleExecutionPlanCalculator.java:145)  at org.apache.maven.lifecycle.internal.builder.BuilderCommon.resolveBuildPlan(BuilderCommon.java:96)  at org.apache.maven.lifecycle.internal.LifecycleModuleBuilder.buildProject(LifecycleModuleBuilder.java:109)  at org.apache.maven.lifecycle.internal.LifecycleModuleBuilder.buildProject(LifecycleModuleBuilder.java:80)  at org.apache.maven.lifecycle.internal.builder.singlethreaded.SingleThreadedBuilder.build(SingleThreadedBuilder.java:51)  at org.apache.maven.lifecycle.internal.LifecycleStarter.execute(LifecycleStarter.java:128)  at org.apache.maven.DefaultMaven.doExecute(DefaultMaven.java:307)  at org.apache.maven.DefaultMaven.doExecute(DefaultMaven.java:193)  at org.apache.maven.DefaultMaven.execute(DefaultMaven.java:106)  at org.apache.maven.cli.MavenCli.execute(MavenCli.java:863)  at org.apache.maven.cli.MavenCli.doMain(MavenCli.java:288)  at org.apache.maven.cli.MavenCli.main(MavenCli.java:199)  at sun.reflect.NativeMethodAccessorImpl.invoke0(Native Method)  at sun.reflect.NativeMethodAccessorImpl.invoke(NativeMethodAccessorImpl.java:62)  at sun.reflect.DelegatingMethodAccessorImpl.invoke(DelegatingMethodAccessorImpl.java:43)  at java.lang.reflect.Method.invoke(Method.java:498)  at org.codehaus.plexus.classworlds.launcher.Launcher.launchEnhanced(Launcher.java:289)  at org.codehaus.plexus.classworlds.launcher.Launcher.launch(Launcher.java:229)  at org.codehaus.plexus.classworlds.launcher.Launcher.mainWithExitCode(Launcher.java:415)  at org.codehaus.plexus.classworlds.launcher.Launcher.main(Launcher.java:356) Caused by: org.eclipse.aether.resolution.ArtifactResolutionException: Could not find artifact org.openmrs.maven.plugins:openmrs-packager-maven-plugin:jar:1.5.0-SNAPSHOT  at org.eclipse.aether.internal.impl.DefaultArtifactResolver.resolve(DefaultArtifactResolver.java:444)  at org.eclipse.aether.internal.impl.DefaultArtifactResolver.resolveArtifacts(DefaultArtifactResolver.java:246)  at org.eclipse.aether.internal.impl.DefaultArtifactResolver.resolveArtifact(DefaultArtifactResolver.java:223)  at org.eclipse.aether.internal.impl.DefaultRepositorySystem.resolveArtifact(DefaultRepositorySystem.java:294)  at org.apache.maven.plugin.internal.DefaultPluginDependenciesResolver.resolve(DefaultPluginDependenciesResolver.java:124)  ... 26 more Caused by: org.eclipse.aether.transfer.ArtifactNotFoundException: Could not find artifact org.openmrs.maven.plugins:openmrs-packager-maven-plugin:jar:1.5.0-SNAPSHOT  at org.eclipse.aether.internal.impl.DefaultArtifactResolver.resolve(DefaultArtifactResolver.java:434)  ... 30 more [ERROR]  [ERROR]  [ERROR] For more information about the errors and possible solutions, please read the following articles: [ERROR] [Help 1] http://cwiki.apache.org/confluence/display/MAVEN/PluginResolutionException 
org.apache.maven.it.VerificationException: Exit code was non-zero: 1; command line and log = 
/usr/share/apache-maven-3.3.9/bin/mvn -N -X -e --batch-mode -Dmaven.repo.local=/home/bamboo-agent/.m2/repository org.apache.maven.plugins:maven-clean-plugin:clean install
Apache Maven 3.3.9 (bb52d8502b132ec0a5a3f4c09453c07478323dc5; 2015-11-10T16:41:47+00:00)
Maven home: /usr/share/apache-maven-3.3.9
Java version: 1.8.0_292, vendor: Private Build
Java home: /usr/lib/jvm/java-8-openjdk-amd64/jre
Default locale: en_US, platform encoding: UTF-8
(180 more lines...)
Collapse Failed CompileConfigurationsTest testJsonKeyValuesAreGenerated History
Default Job 3 secs
org.apache.maven.it.VerificationException: Exit code was non-zero: 1; command line and log =  /usr/share/apache-maven-3.3.9/bin/mvn -N -X -e --batch-mode -Dmaven.repo.local=/home/bamboo-agent/.m2/repository org.apache.maven.plugins:maven-clean-plugin:clean install Apache Maven 3.3.9 (bb52d8502b132ec0a5a3f4c09453c07478323dc5; 2015-11-10T16:41:47+00:00) Maven home: /usr/share/apache-maven-3.3.9 Java version: 1.8.0_292, vendor: Private Build Java home: /usr/lib/jvm/java-8-openjdk-amd64/jre Default locale: en_US, platform encoding: UTF-8 OS name: "linux", version: "4.4.0-210-generic", arch: "amd64", family: "unix" [DEBUG] Created new class realm maven.api [DEBUG] Importing foreign packages into class realm maven.api [DEBUG]   Imported: javax.enterprise.inject.* < plexus.core [DEBUG]   Imported: javax.enterprise.util.* < plexus.core [DEBUG]   Imported: javax.inject.* < plexus.core [DEBUG]   Imported: org.apache.maven.* < plexus.core [DEBUG]   Imported: org.apache.maven.artifact < plexus.core [DEBUG]   Imported: org.apache.maven.classrealm < plexus.core [DEBUG]   Imported: org.apache.maven.cli < plexus.core [DEBUG]   Imported: org.apache.maven.configuration < plexus.core [DEBUG]   Imported: org.apache.maven.exception < plexus.core [DEBUG]   Imported: org.apache.maven.execution < plexus.core [DEBUG]   Imported: org.apache.maven.execution.scope < plexus.core [DEBUG]   Imported: org.apache.maven.lifecycle < plexus.core [DEBUG]   Imported: org.apache.maven.model < plexus.core [DEBUG]   Imported: org.apache.maven.monitor < plexus.core [DEBUG]   Imported: org.apache.maven.plugin < plexus.core [DEBUG]   Imported: org.apache.maven.profiles < plexus.core [DEBUG]   Imported: org.apache.maven.project < plexus.core [DEBUG]   Imported: org.apache.maven.reporting < plexus.core [DEBUG]   Imported: org.apache.maven.repository < plexus.core [DEBUG]   Imported: org.apache.maven.rtinfo < plexus.core [DEBUG]   Imported: org.apache.maven.settings < plexus.core [DEBUG]   Imported: org.apache.maven.toolchain < plexus.core [DEBUG]   Imported: org.apache.maven.usability < plexus.core [DEBUG]   Imported: org.apache.maven.wagon.* < plexus.core [DEBUG]   Imported: org.apache.maven.wagon.authentication < plexus.core [DEBUG]   Imported: org.apache.maven.wagon.authorization < plexus.core [DEBUG]   Imported: org.apache.maven.wagon.events < plexus.core [DEBUG]   Imported: org.apache.maven.wagon.observers < plexus.core [DEBUG]   Imported: org.apache.maven.wagon.proxy < plexus.core [DEBUG]   Imported: org.apache.maven.wagon.repository < plexus.core [DEBUG]   Imported: org.apache.maven.wagon.resource < plexus.core [DEBUG]   Imported: org.codehaus.classworlds < plexus.core [DEBUG]   Imported: org.codehaus.plexus.* < plexus.core [DEBUG]   Imported: org.codehaus.plexus.classworlds < plexus.core [DEBUG]   Imported: org.codehaus.plexus.component < plexus.core [DEBUG]   Imported: org.codehaus.plexus.configuration < plexus.core [DEBUG]   Imported: org.codehaus.plexus.container < plexus.core [DEBUG]   Imported: org.codehaus.plexus.context < plexus.core [DEBUG]   Imported: org.codehaus.plexus.lifecycle < plexus.core [DEBUG]   Imported: org.codehaus.plexus.logging < plexus.core [DEBUG]   Imported: org.codehaus.plexus.personality < plexus.core [DEBUG]   Imported: org.codehaus.plexus.util.xml.Xpp3Dom < plexus.core [DEBUG]   Imported: org.codehaus.plexus.util.xml.pull.XmlPullParser < plexus.core [DEBUG]   Imported: org.codehaus.plexus.util.xml.pull.XmlPullParserException < plexus.core [DEBUG]   Imported: org.codehaus.plexus.util.xml.pull.XmlSerializer < plexus.core [DEBUG]   Imported: org.eclipse.aether.* < plexus.core [DEBUG]   Imported: org.eclipse.aether.artifact < plexus.core [DEBUG]   Imported: org.eclipse.aether.collection < plexus.core [DEBUG]   Imported: org.eclipse.aether.deployment < plexus.core [DEBUG]   Imported: org.eclipse.aether.graph < plexus.core [DEBUG]   Imported: org.eclipse.aether.impl < plexus.core [DEBUG]   Imported: org.eclipse.aether.installation < plexus.core [DEBUG]   Imported: org.eclipse.aether.internal.impl < plexus.core [DEBUG]   Imported: org.eclipse.aether.metadata < plexus.core [DEBUG]   Imported: org.eclipse.aether.repository < plexus.core [DEBUG]   Imported: org.eclipse.aether.resolution < plexus.core [DEBUG]   Imported: org.eclipse.aether.spi < plexus.core [DEBUG]   Imported: org.eclipse.aether.transfer < plexus.core [DEBUG]   Imported: org.eclipse.aether.version < plexus.core [DEBUG]   Imported: org.slf4j.* < plexus.core [DEBUG]   Imported: org.slf4j.helpers.* < plexus.core [DEBUG]   Imported: org.slf4j.spi.* < plexus.core [DEBUG] Populating class realm maven.api [INFO] Error stacktraces are turned on. [DEBUG] Reading global settings from /usr/share/apache-maven-3.3.9/conf/settings.xml [DEBUG] Reading user settings from /home/bamboo-agent/.m2/settings.xml [DEBUG] Reading global toolchains from /usr/share/apache-maven-3.3.9/conf/toolchains.xml [DEBUG] Reading user toolchains from /home/bamboo-agent/.m2/toolchains.xml [DEBUG] Using local repository at /home/bamboo-agent/.m2/repository [DEBUG] Using manager EnhancedLocalRepositoryManager with priority 10.0 for /home/bamboo-agent/.m2/repository [INFO] Scanning for projects... [DEBUG] Extension realms for project org.openmrs.maven.plugins:openmrs-packager-maven-plugin-config-test-parent:pom:1.0.0-SNAPSHOT: (none) [DEBUG] Looking up lifecyle mappings for packaging pom from ClassRealm[plexus.core, parent: null] [DEBUG] === REACTOR BUILD PLAN ================================================ [DEBUG] Project: org.openmrs.maven.plugins:openmrs-packager-maven-plugin-config-test-parent:pom:1.0.0-SNAPSHOT [DEBUG] Tasks:   [org.apache.maven.plugins:maven-clean-plugin:clean, install] [DEBUG] Style:   Regular [DEBUG] ======================================================================= [INFO]                                                                          [INFO] ------------------------------------------------------------------------ [INFO] Building OpenMRS config parent test 1.0.0-SNAPSHOT [INFO] ------------------------------------------------------------------------ [DEBUG] Lifecycle default -> [validate, initialize, generate-sources, process-sources, generate-resources, process-resources, compile, process-classes, generate-test-sources, process-test-sources, generate-test-resources, process-test-resources, test-compile, process-test-classes, test, prepare-package, package, pre-integration-test, integration-test, post-integration-test, verify, install, deploy] [DEBUG] Lifecycle clean -> [pre-clean, clean, post-clean] [DEBUG] Lifecycle site -> [pre-site, site, post-site, site-deploy] [DEBUG] Could not find metadata org.openmrs.maven.plugins:openmrs-packager-maven-plugin:1.5.0-SNAPSHOT/maven-metadata.xml in local (/home/bamboo-agent/.m2/repository) [DEBUG] Could not find metadata org.openmrs.maven.plugins:openmrs-packager-maven-plugin:1.5.0-SNAPSHOT/maven-metadata.xml in local (/home/bamboo-agent/.m2/repository) [WARNING] The POM for org.openmrs.maven.plugins:openmrs-packager-maven-plugin:jar:1.5.0-SNAPSHOT is missing, no dependency information available [INFO] ------------------------------------------------------------------------ [INFO] BUILD FAILURE [INFO] ------------------------------------------------------------------------ [INFO] Total time: 0.197 s [INFO] Finished at: 2021-07-06T07:20:00+00:00 [INFO] Final Memory: 7M/106M [INFO] ------------------------------------------------------------------------ [ERROR] Plugin org.openmrs.maven.plugins:openmrs-packager-maven-plugin:1.5.0-SNAPSHOT or one of its dependencies could not be resolved: Could not find artifact org.openmrs.maven.plugins:openmrs-packager-maven-plugin:jar:1.5.0-SNAPSHOT -> [Help 1] org.apache.maven.plugin.PluginResolutionException: Plugin org.openmrs.maven.plugins:openmrs-packager-maven-plugin:1.5.0-SNAPSHOT or one of its dependencies could not be resolved: Could not find artifact org.openmrs.maven.plugins:openmrs-packager-maven-plugin:jar:1.5.0-SNAPSHOT  at org.apache.maven.plugin.internal.DefaultPluginDependenciesResolver.resolve(DefaultPluginDependenciesResolver.java:128)  at org.apache.maven.plugin.internal.DefaultMavenPluginManager.getPluginDescriptor(DefaultMavenPluginManager.java:179)  at org.apache.maven.plugin.internal.DefaultMavenPluginManager.getMojoDescriptor(DefaultMavenPluginManager.java:284)  at org.apache.maven.plugin.DefaultBuildPluginManager.getMojoDescriptor(DefaultBuildPluginManager.java:241)  at org.apache.maven.lifecycle.internal.DefaultLifecycleExecutionPlanCalculator.setupMojoExecution(DefaultLifecycleExecutionPlanCalculator.java:169)  at org.apache.maven.lifecycle.internal.DefaultLifecycleExecutionPlanCalculator.setupMojoExecutions(DefaultLifecycleExecutionPlanCalculator.java:155)  at org.apache.maven.lifecycle.internal.DefaultLifecycleExecutionPlanCalculator.calculateExecutionPlan(DefaultLifecycleExecutionPlanCalculator.java:131)  at org.apache.maven.lifecycle.internal.DefaultLifecycleExecutionPlanCalculator.calculateExecutionPlan(DefaultLifecycleExecutionPlanCalculator.java:145)  at org.apache.maven.lifecycle.internal.builder.BuilderCommon.resolveBuildPlan(BuilderCommon.java:96)  at org.apache.maven.lifecycle.internal.LifecycleModuleBuilder.buildProject(LifecycleModuleBuilder.java:109)  at org.apache.maven.lifecycle.internal.LifecycleModuleBuilder.buildProject(LifecycleModuleBuilder.java:80)  at org.apache.maven.lifecycle.internal.builder.singlethreaded.SingleThreadedBuilder.build(SingleThreadedBuilder.java:51)  at org.apache.maven.lifecycle.internal.LifecycleStarter.execute(LifecycleStarter.java:128)  at org.apache.maven.DefaultMaven.doExecute(DefaultMaven.java:307)  at org.apache.maven.DefaultMaven.doExecute(DefaultMaven.java:193)  at org.apache.maven.DefaultMaven.execute(DefaultMaven.java:106)  at org.apache.maven.cli.MavenCli.execute(MavenCli.java:863)  at org.apache.maven.cli.MavenCli.doMain(MavenCli.java:288)  at org.apache.maven.cli.MavenCli.main(MavenCli.java:199)  at sun.reflect.NativeMethodAccessorImpl.invoke0(Native Method)  at sun.reflect.NativeMethodAccessorImpl.invoke(NativeMethodAccessorImpl.java:62)  at sun.reflect.DelegatingMethodAccessorImpl.invoke(DelegatingMethodAccessorImpl.java:43)  at java.lang.reflect.Method.invoke(Method.java:498)  at org.codehaus.plexus.classworlds.launcher.Launcher.launchEnhanced(Launcher.java:289)  at org.codehaus.plexus.classworlds.launcher.Launcher.launch(Launcher.java:229)  at org.codehaus.plexus.classworlds.launcher.Launcher.mainWithExitCode(Launcher.java:415)  at org.codehaus.plexus.classworlds.launcher.Launcher.main(Launcher.java:356) Caused by: org.eclipse.aether.resolution.ArtifactResolutionException: Could not find artifact org.openmrs.maven.plugins:openmrs-packager-maven-plugin:jar:1.5.0-SNAPSHOT  at org.eclipse.aether.internal.impl.DefaultArtifactResolver.resolve(DefaultArtifactResolver.java:444)  at org.eclipse.aether.internal.impl.DefaultArtifactResolver.resolveArtifacts(DefaultArtifactResolver.java:246)  at org.eclipse.aether.internal.impl.DefaultArtifactResolver.resolveArtifact(DefaultArtifactResolver.java:223)  at org.eclipse.aether.internal.impl.DefaultRepositorySystem.resolveArtifact(DefaultRepositorySystem.java:294)  at org.apache.maven.plugin.internal.DefaultPluginDependenciesResolver.resolve(DefaultPluginDependenciesResolver.java:124)  ... 26 more Caused by: org.eclipse.aether.transfer.ArtifactNotFoundException: Could not find artifact org.openmrs.maven.plugins:openmrs-packager-maven-plugin:jar:1.5.0-SNAPSHOT  at org.eclipse.aether.internal.impl.DefaultArtifactResolver.resolve(DefaultArtifactResolver.java:434)  ... 30 more [ERROR]  [ERROR]  [ERROR] For more information about the errors and possible solutions, please read the following articles: [ERROR] [Help 1] http://cwiki.apache.org/confluence/display/MAVEN/PluginResolutionException 
org.apache.maven.it.VerificationException: Exit code was non-zero: 1; command line and log = 
/usr/share/apache-maven-3.3.9/bin/mvn -N -X -e --batch-mode -Dmaven.repo.local=/home/bamboo-agent/.m2/repository org.apache.maven.plugins:maven-clean-plugin:clean install
Apache Maven 3.3.9 (bb52d8502b132ec0a5a3f4c09453c07478323dc5; 2015-11-10T16:41:47+00:00)
Maven home: /usr/share/apache-maven-3.3.9
Java version: 1.8.0_292, vendor: Private Build
Java home: /usr/lib/jvm/java-8-openjdk-amd64/jre
Default locale: en_US, platform encoding: UTF-8
(180 more lines...)
Collapse Failed CompileConfigurationsTest testDependenciesAreMerged History
Default Job 3 secs
org.apache.maven.it.VerificationException: Exit code was non-zero: 1; command line and log =  /usr/share/apache-maven-3.3.9/bin/mvn -N -X -e --batch-mode -Dmaven.repo.local=/home/bamboo-agent/.m2/repository org.apache.maven.plugins:maven-clean-plugin:clean install Apache Maven 3.3.9 (bb52d8502b132ec0a5a3f4c09453c07478323dc5; 2015-11-10T16:41:47+00:00) Maven home: /usr/share/apache-maven-3.3.9 Java version: 1.8.0_292, vendor: Private Build Java home: /usr/lib/jvm/java-8-openjdk-amd64/jre Default locale: en_US, platform encoding: UTF-8 OS name: "linux", version: "4.4.0-210-generic", arch: "amd64", family: "unix" [DEBUG] Created new class realm maven.api [DEBUG] Importing foreign packages into class realm maven.api [DEBUG]   Imported: javax.enterprise.inject.* < plexus.core [DEBUG]   Imported: javax.enterprise.util.* < plexus.core [DEBUG]   Imported: javax.inject.* < plexus.core [DEBUG]   Imported: org.apache.maven.* < plexus.core [DEBUG]   Imported: org.apache.maven.artifact < plexus.core [DEBUG]   Imported: org.apache.maven.classrealm < plexus.core [DEBUG]   Imported: org.apache.maven.cli < plexus.core [DEBUG]   Imported: org.apache.maven.configuration < plexus.core [DEBUG]   Imported: org.apache.maven.exception < plexus.core [DEBUG]   Imported: org.apache.maven.execution < plexus.core [DEBUG]   Imported: org.apache.maven.execution.scope < plexus.core [DEBUG]   Imported: org.apache.maven.lifecycle < plexus.core [DEBUG]   Imported: org.apache.maven.model < plexus.core [DEBUG]   Imported: org.apache.maven.monitor < plexus.core [DEBUG]   Imported: org.apache.maven.plugin < plexus.core [DEBUG]   Imported: org.apache.maven.profiles < plexus.core [DEBUG]   Imported: org.apache.maven.project < plexus.core [DEBUG]   Imported: org.apache.maven.reporting < plexus.core [DEBUG]   Imported: org.apache.maven.repository < plexus.core [DEBUG]   Imported: org.apache.maven.rtinfo < plexus.core [DEBUG]   Imported: org.apache.maven.settings < plexus.core [DEBUG]   Imported: org.apache.maven.toolchain < plexus.core [DEBUG]   Imported: org.apache.maven.usability < plexus.core [DEBUG]   Imported: org.apache.maven.wagon.* < plexus.core [DEBUG]   Imported: org.apache.maven.wagon.authentication < plexus.core [DEBUG]   Imported: org.apache.maven.wagon.authorization < plexus.core [DEBUG]   Imported: org.apache.maven.wagon.events < plexus.core [DEBUG]   Imported: org.apache.maven.wagon.observers < plexus.core [DEBUG]   Imported: org.apache.maven.wagon.proxy < plexus.core [DEBUG]   Imported: org.apache.maven.wagon.repository < plexus.core [DEBUG]   Imported: org.apache.maven.wagon.resource < plexus.core [DEBUG]   Imported: org.codehaus.classworlds < plexus.core [DEBUG]   Imported: org.codehaus.plexus.* < plexus.core [DEBUG]   Imported: org.codehaus.plexus.classworlds < plexus.core [DEBUG]   Imported: org.codehaus.plexus.component < plexus.core [DEBUG]   Imported: org.codehaus.plexus.configuration < plexus.core [DEBUG]   Imported: org.codehaus.plexus.container < plexus.core [DEBUG]   Imported: org.codehaus.plexus.context < plexus.core [DEBUG]   Imported: org.codehaus.plexus.lifecycle < plexus.core [DEBUG]   Imported: org.codehaus.plexus.logging < plexus.core [DEBUG]   Imported: org.codehaus.plexus.personality < plexus.core [DEBUG]   Imported: org.codehaus.plexus.util.xml.Xpp3Dom < plexus.core [DEBUG]   Imported: org.codehaus.plexus.util.xml.pull.XmlPullParser < plexus.core [DEBUG]   Imported: org.codehaus.plexus.util.xml.pull.XmlPullParserException < plexus.core [DEBUG]   Imported: org.codehaus.plexus.util.xml.pull.XmlSerializer < plexus.core [DEBUG]   Imported: org.eclipse.aether.* < plexus.core [DEBUG]   Imported: org.eclipse.aether.artifact < plexus.core [DEBUG]   Imported: org.eclipse.aether.collection < plexus.core [DEBUG]   Imported: org.eclipse.aether.deployment < plexus.core [DEBUG]   Imported: org.eclipse.aether.graph < plexus.core [DEBUG]   Imported: org.eclipse.aether.impl < plexus.core [DEBUG]   Imported: org.eclipse.aether.installation < plexus.core [DEBUG]   Imported: org.eclipse.aether.internal.impl < plexus.core [DEBUG]   Imported: org.eclipse.aether.metadata < plexus.core [DEBUG]   Imported: org.eclipse.aether.repository < plexus.core [DEBUG]   Imported: org.eclipse.aether.resolution < plexus.core [DEBUG]   Imported: org.eclipse.aether.spi < plexus.core [DEBUG]   Imported: org.eclipse.aether.transfer < plexus.core [DEBUG]   Imported: org.eclipse.aether.version < plexus.core [DEBUG]   Imported: org.slf4j.* < plexus.core [DEBUG]   Imported: org.slf4j.helpers.* < plexus.core [DEBUG]   Imported: org.slf4j.spi.* < plexus.core [DEBUG] Populating class realm maven.api [INFO] Error stacktraces are turned on. [DEBUG] Reading global settings from /usr/share/apache-maven-3.3.9/conf/settings.xml [DEBUG] Reading user settings from /home/bamboo-agent/.m2/settings.xml [DEBUG] Reading global toolchains from /usr/share/apache-maven-3.3.9/conf/toolchains.xml [DEBUG] Reading user toolchains from /home/bamboo-agent/.m2/toolchains.xml [DEBUG] Using local repository at /home/bamboo-agent/.m2/repository [DEBUG] Using manager EnhancedLocalRepositoryManager with priority 10.0 for /home/bamboo-agent/.m2/repository [INFO] Scanning for projects... [DEBUG] Extension realms for project org.openmrs.maven.plugins:openmrs-packager-maven-plugin-config-test-parent:pom:1.0.0-SNAPSHOT: (none) [DEBUG] Looking up lifecyle mappings for packaging pom from ClassRealm[plexus.core, parent: null] [DEBUG] === REACTOR BUILD PLAN ================================================ [DEBUG] Project: org.openmrs.maven.plugins:openmrs-packager-maven-plugin-config-test-parent:pom:1.0.0-SNAPSHOT [DEBUG] Tasks:   [org.apache.maven.plugins:maven-clean-plugin:clean, install] [DEBUG] Style:   Regular [DEBUG] ======================================================================= [INFO]                                                                          [INFO] ------------------------------------------------------------------------ [INFO] Building OpenMRS config parent test 1.0.0-SNAPSHOT [INFO] ------------------------------------------------------------------------ [DEBUG] Lifecycle default -> [validate, initialize, generate-sources, process-sources, generate-resources, process-resources, compile, process-classes, generate-test-sources, process-test-sources, generate-test-resources, process-test-resources, test-compile, process-test-classes, test, prepare-package, package, pre-integration-test, integration-test, post-integration-test, verify, install, deploy] [DEBUG] Lifecycle clean -> [pre-clean, clean, post-clean] [DEBUG] Lifecycle site -> [pre-site, site, post-site, site-deploy] [DEBUG] Could not find metadata org.openmrs.maven.plugins:openmrs-packager-maven-plugin:1.5.0-SNAPSHOT/maven-metadata.xml in local (/home/bamboo-agent/.m2/repository) [DEBUG] Could not find metadata org.openmrs.maven.plugins:openmrs-packager-maven-plugin:1.5.0-SNAPSHOT/maven-metadata.xml in local (/home/bamboo-agent/.m2/repository) [WARNING] The POM for org.openmrs.maven.plugins:openmrs-packager-maven-plugin:jar:1.5.0-SNAPSHOT is missing, no dependency information available [INFO] ------------------------------------------------------------------------ [INFO] BUILD FAILURE [INFO] ------------------------------------------------------------------------ [INFO] Total time: 0.152 s [INFO] Finished at: 2021-07-06T07:20:10+00:00 [INFO] Final Memory: 7M/106M [INFO] ------------------------------------------------------------------------ [ERROR] Plugin org.openmrs.maven.plugins:openmrs-packager-maven-plugin:1.5.0-SNAPSHOT or one of its dependencies could not be resolved: Could not find artifact org.openmrs.maven.plugins:openmrs-packager-maven-plugin:jar:1.5.0-SNAPSHOT -> [Help 1] org.apache.maven.plugin.PluginResolutionException: Plugin org.openmrs.maven.plugins:openmrs-packager-maven-plugin:1.5.0-SNAPSHOT or one of its dependencies could not be resolved: Could not find artifact org.openmrs.maven.plugins:openmrs-packager-maven-plugin:jar:1.5.0-SNAPSHOT  at org.apache.maven.plugin.internal.DefaultPluginDependenciesResolver.resolve(DefaultPluginDependenciesResolver.java:128)  at org.apache.maven.plugin.internal.DefaultMavenPluginManager.getPluginDescriptor(DefaultMavenPluginManager.java:179)  at org.apache.maven.plugin.internal.DefaultMavenPluginManager.getMojoDescriptor(DefaultMavenPluginManager.java:284)  at org.apache.maven.plugin.DefaultBuildPluginManager.getMojoDescriptor(DefaultBuildPluginManager.java:241)  at org.apache.maven.lifecycle.internal.DefaultLifecycleExecutionPlanCalculator.setupMojoExecution(DefaultLifecycleExecutionPlanCalculator.java:169)  at org.apache.maven.lifecycle.internal.DefaultLifecycleExecutionPlanCalculator.setupMojoExecutions(DefaultLifecycleExecutionPlanCalculator.java:155)  at org.apache.maven.lifecycle.internal.DefaultLifecycleExecutionPlanCalculator.calculateExecutionPlan(DefaultLifecycleExecutionPlanCalculator.java:131)  at org.apache.maven.lifecycle.internal.DefaultLifecycleExecutionPlanCalculator.calculateExecutionPlan(DefaultLifecycleExecutionPlanCalculator.java:145)  at org.apache.maven.lifecycle.internal.builder.BuilderCommon.resolveBuildPlan(BuilderCommon.java:96)  at org.apache.maven.lifecycle.internal.LifecycleModuleBuilder.buildProject(LifecycleModuleBuilder.java:109)  at org.apache.maven.lifecycle.internal.LifecycleModuleBuilder.buildProject(LifecycleModuleBuilder.java:80)  at org.apache.maven.lifecycle.internal.builder.singlethreaded.SingleThreadedBuilder.build(SingleThreadedBuilder.java:51)  at org.apache.maven.lifecycle.internal.LifecycleStarter.execute(LifecycleStarter.java:128)  at org.apache.maven.DefaultMaven.doExecute(DefaultMaven.java:307)  at org.apache.maven.DefaultMaven.doExecute(DefaultMaven.java:193)  at org.apache.maven.DefaultMaven.execute(DefaultMaven.java:106)  at org.apache.maven.cli.MavenCli.execute(MavenCli.java:863)  at org.apache.maven.cli.MavenCli.doMain(MavenCli.java:288)  at org.apache.maven.cli.MavenCli.main(MavenCli.java:199)  at sun.reflect.NativeMethodAccessorImpl.invoke0(Native Method)  at sun.reflect.NativeMethodAccessorImpl.invoke(NativeMethodAccessorImpl.java:62)  at sun.reflect.DelegatingMethodAccessorImpl.invoke(DelegatingMethodAccessorImpl.java:43)  at java.lang.reflect.Method.invoke(Method.java:498)  at org.codehaus.plexus.classworlds.launcher.Launcher.launchEnhanced(Launcher.java:289)  at org.codehaus.plexus.classworlds.launcher.Launcher.launch(Launcher.java:229)  at org.codehaus.plexus.classworlds.launcher.Launcher.mainWithExitCode(Launcher.java:415)  at org.codehaus.plexus.classworlds.launcher.Launcher.main(Launcher.java:356) Caused by: org.eclipse.aether.resolution.ArtifactResolutionException: Could not find artifact org.openmrs.maven.plugins:openmrs-packager-maven-plugin:jar:1.5.0-SNAPSHOT  at org.eclipse.aether.internal.impl.DefaultArtifactResolver.resolve(DefaultArtifactResolver.java:444)  at org.eclipse.aether.internal.impl.DefaultArtifactResolver.resolveArtifacts(DefaultArtifactResolver.java:246)  at org.eclipse.aether.internal.impl.DefaultArtifactResolver.resolveArtifact(DefaultArtifactResolver.java:223)  at org.eclipse.aether.internal.impl.DefaultRepositorySystem.resolveArtifact(DefaultRepositorySystem.java:294)  at org.apache.maven.plugin.internal.DefaultPluginDependenciesResolver.resolve(DefaultPluginDependenciesResolver.java:124)  ... 26 more Caused by: org.eclipse.aether.transfer.ArtifactNotFoundException: Could not find artifact org.openmrs.maven.plugins:openmrs-packager-maven-plugin:jar:1.5.0-SNAPSHOT  at org.eclipse.aether.internal.impl.DefaultArtifactResolver.resolve(DefaultArtifactResolver.java:434)  ... 30 more [ERROR]  [ERROR]  [ERROR] For more information about the errors and possible solutions, please read the following articles: [ERROR] [Help 1] http://cwiki.apache.org/confluence/display/MAVEN/PluginResolutionException 
org.apache.maven.it.VerificationException: Exit code was non-zero: 1; command line and log = 
/usr/share/apache-maven-3.3.9/bin/mvn -N -X -e --batch-mode -Dmaven.repo.local=/home/bamboo-agent/.m2/repository org.apache.maven.plugins:maven-clean-plugin:clean install
Apache Maven 3.3.9 (bb52d8502b132ec0a5a3f4c09453c07478323dc5; 2015-11-10T16:41:47+00:00)
Maven home: /usr/share/apache-maven-3.3.9
Java version: 1.8.0_292, vendor: Private Build
Java home: /usr/lib/jvm/java-8-openjdk-amd64/jre
Default locale: en_US, platform encoding: UTF-8
(180 more lines...)
Collapse Failed CompileConfigurationsTest filesAreOverwritten History
Default Job 3 secs
org.apache.maven.it.VerificationException: Exit code was non-zero: 1; command line and log =  /usr/share/apache-maven-3.3.9/bin/mvn -N -X -e --batch-mode -Dmaven.repo.local=/home/bamboo-agent/.m2/repository org.apache.maven.plugins:maven-clean-plugin:clean install Apache Maven 3.3.9 (bb52d8502b132ec0a5a3f4c09453c07478323dc5; 2015-11-10T16:41:47+00:00) Maven home: /usr/share/apache-maven-3.3.9 Java version: 1.8.0_292, vendor: Private Build Java home: /usr/lib/jvm/java-8-openjdk-amd64/jre Default locale: en_US, platform encoding: UTF-8 OS name: "linux", version: "4.4.0-210-generic", arch: "amd64", family: "unix" [DEBUG] Created new class realm maven.api [DEBUG] Importing foreign packages into class realm maven.api [DEBUG]   Imported: javax.enterprise.inject.* < plexus.core [DEBUG]   Imported: javax.enterprise.util.* < plexus.core [DEBUG]   Imported: javax.inject.* < plexus.core [DEBUG]   Imported: org.apache.maven.* < plexus.core [DEBUG]   Imported: org.apache.maven.artifact < plexus.core [DEBUG]   Imported: org.apache.maven.classrealm < plexus.core [DEBUG]   Imported: org.apache.maven.cli < plexus.core [DEBUG]   Imported: org.apache.maven.configuration < plexus.core [DEBUG]   Imported: org.apache.maven.exception < plexus.core [DEBUG]   Imported: org.apache.maven.execution < plexus.core [DEBUG]   Imported: org.apache.maven.execution.scope < plexus.core [DEBUG]   Imported: org.apache.maven.lifecycle < plexus.core [DEBUG]   Imported: org.apache.maven.model < plexus.core [DEBUG]   Imported: org.apache.maven.monitor < plexus.core [DEBUG]   Imported: org.apache.maven.plugin < plexus.core [DEBUG]   Imported: org.apache.maven.profiles < plexus.core [DEBUG]   Imported: org.apache.maven.project < plexus.core [DEBUG]   Imported: org.apache.maven.reporting < plexus.core [DEBUG]   Imported: org.apache.maven.repository < plexus.core [DEBUG]   Imported: org.apache.maven.rtinfo < plexus.core [DEBUG]   Imported: org.apache.maven.settings < plexus.core [DEBUG]   Imported: org.apache.maven.toolchain < plexus.core [DEBUG]   Imported: org.apache.maven.usability < plexus.core [DEBUG]   Imported: org.apache.maven.wagon.* < plexus.core [DEBUG]   Imported: org.apache.maven.wagon.authentication < plexus.core [DEBUG]   Imported: org.apache.maven.wagon.authorization < plexus.core [DEBUG]   Imported: org.apache.maven.wagon.events < plexus.core [DEBUG]   Imported: org.apache.maven.wagon.observers < plexus.core [DEBUG]   Imported: org.apache.maven.wagon.proxy < plexus.core [DEBUG]   Imported: org.apache.maven.wagon.repository < plexus.core [DEBUG]   Imported: org.apache.maven.wagon.resource < plexus.core [DEBUG]   Imported: org.codehaus.classworlds < plexus.core [DEBUG]   Imported: org.codehaus.plexus.* < plexus.core [DEBUG]   Imported: org.codehaus.plexus.classworlds < plexus.core [DEBUG]   Imported: org.codehaus.plexus.component < plexus.core [DEBUG]   Imported: org.codehaus.plexus.configuration < plexus.core [DEBUG]   Imported: org.codehaus.plexus.container < plexus.core [DEBUG]   Imported: org.codehaus.plexus.context < plexus.core [DEBUG]   Imported: org.codehaus.plexus.lifecycle < plexus.core [DEBUG]   Imported: org.codehaus.plexus.logging < plexus.core [DEBUG]   Imported: org.codehaus.plexus.personality < plexus.core [DEBUG]   Imported: org.codehaus.plexus.util.xml.Xpp3Dom < plexus.core [DEBUG]   Imported: org.codehaus.plexus.util.xml.pull.XmlPullParser < plexus.core [DEBUG]   Imported: org.codehaus.plexus.util.xml.pull.XmlPullParserException < plexus.core [DEBUG]   Imported: org.codehaus.plexus.util.xml.pull.XmlSerializer < plexus.core [DEBUG]   Imported: org.eclipse.aether.* < plexus.core [DEBUG]   Imported: org.eclipse.aether.artifact < plexus.core [DEBUG]   Imported: org.eclipse.aether.collection < plexus.core [DEBUG]   Imported: org.eclipse.aether.deployment < plexus.core [DEBUG]   Imported: org.eclipse.aether.graph < plexus.core [DEBUG]   Imported: org.eclipse.aether.impl < plexus.core [DEBUG]   Imported: org.eclipse.aether.installation < plexus.core [DEBUG]   Imported: org.eclipse.aether.internal.impl < plexus.core [DEBUG]   Imported: org.eclipse.aether.metadata < plexus.core [DEBUG]   Imported: org.eclipse.aether.repository < plexus.core [DEBUG]   Imported: org.eclipse.aether.resolution < plexus.core [DEBUG]   Imported: org.eclipse.aether.spi < plexus.core [DEBUG]   Imported: org.eclipse.aether.transfer < plexus.core [DEBUG]   Imported: org.eclipse.aether.version < plexus.core [DEBUG]   Imported: org.slf4j.* < plexus.core [DEBUG]   Imported: org.slf4j.helpers.* < plexus.core [DEBUG]   Imported: org.slf4j.spi.* < plexus.core [DEBUG] Populating class realm maven.api [INFO] Error stacktraces are turned on. [DEBUG] Reading global settings from /usr/share/apache-maven-3.3.9/conf/settings.xml [DEBUG] Reading user settings from /home/bamboo-agent/.m2/settings.xml [DEBUG] Reading global toolchains from /usr/share/apache-maven-3.3.9/conf/toolchains.xml [DEBUG] Reading user toolchains from /home/bamboo-agent/.m2/toolchains.xml [DEBUG] Using local repository at /home/bamboo-agent/.m2/repository [DEBUG] Using manager EnhancedLocalRepositoryManager with priority 10.0 for /home/bamboo-agent/.m2/repository [INFO] Scanning for projects... [DEBUG] Extension realms for project org.openmrs.maven.plugins:openmrs-packager-maven-plugin-config-test-parent:pom:1.0.0-SNAPSHOT: (none) [DEBUG] Looking up lifecyle mappings for packaging pom from ClassRealm[plexus.core, parent: null] [DEBUG] === REACTOR BUILD PLAN ================================================ [DEBUG] Project: org.openmrs.maven.plugins:openmrs-packager-maven-plugin-config-test-parent:pom:1.0.0-SNAPSHOT [DEBUG] Tasks:   [org.apache.maven.plugins:maven-clean-plugin:clean, install] [DEBUG] Style:   Regular [DEBUG] ======================================================================= [INFO]                                                                          [INFO] ------------------------------------------------------------------------ [INFO] Building OpenMRS config parent test 1.0.0-SNAPSHOT [INFO] ------------------------------------------------------------------------ [DEBUG] Lifecycle default -> [validate, initialize, generate-sources, process-sources, generate-resources, process-resources, compile, process-classes, generate-test-sources, process-test-sources, generate-test-resources, process-test-resources, test-compile, process-test-classes, test, prepare-package, package, pre-integration-test, integration-test, post-integration-test, verify, install, deploy] [DEBUG] Lifecycle clean -> [pre-clean, clean, post-clean] [DEBUG] Lifecycle site -> [pre-site, site, post-site, site-deploy] [DEBUG] Could not find metadata org.openmrs.maven.plugins:openmrs-packager-maven-plugin:1.5.0-SNAPSHOT/maven-metadata.xml in local (/home/bamboo-agent/.m2/repository) [DEBUG] Could not find metadata org.openmrs.maven.plugins:openmrs-packager-maven-plugin:1.5.0-SNAPSHOT/maven-metadata.xml in local (/home/bamboo-agent/.m2/repository) [WARNING] The POM for org.openmrs.maven.plugins:openmrs-packager-maven-plugin:jar:1.5.0-SNAPSHOT is missing, no dependency information available [INFO] ------------------------------------------------------------------------ [INFO] BUILD FAILURE [INFO] ------------------------------------------------------------------------ [INFO] Total time: 0.196 s [INFO] Finished at: 2021-07-06T07:19:56+00:00 [INFO] Final Memory: 7M/106M [INFO] ------------------------------------------------------------------------ [ERROR] Plugin org.openmrs.maven.plugins:openmrs-packager-maven-plugin:1.5.0-SNAPSHOT or one of its dependencies could not be resolved: Could not find artifact org.openmrs.maven.plugins:openmrs-packager-maven-plugin:jar:1.5.0-SNAPSHOT -> [Help 1] org.apache.maven.plugin.PluginResolutionException: Plugin org.openmrs.maven.plugins:openmrs-packager-maven-plugin:1.5.0-SNAPSHOT or one of its dependencies could not be resolved: Could not find artifact org.openmrs.maven.plugins:openmrs-packager-maven-plugin:jar:1.5.0-SNAPSHOT  at org.apache.maven.plugin.internal.DefaultPluginDependenciesResolver.resolve(DefaultPluginDependenciesResolver.java:128)  at org.apache.maven.plugin.internal.DefaultMavenPluginManager.getPluginDescriptor(DefaultMavenPluginManager.java:179)  at org.apache.maven.plugin.internal.DefaultMavenPluginManager.getMojoDescriptor(DefaultMavenPluginManager.java:284)  at org.apache.maven.plugin.DefaultBuildPluginManager.getMojoDescriptor(DefaultBuildPluginManager.java:241)  at org.apache.maven.lifecycle.internal.DefaultLifecycleExecutionPlanCalculator.setupMojoExecution(DefaultLifecycleExecutionPlanCalculator.java:169)  at org.apache.maven.lifecycle.internal.DefaultLifecycleExecutionPlanCalculator.setupMojoExecutions(DefaultLifecycleExecutionPlanCalculator.java:155)  at org.apache.maven.lifecycle.internal.DefaultLifecycleExecutionPlanCalculator.calculateExecutionPlan(DefaultLifecycleExecutionPlanCalculator.java:131)  at org.apache.maven.lifecycle.internal.DefaultLifecycleExecutionPlanCalculator.calculateExecutionPlan(DefaultLifecycleExecutionPlanCalculator.java:145)  at org.apache.maven.lifecycle.internal.builder.BuilderCommon.resolveBuildPlan(BuilderCommon.java:96)  at org.apache.maven.lifecycle.internal.LifecycleModuleBuilder.buildProject(LifecycleModuleBuilder.java:109)  at org.apache.maven.lifecycle.internal.LifecycleModuleBuilder.buildProject(LifecycleModuleBuilder.java:80)  at org.apache.maven.lifecycle.internal.builder.singlethreaded.SingleThreadedBuilder.build(SingleThreadedBuilder.java:51)  at org.apache.maven.lifecycle.internal.LifecycleStarter.execute(LifecycleStarter.java:128)  at org.apache.maven.DefaultMaven.doExecute(DefaultMaven.java:307)  at org.apache.maven.DefaultMaven.doExecute(DefaultMaven.java:193)  at org.apache.maven.DefaultMaven.execute(DefaultMaven.java:106)  at org.apache.maven.cli.MavenCli.execute(MavenCli.java:863)  at org.apache.maven.cli.MavenCli.doMain(MavenCli.java:288)  at org.apache.maven.cli.MavenCli.main(MavenCli.java:199)  at sun.reflect.NativeMethodAccessorImpl.invoke0(Native Method)  at sun.reflect.NativeMethodAccessorImpl.invoke(NativeMethodAccessorImpl.java:62)  at sun.reflect.DelegatingMethodAccessorImpl.invoke(DelegatingMethodAccessorImpl.java:43)  at java.lang.reflect.Method.invoke(Method.java:498)  at org.codehaus.plexus.classworlds.launcher.Launcher.launchEnhanced(Launcher.java:289)  at org.codehaus.plexus.classworlds.launcher.Launcher.launch(Launcher.java:229)  at org.codehaus.plexus.classworlds.launcher.Launcher.mainWithExitCode(Launcher.java:415)  at org.codehaus.plexus.classworlds.launcher.Launcher.main(Launcher.java:356) Caused by: org.eclipse.aether.resolution.ArtifactResolutionException: Could not find artifact org.openmrs.maven.plugins:openmrs-packager-maven-plugin:jar:1.5.0-SNAPSHOT  at org.eclipse.aether.internal.impl.DefaultArtifactResolver.resolve(DefaultArtifactResolver.java:444)  at org.eclipse.aether.internal.impl.DefaultArtifactResolver.resolveArtifacts(DefaultArtifactResolver.java:246)  at org.eclipse.aether.internal.impl.DefaultArtifactResolver.resolveArtifact(DefaultArtifactResolver.java:223)  at org.eclipse.aether.internal.impl.DefaultRepositorySystem.resolveArtifact(DefaultRepositorySystem.java:294)  at org.apache.maven.plugin.internal.DefaultPluginDependenciesResolver.resolve(DefaultPluginDependenciesResolver.java:124)  ... 26 more Caused by: org.eclipse.aether.transfer.ArtifactNotFoundException: Could not find artifact org.openmrs.maven.plugins:openmrs-packager-maven-plugin:jar:1.5.0-SNAPSHOT  at org.eclipse.aether.internal.impl.DefaultArtifactResolver.resolve(DefaultArtifactResolver.java:434)  ... 30 more [ERROR]  [ERROR]  [ERROR] For more information about the errors and possible solutions, please read the following articles: [ERROR] [Help 1] http://cwiki.apache.org/confluence/display/MAVEN/PluginResolutionException 
org.apache.maven.it.VerificationException: Exit code was non-zero: 1; command line and log = 
/usr/share/apache-maven-3.3.9/bin/mvn -N -X -e --batch-mode -Dmaven.repo.local=/home/bamboo-agent/.m2/repository org.apache.maven.plugins:maven-clean-plugin:clean install
Apache Maven 3.3.9 (bb52d8502b132ec0a5a3f4c09453c07478323dc5; 2015-11-10T16:41:47+00:00)
Maven home: /usr/share/apache-maven-3.3.9
Java version: 1.8.0_292, vendor: Private Build
Java home: /usr/lib/jvm/java-8-openjdk-amd64/jre
Default locale: en_US, platform encoding: UTF-8
(180 more lines...)
Collapse Failed CompileConfigurationsTest testDependencyConstantsAreMerged History
Default Job 3 secs
org.apache.maven.it.VerificationException: Exit code was non-zero: 1; command line and log =  /usr/share/apache-maven-3.3.9/bin/mvn -N -X -e --batch-mode -Dmaven.repo.local=/home/bamboo-agent/.m2/repository org.apache.maven.plugins:maven-clean-plugin:clean install Apache Maven 3.3.9 (bb52d8502b132ec0a5a3f4c09453c07478323dc5; 2015-11-10T16:41:47+00:00) Maven home: /usr/share/apache-maven-3.3.9 Java version: 1.8.0_292, vendor: Private Build Java home: /usr/lib/jvm/java-8-openjdk-amd64/jre Default locale: en_US, platform encoding: UTF-8 OS name: "linux", version: "4.4.0-210-generic", arch: "amd64", family: "unix" [DEBUG] Created new class realm maven.api [DEBUG] Importing foreign packages into class realm maven.api [DEBUG]   Imported: javax.enterprise.inject.* < plexus.core [DEBUG]   Imported: javax.enterprise.util.* < plexus.core [DEBUG]   Imported: javax.inject.* < plexus.core [DEBUG]   Imported: org.apache.maven.* < plexus.core [DEBUG]   Imported: org.apache.maven.artifact < plexus.core [DEBUG]   Imported: org.apache.maven.classrealm < plexus.core [DEBUG]   Imported: org.apache.maven.cli < plexus.core [DEBUG]   Imported: org.apache.maven.configuration < plexus.core [DEBUG]   Imported: org.apache.maven.exception < plexus.core [DEBUG]   Imported: org.apache.maven.execution < plexus.core [DEBUG]   Imported: org.apache.maven.execution.scope < plexus.core [DEBUG]   Imported: org.apache.maven.lifecycle < plexus.core [DEBUG]   Imported: org.apache.maven.model < plexus.core [DEBUG]   Imported: org.apache.maven.monitor < plexus.core [DEBUG]   Imported: org.apache.maven.plugin < plexus.core [DEBUG]   Imported: org.apache.maven.profiles < plexus.core [DEBUG]   Imported: org.apache.maven.project < plexus.core [DEBUG]   Imported: org.apache.maven.reporting < plexus.core [DEBUG]   Imported: org.apache.maven.repository < plexus.core [DEBUG]   Imported: org.apache.maven.rtinfo < plexus.core [DEBUG]   Imported: org.apache.maven.settings < plexus.core [DEBUG]   Imported: org.apache.maven.toolchain < plexus.core [DEBUG]   Imported: org.apache.maven.usability < plexus.core [DEBUG]   Imported: org.apache.maven.wagon.* < plexus.core [DEBUG]   Imported: org.apache.maven.wagon.authentication < plexus.core [DEBUG]   Imported: org.apache.maven.wagon.authorization < plexus.core [DEBUG]   Imported: org.apache.maven.wagon.events < plexus.core [DEBUG]   Imported: org.apache.maven.wagon.observers < plexus.core [DEBUG]   Imported: org.apache.maven.wagon.proxy < plexus.core [DEBUG]   Imported: org.apache.maven.wagon.repository < plexus.core [DEBUG]   Imported: org.apache.maven.wagon.resource < plexus.core [DEBUG]   Imported: org.codehaus.classworlds < plexus.core [DEBUG]   Imported: org.codehaus.plexus.* < plexus.core [DEBUG]   Imported: org.codehaus.plexus.classworlds < plexus.core [DEBUG]   Imported: org.codehaus.plexus.component < plexus.core [DEBUG]   Imported: org.codehaus.plexus.configuration < plexus.core [DEBUG]   Imported: org.codehaus.plexus.container < plexus.core [DEBUG]   Imported: org.codehaus.plexus.context < plexus.core [DEBUG]   Imported: org.codehaus.plexus.lifecycle < plexus.core [DEBUG]   Imported: org.codehaus.plexus.logging < plexus.core [DEBUG]   Imported: org.codehaus.plexus.personality < plexus.core [DEBUG]   Imported: org.codehaus.plexus.util.xml.Xpp3Dom < plexus.core [DEBUG]   Imported: org.codehaus.plexus.util.xml.pull.XmlPullParser < plexus.core [DEBUG]   Imported: org.codehaus.plexus.util.xml.pull.XmlPullParserException < plexus.core [DEBUG]   Imported: org.codehaus.plexus.util.xml.pull.XmlSerializer < plexus.core [DEBUG]   Imported: org.eclipse.aether.* < plexus.core [DEBUG]   Imported: org.eclipse.aether.artifact < plexus.core [DEBUG]   Imported: org.eclipse.aether.collection < plexus.core [DEBUG]   Imported: org.eclipse.aether.deployment < plexus.core [DEBUG]   Imported: org.eclipse.aether.graph < plexus.core [DEBUG]   Imported: org.eclipse.aether.impl < plexus.core [DEBUG]   Imported: org.eclipse.aether.installation < plexus.core [DEBUG]   Imported: org.eclipse.aether.internal.impl < plexus.core [DEBUG]   Imported: org.eclipse.aether.metadata < plexus.core [DEBUG]   Imported: org.eclipse.aether.repository < plexus.core [DEBUG]   Imported: org.eclipse.aether.resolution < plexus.core [DEBUG]   Imported: org.eclipse.aether.spi < plexus.core [DEBUG]   Imported: org.eclipse.aether.transfer < plexus.core [DEBUG]   Imported: org.eclipse.aether.version < plexus.core [DEBUG]   Imported: org.slf4j.* < plexus.core [DEBUG]   Imported: org.slf4j.helpers.* < plexus.core [DEBUG]   Imported: org.slf4j.spi.* < plexus.core [DEBUG] Populating class realm maven.api [INFO] Error stacktraces are turned on. [DEBUG] Reading global settings from /usr/share/apache-maven-3.3.9/conf/settings.xml [DEBUG] Reading user settings from /home/bamboo-agent/.m2/settings.xml [DEBUG] Reading global toolchains from /usr/share/apache-maven-3.3.9/conf/toolchains.xml [DEBUG] Reading user toolchains from /home/bamboo-agent/.m2/toolchains.xml [DEBUG] Using local repository at /home/bamboo-agent/.m2/repository [DEBUG] Using manager EnhancedLocalRepositoryManager with priority 10.0 for /home/bamboo-agent/.m2/repository [INFO] Scanning for projects... [DEBUG] Extension realms for project org.openmrs.maven.plugins:openmrs-packager-maven-plugin-config-test-parent:pom:1.0.0-SNAPSHOT: (none) [DEBUG] Looking up lifecyle mappings for packaging pom from ClassRealm[plexus.core, parent: null] [DEBUG] === REACTOR BUILD PLAN ================================================ [DEBUG] Project: org.openmrs.maven.plugins:openmrs-packager-maven-plugin-config-test-parent:pom:1.0.0-SNAPSHOT [DEBUG] Tasks:   [org.apache.maven.plugins:maven-clean-plugin:clean, install] [DEBUG] Style:   Regular [DEBUG] ======================================================================= [INFO]                                                                          [INFO] ------------------------------------------------------------------------ [INFO] Building OpenMRS config parent test 1.0.0-SNAPSHOT [INFO] ------------------------------------------------------------------------ [DEBUG] Lifecycle default -> [validate, initialize, generate-sources, process-sources, generate-resources, process-resources, compile, process-classes, generate-test-sources, process-test-sources, generate-test-resources, process-test-resources, test-compile, process-test-classes, test, prepare-package, package, pre-integration-test, integration-test, post-integration-test, verify, install, deploy] [DEBUG] Lifecycle clean -> [pre-clean, clean, post-clean] [DEBUG] Lifecycle site -> [pre-site, site, post-site, site-deploy] [DEBUG] Could not find metadata org.openmrs.maven.plugins:openmrs-packager-maven-plugin:1.5.0-SNAPSHOT/maven-metadata.xml in local (/home/bamboo-agent/.m2/repository) [DEBUG] Could not find metadata org.openmrs.maven.plugins:openmrs-packager-maven-plugin:1.5.0-SNAPSHOT/maven-metadata.xml in local (/home/bamboo-agent/.m2/repository) [WARNING] The POM for org.openmrs.maven.plugins:openmrs-packager-maven-plugin:jar:1.5.0-SNAPSHOT is missing, no dependency information available [INFO] ------------------------------------------------------------------------ [INFO] BUILD FAILURE [INFO] ------------------------------------------------------------------------ [INFO] Total time: 0.190 s [INFO] Finished at: 2021-07-06T07:20:03+00:00 [INFO] Final Memory: 7M/106M [INFO] ------------------------------------------------------------------------ [ERROR] Plugin org.openmrs.maven.plugins:openmrs-packager-maven-plugin:1.5.0-SNAPSHOT or one of its dependencies could not be resolved: Could not find artifact org.openmrs.maven.plugins:openmrs-packager-maven-plugin:jar:1.5.0-SNAPSHOT -> [Help 1] org.apache.maven.plugin.PluginResolutionException: Plugin org.openmrs.maven.plugins:openmrs-packager-maven-plugin:1.5.0-SNAPSHOT or one of its dependencies could not be resolved: Could not find artifact org.openmrs.maven.plugins:openmrs-packager-maven-plugin:jar:1.5.0-SNAPSHOT  at org.apache.maven.plugin.internal.DefaultPluginDependenciesResolver.resolve(DefaultPluginDependenciesResolver.java:128)  at org.apache.maven.plugin.internal.DefaultMavenPluginManager.getPluginDescriptor(DefaultMavenPluginManager.java:179)  at org.apache.maven.plugin.internal.DefaultMavenPluginManager.getMojoDescriptor(DefaultMavenPluginManager.java:284)  at org.apache.maven.plugin.DefaultBuildPluginManager.getMojoDescriptor(DefaultBuildPluginManager.java:241)  at org.apache.maven.lifecycle.internal.DefaultLifecycleExecutionPlanCalculator.setupMojoExecution(DefaultLifecycleExecutionPlanCalculator.java:169)  at org.apache.maven.lifecycle.internal.DefaultLifecycleExecutionPlanCalculator.setupMojoExecutions(DefaultLifecycleExecutionPlanCalculator.java:155)  at org.apache.maven.lifecycle.internal.DefaultLifecycleExecutionPlanCalculator.calculateExecutionPlan(DefaultLifecycleExecutionPlanCalculator.java:131)  at org.apache.maven.lifecycle.internal.DefaultLifecycleExecutionPlanCalculator.calculateExecutionPlan(DefaultLifecycleExecutionPlanCalculator.java:145)  at org.apache.maven.lifecycle.internal.builder.BuilderCommon.resolveBuildPlan(BuilderCommon.java:96)  at org.apache.maven.lifecycle.internal.LifecycleModuleBuilder.buildProject(LifecycleModuleBuilder.java:109)  at org.apache.maven.lifecycle.internal.LifecycleModuleBuilder.buildProject(LifecycleModuleBuilder.java:80)  at org.apache.maven.lifecycle.internal.builder.singlethreaded.SingleThreadedBuilder.build(SingleThreadedBuilder.java:51)  at org.apache.maven.lifecycle.internal.LifecycleStarter.execute(LifecycleStarter.java:128)  at org.apache.maven.DefaultMaven.doExecute(DefaultMaven.java:307)  at org.apache.maven.DefaultMaven.doExecute(DefaultMaven.java:193)  at org.apache.maven.DefaultMaven.execute(DefaultMaven.java:106)  at org.apache.maven.cli.MavenCli.execute(MavenCli.java:863)  at org.apache.maven.cli.MavenCli.doMain(MavenCli.java:288)  at org.apache.maven.cli.MavenCli.main(MavenCli.java:199)  at sun.reflect.NativeMethodAccessorImpl.invoke0(Native Method)  at sun.reflect.NativeMethodAccessorImpl.invoke(NativeMethodAccessorImpl.java:62)  at sun.reflect.DelegatingMethodAccessorImpl.invoke(DelegatingMethodAccessorImpl.java:43)  at java.lang.reflect.Method.invoke(Method.java:498)  at org.codehaus.plexus.classworlds.launcher.Launcher.launchEnhanced(Launcher.java:289)  at org.codehaus.plexus.classworlds.launcher.Launcher.launch(Launcher.java:229)  at org.codehaus.plexus.classworlds.launcher.Launcher.mainWithExitCode(Launcher.java:415)  at org.codehaus.plexus.classworlds.launcher.Launcher.main(Launcher.java:356) Caused by: org.eclipse.aether.resolution.ArtifactResolutionException: Could not find artifact org.openmrs.maven.plugins:openmrs-packager-maven-plugin:jar:1.5.0-SNAPSHOT  at org.eclipse.aether.internal.impl.DefaultArtifactResolver.resolve(DefaultArtifactResolver.java:444)  at org.eclipse.aether.internal.impl.DefaultArtifactResolver.resolveArtifacts(DefaultArtifactResolver.java:246)  at org.eclipse.aether.internal.impl.DefaultArtifactResolver.resolveArtifact(DefaultArtifactResolver.java:223)  at org.eclipse.aether.internal.impl.DefaultRepositorySystem.resolveArtifact(DefaultRepositorySystem.java:294)  at org.apache.maven.plugin.internal.DefaultPluginDependenciesResolver.resolve(DefaultPluginDependenciesResolver.java:124)  ... 26 more Caused by: org.eclipse.aether.transfer.ArtifactNotFoundException: Could not find artifact org.openmrs.maven.plugins:openmrs-packager-maven-plugin:jar:1.5.0-SNAPSHOT  at org.eclipse.aether.internal.impl.DefaultArtifactResolver.resolve(DefaultArtifactResolver.java:434)  ... 30 more [ERROR]  [ERROR]  [ERROR] For more information about the errors and possible solutions, please read the following articles: [ERROR] [Help 1] http://cwiki.apache.org/confluence/display/MAVEN/PluginResolutionException 
org.apache.maven.it.VerificationException: Exit code was non-zero: 1; command line and log = 
/usr/share/apache-maven-3.3.9/bin/mvn -N -X -e --batch-mode -Dmaven.repo.local=/home/bamboo-agent/.m2/repository org.apache.maven.plugins:maven-clean-plugin:clean install
Apache Maven 3.3.9 (bb52d8502b132ec0a5a3f4c09453c07478323dc5; 2015-11-10T16:41:47+00:00)
Maven home: /usr/share/apache-maven-3.3.9
Java version: 1.8.0_292, vendor: Private Build
Java home: /usr/lib/jvm/java-8-openjdk-amd64/jre
Default locale: en_US, platform encoding: UTF-8
(180 more lines...)
Collapse Failed CompileConfigurationsTest testVariablesAreReplaced History
Default Job 3 secs
org.apache.maven.it.VerificationException: Exit code was non-zero: 1; command line and log =  /usr/share/apache-maven-3.3.9/bin/mvn -N -X -e --batch-mode -Dmaven.repo.local=/home/bamboo-agent/.m2/repository org.apache.maven.plugins:maven-clean-plugin:clean install Apache Maven 3.3.9 (bb52d8502b132ec0a5a3f4c09453c07478323dc5; 2015-11-10T16:41:47+00:00) Maven home: /usr/share/apache-maven-3.3.9 Java version: 1.8.0_292, vendor: Private Build Java home: /usr/lib/jvm/java-8-openjdk-amd64/jre Default locale: en_US, platform encoding: UTF-8 OS name: "linux", version: "4.4.0-210-generic", arch: "amd64", family: "unix" [DEBUG] Created new class realm maven.api [DEBUG] Importing foreign packages into class realm maven.api [DEBUG]   Imported: javax.enterprise.inject.* < plexus.core [DEBUG]   Imported: javax.enterprise.util.* < plexus.core [DEBUG]   Imported: javax.inject.* < plexus.core [DEBUG]   Imported: org.apache.maven.* < plexus.core [DEBUG]   Imported: org.apache.maven.artifact < plexus.core [DEBUG]   Imported: org.apache.maven.classrealm < plexus.core [DEBUG]   Imported: org.apache.maven.cli < plexus.core [DEBUG]   Imported: org.apache.maven.configuration < plexus.core [DEBUG]   Imported: org.apache.maven.exception < plexus.core [DEBUG]   Imported: org.apache.maven.execution < plexus.core [DEBUG]   Imported: org.apache.maven.execution.scope < plexus.core [DEBUG]   Imported: org.apache.maven.lifecycle < plexus.core [DEBUG]   Imported: org.apache.maven.model < plexus.core [DEBUG]   Imported: org.apache.maven.monitor < plexus.core [DEBUG]   Imported: org.apache.maven.plugin < plexus.core [DEBUG]   Imported: org.apache.maven.profiles < plexus.core [DEBUG]   Imported: org.apache.maven.project < plexus.core [DEBUG]   Imported: org.apache.maven.reporting < plexus.core [DEBUG]   Imported: org.apache.maven.repository < plexus.core [DEBUG]   Imported: org.apache.maven.rtinfo < plexus.core [DEBUG]   Imported: org.apache.maven.settings < plexus.core [DEBUG]   Imported: org.apache.maven.toolchain < plexus.core [DEBUG]   Imported: org.apache.maven.usability < plexus.core [DEBUG]   Imported: org.apache.maven.wagon.* < plexus.core [DEBUG]   Imported: org.apache.maven.wagon.authentication < plexus.core [DEBUG]   Imported: org.apache.maven.wagon.authorization < plexus.core [DEBUG]   Imported: org.apache.maven.wagon.events < plexus.core [DEBUG]   Imported: org.apache.maven.wagon.observers < plexus.core [DEBUG]   Imported: org.apache.maven.wagon.proxy < plexus.core [DEBUG]   Imported: org.apache.maven.wagon.repository < plexus.core [DEBUG]   Imported: org.apache.maven.wagon.resource < plexus.core [DEBUG]   Imported: org.codehaus.classworlds < plexus.core [DEBUG]   Imported: org.codehaus.plexus.* < plexus.core [DEBUG]   Imported: org.codehaus.plexus.classworlds < plexus.core [DEBUG]   Imported: org.codehaus.plexus.component < plexus.core [DEBUG]   Imported: org.codehaus.plexus.configuration < plexus.core [DEBUG]   Imported: org.codehaus.plexus.container < plexus.core [DEBUG]   Imported: org.codehaus.plexus.context < plexus.core [DEBUG]   Imported: org.codehaus.plexus.lifecycle < plexus.core [DEBUG]   Imported: org.codehaus.plexus.logging < plexus.core [DEBUG]   Imported: org.codehaus.plexus.personality < plexus.core [DEBUG]   Imported: org.codehaus.plexus.util.xml.Xpp3Dom < plexus.core [DEBUG]   Imported: org.codehaus.plexus.util.xml.pull.XmlPullParser < plexus.core [DEBUG]   Imported: org.codehaus.plexus.util.xml.pull.XmlPullParserException < plexus.core [DEBUG]   Imported: org.codehaus.plexus.util.xml.pull.XmlSerializer < plexus.core [DEBUG]   Imported: org.eclipse.aether.* < plexus.core [DEBUG]   Imported: org.eclipse.aether.artifact < plexus.core [DEBUG]   Imported: org.eclipse.aether.collection < plexus.core [DEBUG]   Imported: org.eclipse.aether.deployment < plexus.core [DEBUG]   Imported: org.eclipse.aether.graph < plexus.core [DEBUG]   Imported: org.eclipse.aether.impl < plexus.core [DEBUG]   Imported: org.eclipse.aether.installation < plexus.core [DEBUG]   Imported: org.eclipse.aether.internal.impl < plexus.core [DEBUG]   Imported: org.eclipse.aether.metadata < plexus.core [DEBUG]   Imported: org.eclipse.aether.repository < plexus.core [DEBUG]   Imported: org.eclipse.aether.resolution < plexus.core [DEBUG]   Imported: org.eclipse.aether.spi < plexus.core [DEBUG]   Imported: org.eclipse.aether.transfer < plexus.core [DEBUG]   Imported: org.eclipse.aether.version < plexus.core [DEBUG]   Imported: org.slf4j.* < plexus.core [DEBUG]   Imported: org.slf4j.helpers.* < plexus.core [DEBUG]   Imported: org.slf4j.spi.* < plexus.core [DEBUG] Populating class realm maven.api [INFO] Error stacktraces are turned on. [DEBUG] Reading global settings from /usr/share/apache-maven-3.3.9/conf/settings.xml [DEBUG] Reading user settings from /home/bamboo-agent/.m2/settings.xml [DEBUG] Reading global toolchains from /usr/share/apache-maven-3.3.9/conf/toolchains.xml [DEBUG] Reading user toolchains from /home/bamboo-agent/.m2/toolchains.xml [DEBUG] Using local repository at /home/bamboo-agent/.m2/repository [DEBUG] Using manager EnhancedLocalRepositoryManager with priority 10.0 for /home/bamboo-agent/.m2/repository [INFO] Scanning for projects... [DEBUG] Extension realms for project org.openmrs.maven.plugins:openmrs-packager-maven-plugin-config-test-parent:pom:1.0.0-SNAPSHOT: (none) [DEBUG] Looking up lifecyle mappings for packaging pom from ClassRealm[plexus.core, parent: null] [DEBUG] === REACTOR BUILD PLAN ================================================ [DEBUG] Project: org.openmrs.maven.plugins:openmrs-packager-maven-plugin-config-test-parent:pom:1.0.0-SNAPSHOT [DEBUG] Tasks:   [org.apache.maven.plugins:maven-clean-plugin:clean, install] [DEBUG] Style:   Regular [DEBUG] ======================================================================= [INFO]                                                                          [INFO] ------------------------------------------------------------------------ [INFO] Building OpenMRS config parent test 1.0.0-SNAPSHOT [INFO] ------------------------------------------------------------------------ [DEBUG] Lifecycle default -> [validate, initialize, generate-sources, process-sources, generate-resources, process-resources, compile, process-classes, generate-test-sources, process-test-sources, generate-test-resources, process-test-resources, test-compile, process-test-classes, test, prepare-package, package, pre-integration-test, integration-test, post-integration-test, verify, install, deploy] [DEBUG] Lifecycle clean -> [pre-clean, clean, post-clean] [DEBUG] Lifecycle site -> [pre-site, site, post-site, site-deploy] [DEBUG] Could not find metadata org.openmrs.maven.plugins:openmrs-packager-maven-plugin:1.5.0-SNAPSHOT/maven-metadata.xml in local (/home/bamboo-agent/.m2/repository) [DEBUG] Could not find metadata org.openmrs.maven.plugins:openmrs-packager-maven-plugin:1.5.0-SNAPSHOT/maven-metadata.xml in local (/home/bamboo-agent/.m2/repository) [WARNING] The POM for org.openmrs.maven.plugins:openmrs-packager-maven-plugin:jar:1.5.0-SNAPSHOT is missing, no dependency information available [INFO] ------------------------------------------------------------------------ [INFO] BUILD FAILURE [INFO] ------------------------------------------------------------------------ [INFO] Total time: 0.157 s [INFO] Finished at: 2021-07-06T07:19:53+00:00 [INFO] Final Memory: 7M/106M [INFO] ------------------------------------------------------------------------ [ERROR] Plugin org.openmrs.maven.plugins:openmrs-packager-maven-plugin:1.5.0-SNAPSHOT or one of its dependencies could not be resolved: Could not find artifact org.openmrs.maven.plugins:openmrs-packager-maven-plugin:jar:1.5.0-SNAPSHOT -> [Help 1] org.apache.maven.plugin.PluginResolutionException: Plugin org.openmrs.maven.plugins:openmrs-packager-maven-plugin:1.5.0-SNAPSHOT or one of its dependencies could not be resolved: Could not find artifact org.openmrs.maven.plugins:openmrs-packager-maven-plugin:jar:1.5.0-SNAPSHOT  at org.apache.maven.plugin.internal.DefaultPluginDependenciesResolver.resolve(DefaultPluginDependenciesResolver.java:128)  at org.apache.maven.plugin.internal.DefaultMavenPluginManager.getPluginDescriptor(DefaultMavenPluginManager.java:179)  at org.apache.maven.plugin.internal.DefaultMavenPluginManager.getMojoDescriptor(DefaultMavenPluginManager.java:284)  at org.apache.maven.plugin.DefaultBuildPluginManager.getMojoDescriptor(DefaultBuildPluginManager.java:241)  at org.apache.maven.lifecycle.internal.DefaultLifecycleExecutionPlanCalculator.setupMojoExecution(DefaultLifecycleExecutionPlanCalculator.java:169)  at org.apache.maven.lifecycle.internal.DefaultLifecycleExecutionPlanCalculator.setupMojoExecutions(DefaultLifecycleExecutionPlanCalculator.java:155)  at org.apache.maven.lifecycle.internal.DefaultLifecycleExecutionPlanCalculator.calculateExecutionPlan(DefaultLifecycleExecutionPlanCalculator.java:131)  at org.apache.maven.lifecycle.internal.DefaultLifecycleExecutionPlanCalculator.calculateExecutionPlan(DefaultLifecycleExecutionPlanCalculator.java:145)  at org.apache.maven.lifecycle.internal.builder.BuilderCommon.resolveBuildPlan(BuilderCommon.java:96)  at org.apache.maven.lifecycle.internal.LifecycleModuleBuilder.buildProject(LifecycleModuleBuilder.java:109)  at org.apache.maven.lifecycle.internal.LifecycleModuleBuilder.buildProject(LifecycleModuleBuilder.java:80)  at org.apache.maven.lifecycle.internal.builder.singlethreaded.SingleThreadedBuilder.build(SingleThreadedBuilder.java:51)  at org.apache.maven.lifecycle.internal.LifecycleStarter.execute(LifecycleStarter.java:128)  at org.apache.maven.DefaultMaven.doExecute(DefaultMaven.java:307)  at org.apache.maven.DefaultMaven.doExecute(DefaultMaven.java:193)  at org.apache.maven.DefaultMaven.execute(DefaultMaven.java:106)  at org.apache.maven.cli.MavenCli.execute(MavenCli.java:863)  at org.apache.maven.cli.MavenCli.doMain(MavenCli.java:288)  at org.apache.maven.cli.MavenCli.main(MavenCli.java:199)  at sun.reflect.NativeMethodAccessorImpl.invoke0(Native Method)  at sun.reflect.NativeMethodAccessorImpl.invoke(NativeMethodAccessorImpl.java:62)  at sun.reflect.DelegatingMethodAccessorImpl.invoke(DelegatingMethodAccessorImpl.java:43)  at java.lang.reflect.Method.invoke(Method.java:498)  at org.codehaus.plexus.classworlds.launcher.Launcher.launchEnhanced(Launcher.java:289)  at org.codehaus.plexus.classworlds.launcher.Launcher.launch(Launcher.java:229)  at org.codehaus.plexus.classworlds.launcher.Launcher.mainWithExitCode(Launcher.java:415)  at org.codehaus.plexus.classworlds.launcher.Launcher.main(Launcher.java:356) Caused by: org.eclipse.aether.resolution.ArtifactResolutionException: Could not find artifact org.openmrs.maven.plugins:openmrs-packager-maven-plugin:jar:1.5.0-SNAPSHOT  at org.eclipse.aether.internal.impl.DefaultArtifactResolver.resolve(DefaultArtifactResolver.java:444)  at org.eclipse.aether.internal.impl.DefaultArtifactResolver.resolveArtifacts(DefaultArtifactResolver.java:246)  at org.eclipse.aether.internal.impl.DefaultArtifactResolver.resolveArtifact(DefaultArtifactResolver.java:223)  at org.eclipse.aether.internal.impl.DefaultRepositorySystem.resolveArtifact(DefaultRepositorySystem.java:294)  at org.apache.maven.plugin.internal.DefaultPluginDependenciesResolver.resolve(DefaultPluginDependenciesResolver.java:124)  ... 26 more Caused by: org.eclipse.aether.transfer.ArtifactNotFoundException: Could not find artifact org.openmrs.maven.plugins:openmrs-packager-maven-plugin:jar:1.5.0-SNAPSHOT  at org.eclipse.aether.internal.impl.DefaultArtifactResolver.resolve(DefaultArtifactResolver.java:434)  ... 30 more [ERROR]  [ERROR]  [ERROR] For more information about the errors and possible solutions, please read the following articles: [ERROR] [Help 1] http://cwiki.apache.org/confluence/display/MAVEN/PluginResolutionException 
org.apache.maven.it.VerificationException: Exit code was non-zero: 1; command line and log = 
/usr/share/apache-maven-3.3.9/bin/mvn -N -X -e --batch-mode -Dmaven.repo.local=/home/bamboo-agent/.m2/repository org.apache.maven.plugins:maven-clean-plugin:clean install
Apache Maven 3.3.9 (bb52d8502b132ec0a5a3f4c09453c07478323dc5; 2015-11-10T16:41:47+00:00)
Maven home: /usr/share/apache-maven-3.3.9
Java version: 1.8.0_292, vendor: Private Build
Java home: /usr/lib/jvm/java-8-openjdk-amd64/jre
Default locale: en_US, platform encoding: UTF-8
(180 more lines...)
Collapse Failed GenerateResourceFiltersTest testPropertiesFilesLoadedCorrectly History
Default Job 3 secs
org.apache.maven.it.VerificationException: Exit code was non-zero: 1; command line and log =  /usr/share/apache-maven-3.3.9/bin/mvn -N -X -e --batch-mode -Dmaven.repo.local=/home/bamboo-agent/.m2/repository org.apache.maven.plugins:maven-clean-plugin:clean install Apache Maven 3.3.9 (bb52d8502b132ec0a5a3f4c09453c07478323dc5; 2015-11-10T16:41:47+00:00) Maven home: /usr/share/apache-maven-3.3.9 Java version: 1.8.0_292, vendor: Private Build Java home: /usr/lib/jvm/java-8-openjdk-amd64/jre Default locale: en_US, platform encoding: UTF-8 OS name: "linux", version: "4.4.0-210-generic", arch: "amd64", family: "unix" [DEBUG] Created new class realm maven.api [DEBUG] Importing foreign packages into class realm maven.api [DEBUG]   Imported: javax.enterprise.inject.* < plexus.core [DEBUG]   Imported: javax.enterprise.util.* < plexus.core [DEBUG]   Imported: javax.inject.* < plexus.core [DEBUG]   Imported: org.apache.maven.* < plexus.core [DEBUG]   Imported: org.apache.maven.artifact < plexus.core [DEBUG]   Imported: org.apache.maven.classrealm < plexus.core [DEBUG]   Imported: org.apache.maven.cli < plexus.core [DEBUG]   Imported: org.apache.maven.configuration < plexus.core [DEBUG]   Imported: org.apache.maven.exception < plexus.core [DEBUG]   Imported: org.apache.maven.execution < plexus.core [DEBUG]   Imported: org.apache.maven.execution.scope < plexus.core [DEBUG]   Imported: org.apache.maven.lifecycle < plexus.core [DEBUG]   Imported: org.apache.maven.model < plexus.core [DEBUG]   Imported: org.apache.maven.monitor < plexus.core [DEBUG]   Imported: org.apache.maven.plugin < plexus.core [DEBUG]   Imported: org.apache.maven.profiles < plexus.core [DEBUG]   Imported: org.apache.maven.project < plexus.core [DEBUG]   Imported: org.apache.maven.reporting < plexus.core [DEBUG]   Imported: org.apache.maven.repository < plexus.core [DEBUG]   Imported: org.apache.maven.rtinfo < plexus.core [DEBUG]   Imported: org.apache.maven.settings < plexus.core [DEBUG]   Imported: org.apache.maven.toolchain < plexus.core [DEBUG]   Imported: org.apache.maven.usability < plexus.core [DEBUG]   Imported: org.apache.maven.wagon.* < plexus.core [DEBUG]   Imported: org.apache.maven.wagon.authentication < plexus.core [DEBUG]   Imported: org.apache.maven.wagon.authorization < plexus.core [DEBUG]   Imported: org.apache.maven.wagon.events < plexus.core [DEBUG]   Imported: org.apache.maven.wagon.observers < plexus.core [DEBUG]   Imported: org.apache.maven.wagon.proxy < plexus.core [DEBUG]   Imported: org.apache.maven.wagon.repository < plexus.core [DEBUG]   Imported: org.apache.maven.wagon.resource < plexus.core [DEBUG]   Imported: org.codehaus.classworlds < plexus.core [DEBUG]   Imported: org.codehaus.plexus.* < plexus.core [DEBUG]   Imported: org.codehaus.plexus.classworlds < plexus.core [DEBUG]   Imported: org.codehaus.plexus.component < plexus.core [DEBUG]   Imported: org.codehaus.plexus.configuration < plexus.core [DEBUG]   Imported: org.codehaus.plexus.container < plexus.core [DEBUG]   Imported: org.codehaus.plexus.context < plexus.core [DEBUG]   Imported: org.codehaus.plexus.lifecycle < plexus.core [DEBUG]   Imported: org.codehaus.plexus.logging < plexus.core [DEBUG]   Imported: org.codehaus.plexus.personality < plexus.core [DEBUG]   Imported: org.codehaus.plexus.util.xml.Xpp3Dom < plexus.core [DEBUG]   Imported: org.codehaus.plexus.util.xml.pull.XmlPullParser < plexus.core [DEBUG]   Imported: org.codehaus.plexus.util.xml.pull.XmlPullParserException < plexus.core [DEBUG]   Imported: org.codehaus.plexus.util.xml.pull.XmlSerializer < plexus.core [DEBUG]   Imported: org.eclipse.aether.* < plexus.core [DEBUG]   Imported: org.eclipse.aether.artifact < plexus.core [DEBUG]   Imported: org.eclipse.aether.collection < plexus.core [DEBUG]   Imported: org.eclipse.aether.deployment < plexus.core [DEBUG]   Imported: org.eclipse.aether.graph < plexus.core [DEBUG]   Imported: org.eclipse.aether.impl < plexus.core [DEBUG]   Imported: org.eclipse.aether.installation < plexus.core [DEBUG]   Imported: org.eclipse.aether.internal.impl < plexus.core [DEBUG]   Imported: org.eclipse.aether.metadata < plexus.core [DEBUG]   Imported: org.eclipse.aether.repository < plexus.core [DEBUG]   Imported: org.eclipse.aether.resolution < plexus.core [DEBUG]   Imported: org.eclipse.aether.spi < plexus.core [DEBUG]   Imported: org.eclipse.aether.transfer < plexus.core [DEBUG]   Imported: org.eclipse.aether.version < plexus.core [DEBUG]   Imported: org.slf4j.* < plexus.core [DEBUG]   Imported: org.slf4j.helpers.* < plexus.core [DEBUG]   Imported: org.slf4j.spi.* < plexus.core [DEBUG] Populating class realm maven.api [INFO] Error stacktraces are turned on. [DEBUG] Reading global settings from /usr/share/apache-maven-3.3.9/conf/settings.xml [DEBUG] Reading user settings from /home/bamboo-agent/.m2/settings.xml [DEBUG] Reading global toolchains from /usr/share/apache-maven-3.3.9/conf/toolchains.xml [DEBUG] Reading user toolchains from /home/bamboo-agent/.m2/toolchains.xml [DEBUG] Using local repository at /home/bamboo-agent/.m2/repository [DEBUG] Using manager EnhancedLocalRepositoryManager with priority 10.0 for /home/bamboo-agent/.m2/repository [INFO] Scanning for projects... [DEBUG] Extension realms for project org.openmrs.maven.plugins:openmrs-packager-maven-plugin-config-test-parent:pom:1.0.0-SNAPSHOT: (none) [DEBUG] Looking up lifecyle mappings for packaging pom from ClassRealm[plexus.core, parent: null] [DEBUG] === REACTOR BUILD PLAN ================================================ [DEBUG] Project: org.openmrs.maven.plugins:openmrs-packager-maven-plugin-config-test-parent:pom:1.0.0-SNAPSHOT [DEBUG] Tasks:   [org.apache.maven.plugins:maven-clean-plugin:clean, install] [DEBUG] Style:   Regular [DEBUG] ======================================================================= [INFO]                                                                          [INFO] ------------------------------------------------------------------------ [INFO] Building OpenMRS config parent test 1.0.0-SNAPSHOT [INFO] ------------------------------------------------------------------------ [DEBUG] Lifecycle default -> [validate, initialize, generate-sources, process-sources, generate-resources, process-resources, compile, process-classes, generate-test-sources, process-test-sources, generate-test-resources, process-test-resources, test-compile, process-test-classes, test, prepare-package, package, pre-integration-test, integration-test, post-integration-test, verify, install, deploy] [DEBUG] Lifecycle clean -> [pre-clean, clean, post-clean] [DEBUG] Lifecycle site -> [pre-site, site, post-site, site-deploy] [DEBUG] Could not find metadata org.openmrs.maven.plugins:openmrs-packager-maven-plugin:1.5.0-SNAPSHOT/maven-metadata.xml in local (/home/bamboo-agent/.m2/repository) [DEBUG] Could not find metadata org.openmrs.maven.plugins:openmrs-packager-maven-plugin:1.5.0-SNAPSHOT/maven-metadata.xml in local (/home/bamboo-agent/.m2/repository) [WARNING] The POM for org.openmrs.maven.plugins:openmrs-packager-maven-plugin:jar:1.5.0-SNAPSHOT is missing, no dependency information available [INFO] ------------------------------------------------------------------------ [INFO] BUILD FAILURE [INFO] ------------------------------------------------------------------------ [INFO] Total time: 0.192 s [INFO] Finished at: 2021-07-06T07:19:46+00:00 [INFO] Final Memory: 7M/106M [INFO] ------------------------------------------------------------------------ [ERROR] Plugin org.openmrs.maven.plugins:openmrs-packager-maven-plugin:1.5.0-SNAPSHOT or one of its dependencies could not be resolved: Could not find artifact org.openmrs.maven.plugins:openmrs-packager-maven-plugin:jar:1.5.0-SNAPSHOT -> [Help 1] org.apache.maven.plugin.PluginResolutionException: Plugin org.openmrs.maven.plugins:openmrs-packager-maven-plugin:1.5.0-SNAPSHOT or one of its dependencies could not be resolved: Could not find artifact org.openmrs.maven.plugins:openmrs-packager-maven-plugin:jar:1.5.0-SNAPSHOT  at org.apache.maven.plugin.internal.DefaultPluginDependenciesResolver.resolve(DefaultPluginDependenciesResolver.java:128)  at org.apache.maven.plugin.internal.DefaultMavenPluginManager.getPluginDescriptor(DefaultMavenPluginManager.java:179)  at org.apache.maven.plugin.internal.DefaultMavenPluginManager.getMojoDescriptor(DefaultMavenPluginManager.java:284)  at org.apache.maven.plugin.DefaultBuildPluginManager.getMojoDescriptor(DefaultBuildPluginManager.java:241)  at org.apache.maven.lifecycle.internal.DefaultLifecycleExecutionPlanCalculator.setupMojoExecution(DefaultLifecycleExecutionPlanCalculator.java:169)  at org.apache.maven.lifecycle.internal.DefaultLifecycleExecutionPlanCalculator.setupMojoExecutions(DefaultLifecycleExecutionPlanCalculator.java:155)  at org.apache.maven.lifecycle.internal.DefaultLifecycleExecutionPlanCalculator.calculateExecutionPlan(DefaultLifecycleExecutionPlanCalculator.java:131)  at org.apache.maven.lifecycle.internal.DefaultLifecycleExecutionPlanCalculator.calculateExecutionPlan(DefaultLifecycleExecutionPlanCalculator.java:145)  at org.apache.maven.lifecycle.internal.builder.BuilderCommon.resolveBuildPlan(BuilderCommon.java:96)  at org.apache.maven.lifecycle.internal.LifecycleModuleBuilder.buildProject(LifecycleModuleBuilder.java:109)  at org.apache.maven.lifecycle.internal.LifecycleModuleBuilder.buildProject(LifecycleModuleBuilder.java:80)  at org.apache.maven.lifecycle.internal.builder.singlethreaded.SingleThreadedBuilder.build(SingleThreadedBuilder.java:51)  at org.apache.maven.lifecycle.internal.LifecycleStarter.execute(LifecycleStarter.java:128)  at org.apache.maven.DefaultMaven.doExecute(DefaultMaven.java:307)  at org.apache.maven.DefaultMaven.doExecute(DefaultMaven.java:193)  at org.apache.maven.DefaultMaven.execute(DefaultMaven.java:106)  at org.apache.maven.cli.MavenCli.execute(MavenCli.java:863)  at org.apache.maven.cli.MavenCli.doMain(MavenCli.java:288)  at org.apache.maven.cli.MavenCli.main(MavenCli.java:199)  at sun.reflect.NativeMethodAccessorImpl.invoke0(Native Method)  at sun.reflect.NativeMethodAccessorImpl.invoke(NativeMethodAccessorImpl.java:62)  at sun.reflect.DelegatingMethodAccessorImpl.invoke(DelegatingMethodAccessorImpl.java:43)  at java.lang.reflect.Method.invoke(Method.java:498)  at org.codehaus.plexus.classworlds.launcher.Launcher.launchEnhanced(Launcher.java:289)  at org.codehaus.plexus.classworlds.launcher.Launcher.launch(Launcher.java:229)  at org.codehaus.plexus.classworlds.launcher.Launcher.mainWithExitCode(Launcher.java:415)  at org.codehaus.plexus.classworlds.launcher.Launcher.main(Launcher.java:356) Caused by: org.eclipse.aether.resolution.ArtifactResolutionException: Could not find artifact org.openmrs.maven.plugins:openmrs-packager-maven-plugin:jar:1.5.0-SNAPSHOT  at org.eclipse.aether.internal.impl.DefaultArtifactResolver.resolve(DefaultArtifactResolver.java:444)  at org.eclipse.aether.internal.impl.DefaultArtifactResolver.resolveArtifacts(DefaultArtifactResolver.java:246)  at org.eclipse.aether.internal.impl.DefaultArtifactResolver.resolveArtifact(DefaultArtifactResolver.java:223)  at org.eclipse.aether.internal.impl.DefaultRepositorySystem.resolveArtifact(DefaultRepositorySystem.java:294)  at org.apache.maven.plugin.internal.DefaultPluginDependenciesResolver.resolve(DefaultPluginDependenciesResolver.java:124)  ... 26 more Caused by: org.eclipse.aether.transfer.ArtifactNotFoundException: Could not find artifact org.openmrs.maven.plugins:openmrs-packager-maven-plugin:jar:1.5.0-SNAPSHOT  at org.eclipse.aether.internal.impl.DefaultArtifactResolver.resolve(DefaultArtifactResolver.java:434)  ... 30 more [ERROR]  [ERROR]  [ERROR] For more information about the errors and possible solutions, please read the following articles: [ERROR] [Help 1] http://cwiki.apache.org/confluence/display/MAVEN/PluginResolutionException 
org.apache.maven.it.VerificationException: Exit code was non-zero: 1; command line and log = 
/usr/share/apache-maven-3.3.9/bin/mvn -N -X -e --batch-mode -Dmaven.repo.local=/home/bamboo-agent/.m2/repository org.apache.maven.plugins:maven-clean-plugin:clean install
Apache Maven 3.3.9 (bb52d8502b132ec0a5a3f4c09453c07478323dc5; 2015-11-10T16:41:47+00:00)
Maven home: /usr/share/apache-maven-3.3.9
Java version: 1.8.0_292, vendor: Private Build
Java home: /usr/lib/jvm/java-8-openjdk-amd64/jre
Default locale: en_US, platform encoding: UTF-8
(179 more lines...)
Collapse Failed GenerateResourceFiltersTest testYmlFilesParseIntoPropertiesCorrectly History
Default Job 3 secs
org.apache.maven.it.VerificationException: Exit code was non-zero: 1; command line and log =  /usr/share/apache-maven-3.3.9/bin/mvn -N -X -e --batch-mode -Dmaven.repo.local=/home/bamboo-agent/.m2/repository org.apache.maven.plugins:maven-clean-plugin:clean compile Apache Maven 3.3.9 (bb52d8502b132ec0a5a3f4c09453c07478323dc5; 2015-11-10T16:41:47+00:00) Maven home: /usr/share/apache-maven-3.3.9 Java version: 1.8.0_292, vendor: Private Build Java home: /usr/lib/jvm/java-8-openjdk-amd64/jre Default locale: en_US, platform encoding: UTF-8 OS name: "linux", version: "4.4.0-210-generic", arch: "amd64", family: "unix" [DEBUG] Created new class realm maven.api [DEBUG] Importing foreign packages into class realm maven.api [DEBUG]   Imported: javax.enterprise.inject.* < plexus.core [DEBUG]   Imported: javax.enterprise.util.* < plexus.core [DEBUG]   Imported: javax.inject.* < plexus.core [DEBUG]   Imported: org.apache.maven.* < plexus.core [DEBUG]   Imported: org.apache.maven.artifact < plexus.core [DEBUG]   Imported: org.apache.maven.classrealm < plexus.core [DEBUG]   Imported: org.apache.maven.cli < plexus.core [DEBUG]   Imported: org.apache.maven.configuration < plexus.core [DEBUG]   Imported: org.apache.maven.exception < plexus.core [DEBUG]   Imported: org.apache.maven.execution < plexus.core [DEBUG]   Imported: org.apache.maven.execution.scope < plexus.core [DEBUG]   Imported: org.apache.maven.lifecycle < plexus.core [DEBUG]   Imported: org.apache.maven.model < plexus.core [DEBUG]   Imported: org.apache.maven.monitor < plexus.core [DEBUG]   Imported: org.apache.maven.plugin < plexus.core [DEBUG]   Imported: org.apache.maven.profiles < plexus.core [DEBUG]   Imported: org.apache.maven.project < plexus.core [DEBUG]   Imported: org.apache.maven.reporting < plexus.core [DEBUG]   Imported: org.apache.maven.repository < plexus.core [DEBUG]   Imported: org.apache.maven.rtinfo < plexus.core [DEBUG]   Imported: org.apache.maven.settings < plexus.core [DEBUG]   Imported: org.apache.maven.toolchain < plexus.core [DEBUG]   Imported: org.apache.maven.usability < plexus.core [DEBUG]   Imported: org.apache.maven.wagon.* < plexus.core [DEBUG]   Imported: org.apache.maven.wagon.authentication < plexus.core [DEBUG]   Imported: org.apache.maven.wagon.authorization < plexus.core [DEBUG]   Imported: org.apache.maven.wagon.events < plexus.core [DEBUG]   Imported: org.apache.maven.wagon.observers < plexus.core [DEBUG]   Imported: org.apache.maven.wagon.proxy < plexus.core [DEBUG]   Imported: org.apache.maven.wagon.repository < plexus.core [DEBUG]   Imported: org.apache.maven.wagon.resource < plexus.core [DEBUG]   Imported: org.codehaus.classworlds < plexus.core [DEBUG]   Imported: org.codehaus.plexus.* < plexus.core [DEBUG]   Imported: org.codehaus.plexus.classworlds < plexus.core [DEBUG]   Imported: org.codehaus.plexus.component < plexus.core [DEBUG]   Imported: org.codehaus.plexus.configuration < plexus.core [DEBUG]   Imported: org.codehaus.plexus.container < plexus.core [DEBUG]   Imported: org.codehaus.plexus.context < plexus.core [DEBUG]   Imported: org.codehaus.plexus.lifecycle < plexus.core [DEBUG]   Imported: org.codehaus.plexus.logging < plexus.core [DEBUG]   Imported: org.codehaus.plexus.personality < plexus.core [DEBUG]   Imported: org.codehaus.plexus.util.xml.Xpp3Dom < plexus.core [DEBUG]   Imported: org.codehaus.plexus.util.xml.pull.XmlPullParser < plexus.core [DEBUG]   Imported: org.codehaus.plexus.util.xml.pull.XmlPullParserException < plexus.core [DEBUG]   Imported: org.codehaus.plexus.util.xml.pull.XmlSerializer < plexus.core [DEBUG]   Imported: org.eclipse.aether.* < plexus.core [DEBUG]   Imported: org.eclipse.aether.artifact < plexus.core [DEBUG]   Imported: org.eclipse.aether.collection < plexus.core [DEBUG]   Imported: org.eclipse.aether.deployment < plexus.core [DEBUG]   Imported: org.eclipse.aether.graph < plexus.core [DEBUG]   Imported: org.eclipse.aether.impl < plexus.core [DEBUG]   Imported: org.eclipse.aether.installation < plexus.core [DEBUG]   Imported: org.eclipse.aether.internal.impl < plexus.core [DEBUG]   Imported: org.eclipse.aether.metadata < plexus.core [DEBUG]   Imported: org.eclipse.aether.repository < plexus.core [DEBUG]   Imported: org.eclipse.aether.resolution < plexus.core [DEBUG]   Imported: org.eclipse.aether.spi < plexus.core [DEBUG]   Imported: org.eclipse.aether.transfer < plexus.core [DEBUG]   Imported: org.eclipse.aether.version < plexus.core [DEBUG]   Imported: org.slf4j.* < plexus.core [DEBUG]   Imported: org.slf4j.helpers.* < plexus.core [DEBUG]   Imported: org.slf4j.spi.* < plexus.core [DEBUG] Populating class realm maven.api [INFO] Error stacktraces are turned on. [DEBUG] Reading global settings from /usr/share/apache-maven-3.3.9/conf/settings.xml [DEBUG] Reading user settings from /home/bamboo-agent/.m2/settings.xml [DEBUG] Reading global toolchains from /usr/share/apache-maven-3.3.9/conf/toolchains.xml [DEBUG] Reading user toolchains from /home/bamboo-agent/.m2/toolchains.xml [DEBUG] Using local repository at /home/bamboo-agent/.m2/repository [DEBUG] Using manager EnhancedLocalRepositoryManager with priority 10.0 for /home/bamboo-agent/.m2/repository [INFO] Scanning for projects... [DEBUG] Extension realms for project org.openmrs.maven.plugins:openmrs-packager-maven-plugin-config-test-parent:pom:1.0.0-SNAPSHOT: (none) [DEBUG] Looking up lifecyle mappings for packaging pom from ClassRealm[plexus.core, parent: null] [DEBUG] === REACTOR BUILD PLAN ================================================ [DEBUG] Project: org.openmrs.maven.plugins:openmrs-packager-maven-plugin-config-test-parent:pom:1.0.0-SNAPSHOT [DEBUG] Tasks:   [org.apache.maven.plugins:maven-clean-plugin:clean, compile] [DEBUG] Style:   Regular [DEBUG] ======================================================================= [INFO]                                                                          [INFO] ------------------------------------------------------------------------ [INFO] Building OpenMRS config parent test 1.0.0-SNAPSHOT [INFO] ------------------------------------------------------------------------ [DEBUG] Lifecycle default -> [validate, initialize, generate-sources, process-sources, generate-resources, process-resources, compile, process-classes, generate-test-sources, process-test-sources, generate-test-resources, process-test-resources, test-compile, process-test-classes, test, prepare-package, package, pre-integration-test, integration-test, post-integration-test, verify, install, deploy] [DEBUG] Lifecycle clean -> [pre-clean, clean, post-clean] [DEBUG] Lifecycle site -> [pre-site, site, post-site, site-deploy] [DEBUG] Could not find metadata org.openmrs.maven.plugins:openmrs-packager-maven-plugin:1.5.0-SNAPSHOT/maven-metadata.xml in local (/home/bamboo-agent/.m2/repository) [DEBUG] Could not find metadata org.openmrs.maven.plugins:openmrs-packager-maven-plugin:1.5.0-SNAPSHOT/maven-metadata.xml in local (/home/bamboo-agent/.m2/repository) [WARNING] The POM for org.openmrs.maven.plugins:openmrs-packager-maven-plugin:jar:1.5.0-SNAPSHOT is missing, no dependency information available [INFO] ------------------------------------------------------------------------ [INFO] BUILD FAILURE [INFO] ------------------------------------------------------------------------ [INFO] Total time: 0.273 s [INFO] Finished at: 2021-07-06T07:19:49+00:00 [INFO] Final Memory: 7M/106M [INFO] ------------------------------------------------------------------------ [ERROR] Plugin org.openmrs.maven.plugins:openmrs-packager-maven-plugin:1.5.0-SNAPSHOT or one of its dependencies could not be resolved: Could not find artifact org.openmrs.maven.plugins:openmrs-packager-maven-plugin:jar:1.5.0-SNAPSHOT -> [Help 1] org.apache.maven.plugin.PluginResolutionException: Plugin org.openmrs.maven.plugins:openmrs-packager-maven-plugin:1.5.0-SNAPSHOT or one of its dependencies could not be resolved: Could not find artifact org.openmrs.maven.plugins:openmrs-packager-maven-plugin:jar:1.5.0-SNAPSHOT  at org.apache.maven.plugin.internal.DefaultPluginDependenciesResolver.resolve(DefaultPluginDependenciesResolver.java:128)  at org.apache.maven.plugin.internal.DefaultMavenPluginManager.getPluginDescriptor(DefaultMavenPluginManager.java:179)  at org.apache.maven.plugin.internal.DefaultMavenPluginManager.getMojoDescriptor(DefaultMavenPluginManager.java:284)  at org.apache.maven.plugin.DefaultBuildPluginManager.getMojoDescriptor(DefaultBuildPluginManager.java:241)  at org.apache.maven.lifecycle.internal.DefaultLifecycleExecutionPlanCalculator.setupMojoExecution(DefaultLifecycleExecutionPlanCalculator.java:169)  at org.apache.maven.lifecycle.internal.DefaultLifecycleExecutionPlanCalculator.setupMojoExecutions(DefaultLifecycleExecutionPlanCalculator.java:155)  at org.apache.maven.lifecycle.internal.DefaultLifecycleExecutionPlanCalculator.calculateExecutionPlan(DefaultLifecycleExecutionPlanCalculator.java:131)  at org.apache.maven.lifecycle.internal.DefaultLifecycleExecutionPlanCalculator.calculateExecutionPlan(DefaultLifecycleExecutionPlanCalculator.java:145)  at org.apache.maven.lifecycle.internal.builder.BuilderCommon.resolveBuildPlan(BuilderCommon.java:96)  at org.apache.maven.lifecycle.internal.LifecycleModuleBuilder.buildProject(LifecycleModuleBuilder.java:109)  at org.apache.maven.lifecycle.internal.LifecycleModuleBuilder.buildProject(LifecycleModuleBuilder.java:80)  at org.apache.maven.lifecycle.internal.builder.singlethreaded.SingleThreadedBuilder.build(SingleThreadedBuilder.java:51)  at org.apache.maven.lifecycle.internal.LifecycleStarter.execute(LifecycleStarter.java:128)  at org.apache.maven.DefaultMaven.doExecute(DefaultMaven.java:307)  at org.apache.maven.DefaultMaven.doExecute(DefaultMaven.java:193)  at org.apache.maven.DefaultMaven.execute(DefaultMaven.java:106)  at org.apache.maven.cli.MavenCli.execute(MavenCli.java:863)  at org.apache.maven.cli.MavenCli.doMain(MavenCli.java:288)  at org.apache.maven.cli.MavenCli.main(MavenCli.java:199)  at sun.reflect.NativeMethodAccessorImpl.invoke0(Native Method)  at sun.reflect.NativeMethodAccessorImpl.invoke(NativeMethodAccessorImpl.java:62)  at sun.reflect.DelegatingMethodAccessorImpl.invoke(DelegatingMethodAccessorImpl.java:43)  at java.lang.reflect.Method.invoke(Method.java:498)  at org.codehaus.plexus.classworlds.launcher.Launcher.launchEnhanced(Launcher.java:289)  at org.codehaus.plexus.classworlds.launcher.Launcher.launch(Launcher.java:229)  at org.codehaus.plexus.classworlds.launcher.Launcher.mainWithExitCode(Launcher.java:415)  at org.codehaus.plexus.classworlds.launcher.Launcher.main(Launcher.java:356) Caused by: org.eclipse.aether.resolution.ArtifactResolutionException: Could not find artifact org.openmrs.maven.plugins:openmrs-packager-maven-plugin:jar:1.5.0-SNAPSHOT  at org.eclipse.aether.internal.impl.DefaultArtifactResolver.resolve(DefaultArtifactResolver.java:444)  at org.eclipse.aether.internal.impl.DefaultArtifactResolver.resolveArtifacts(DefaultArtifactResolver.java:246)  at org.eclipse.aether.internal.impl.DefaultArtifactResolver.resolveArtifact(DefaultArtifactResolver.java:223)  at org.eclipse.aether.internal.impl.DefaultRepositorySystem.resolveArtifact(DefaultRepositorySystem.java:294)  at org.apache.maven.plugin.internal.DefaultPluginDependenciesResolver.resolve(DefaultPluginDependenciesResolver.java:124)  ... 26 more Caused by: org.eclipse.aether.transfer.ArtifactNotFoundException: Could not find artifact org.openmrs.maven.plugins:openmrs-packager-maven-plugin:jar:1.5.0-SNAPSHOT  at org.eclipse.aether.internal.impl.DefaultArtifactResolver.resolve(DefaultArtifactResolver.java:434)  ... 30 more [ERROR]  [ERROR]  [ERROR] For more information about the errors and possible solutions, please read the following articles: [ERROR] [Help 1] http://cwiki.apache.org/confluence/display/MAVEN/PluginResolutionException 
org.apache.maven.it.VerificationException: Exit code was non-zero: 1; command line and log = 
/usr/share/apache-maven-3.3.9/bin/mvn -N -X -e --batch-mode -Dmaven.repo.local=/home/bamboo-agent/.m2/repository org.apache.maven.plugins:maven-clean-plugin:clean compile
Apache Maven 3.3.9 (bb52d8502b132ec0a5a3f4c09453c07478323dc5; 2015-11-10T16:41:47+00:00)
Maven home: /usr/share/apache-maven-3.3.9
Java version: 1.8.0_292, vendor: Private Build
Java home: /usr/lib/jvm/java-8-openjdk-amd64/jre
Default locale: en_US, platform encoding: UTF-8
(179 more lines...)
Collapse Failed PackageConfigurationsTest testConfigurationsPackagedIntoZip History
Default Job 3 secs
org.apache.maven.it.VerificationException: Exit code was non-zero: 1; command line and log =  /usr/share/apache-maven-3.3.9/bin/mvn -N -X -e --batch-mode -Dmaven.repo.local=/home/bamboo-agent/.m2/repository org.apache.maven.plugins:maven-clean-plugin:clean package Apache Maven 3.3.9 (bb52d8502b132ec0a5a3f4c09453c07478323dc5; 2015-11-10T16:41:47+00:00) Maven home: /usr/share/apache-maven-3.3.9 Java version: 1.8.0_292, vendor: Private Build Java home: /usr/lib/jvm/java-8-openjdk-amd64/jre Default locale: en_US, platform encoding: UTF-8 OS name: "linux", version: "4.4.0-210-generic", arch: "amd64", family: "unix" [DEBUG] Created new class realm maven.api [DEBUG] Importing foreign packages into class realm maven.api [DEBUG]   Imported: javax.enterprise.inject.* < plexus.core [DEBUG]   Imported: javax.enterprise.util.* < plexus.core [DEBUG]   Imported: javax.inject.* < plexus.core [DEBUG]   Imported: org.apache.maven.* < plexus.core [DEBUG]   Imported: org.apache.maven.artifact < plexus.core [DEBUG]   Imported: org.apache.maven.classrealm < plexus.core [DEBUG]   Imported: org.apache.maven.cli < plexus.core [DEBUG]   Imported: org.apache.maven.configuration < plexus.core [DEBUG]   Imported: org.apache.maven.exception < plexus.core [DEBUG]   Imported: org.apache.maven.execution < plexus.core [DEBUG]   Imported: org.apache.maven.execution.scope < plexus.core [DEBUG]   Imported: org.apache.maven.lifecycle < plexus.core [DEBUG]   Imported: org.apache.maven.model < plexus.core [DEBUG]   Imported: org.apache.maven.monitor < plexus.core [DEBUG]   Imported: org.apache.maven.plugin < plexus.core [DEBUG]   Imported: org.apache.maven.profiles < plexus.core [DEBUG]   Imported: org.apache.maven.project < plexus.core [DEBUG]   Imported: org.apache.maven.reporting < plexus.core [DEBUG]   Imported: org.apache.maven.repository < plexus.core [DEBUG]   Imported: org.apache.maven.rtinfo < plexus.core [DEBUG]   Imported: org.apache.maven.settings < plexus.core [DEBUG]   Imported: org.apache.maven.toolchain < plexus.core [DEBUG]   Imported: org.apache.maven.usability < plexus.core [DEBUG]   Imported: org.apache.maven.wagon.* < plexus.core [DEBUG]   Imported: org.apache.maven.wagon.authentication < plexus.core [DEBUG]   Imported: org.apache.maven.wagon.authorization < plexus.core [DEBUG]   Imported: org.apache.maven.wagon.events < plexus.core [DEBUG]   Imported: org.apache.maven.wagon.observers < plexus.core [DEBUG]   Imported: org.apache.maven.wagon.proxy < plexus.core [DEBUG]   Imported: org.apache.maven.wagon.repository < plexus.core [DEBUG]   Imported: org.apache.maven.wagon.resource < plexus.core [DEBUG]   Imported: org.codehaus.classworlds < plexus.core [DEBUG]   Imported: org.codehaus.plexus.* < plexus.core [DEBUG]   Imported: org.codehaus.plexus.classworlds < plexus.core [DEBUG]   Imported: org.codehaus.plexus.component < plexus.core [DEBUG]   Imported: org.codehaus.plexus.configuration < plexus.core [DEBUG]   Imported: org.codehaus.plexus.container < plexus.core [DEBUG]   Imported: org.codehaus.plexus.context < plexus.core [DEBUG]   Imported: org.codehaus.plexus.lifecycle < plexus.core [DEBUG]   Imported: org.codehaus.plexus.logging < plexus.core [DEBUG]   Imported: org.codehaus.plexus.personality < plexus.core [DEBUG]   Imported: org.codehaus.plexus.util.xml.Xpp3Dom < plexus.core [DEBUG]   Imported: org.codehaus.plexus.util.xml.pull.XmlPullParser < plexus.core [DEBUG]   Imported: org.codehaus.plexus.util.xml.pull.XmlPullParserException < plexus.core [DEBUG]   Imported: org.codehaus.plexus.util.xml.pull.XmlSerializer < plexus.core [DEBUG]   Imported: org.eclipse.aether.* < plexus.core [DEBUG]   Imported: org.eclipse.aether.artifact < plexus.core [DEBUG]   Imported: org.eclipse.aether.collection < plexus.core [DEBUG]   Imported: org.eclipse.aether.deployment < plexus.core [DEBUG]   Imported: org.eclipse.aether.graph < plexus.core [DEBUG]   Imported: org.eclipse.aether.impl < plexus.core [DEBUG]   Imported: org.eclipse.aether.installation < plexus.core [DEBUG]   Imported: org.eclipse.aether.internal.impl < plexus.core [DEBUG]   Imported: org.eclipse.aether.metadata < plexus.core [DEBUG]   Imported: org.eclipse.aether.repository < plexus.core [DEBUG]   Imported: org.eclipse.aether.resolution < plexus.core [DEBUG]   Imported: org.eclipse.aether.spi < plexus.core [DEBUG]   Imported: org.eclipse.aether.transfer < plexus.core [DEBUG]   Imported: org.eclipse.aether.version < plexus.core [DEBUG]   Imported: org.slf4j.* < plexus.core [DEBUG]   Imported: org.slf4j.helpers.* < plexus.core [DEBUG]   Imported: org.slf4j.spi.* < plexus.core [DEBUG] Populating class realm maven.api [INFO] Error stacktraces are turned on. [DEBUG] Reading global settings from /usr/share/apache-maven-3.3.9/conf/settings.xml [DEBUG] Reading user settings from /home/bamboo-agent/.m2/settings.xml [DEBUG] Reading global toolchains from /usr/share/apache-maven-3.3.9/conf/toolchains.xml [DEBUG] Reading user toolchains from /home/bamboo-agent/.m2/toolchains.xml [DEBUG] Using local repository at /home/bamboo-agent/.m2/repository [DEBUG] Using manager EnhancedLocalRepositoryManager with priority 10.0 for /home/bamboo-agent/.m2/repository [INFO] Scanning for projects... [DEBUG] Extension realms for project org.openmrs.maven.plugins:openmrs-packager-maven-plugin-config-test-parent:pom:1.0.0-SNAPSHOT: (none) [DEBUG] Looking up lifecyle mappings for packaging pom from ClassRealm[plexus.core, parent: null] [DEBUG] === REACTOR BUILD PLAN ================================================ [DEBUG] Project: org.openmrs.maven.plugins:openmrs-packager-maven-plugin-config-test-parent:pom:1.0.0-SNAPSHOT [DEBUG] Tasks:   [org.apache.maven.plugins:maven-clean-plugin:clean, package] [DEBUG] Style:   Regular [DEBUG] ======================================================================= [INFO]                                                                          [INFO] ------------------------------------------------------------------------ [INFO] Building OpenMRS config parent test 1.0.0-SNAPSHOT [INFO] ------------------------------------------------------------------------ [DEBUG] Lifecycle default -> [validate, initialize, generate-sources, process-sources, generate-resources, process-resources, compile, process-classes, generate-test-sources, process-test-sources, generate-test-resources, process-test-resources, test-compile, process-test-classes, test, prepare-package, package, pre-integration-test, integration-test, post-integration-test, verify, install, deploy] [DEBUG] Lifecycle clean -> [pre-clean, clean, post-clean] [DEBUG] Lifecycle site -> [pre-site, site, post-site, site-deploy] [DEBUG] Could not find metadata org.openmrs.maven.plugins:openmrs-packager-maven-plugin:1.5.0-SNAPSHOT/maven-metadata.xml in local (/home/bamboo-agent/.m2/repository) [DEBUG] Could not find metadata org.openmrs.maven.plugins:openmrs-packager-maven-plugin:1.5.0-SNAPSHOT/maven-metadata.xml in local (/home/bamboo-agent/.m2/repository) [WARNING] The POM for org.openmrs.maven.plugins:openmrs-packager-maven-plugin:jar:1.5.0-SNAPSHOT is missing, no dependency information available [INFO] ------------------------------------------------------------------------ [INFO] BUILD FAILURE [INFO] ------------------------------------------------------------------------ [INFO] Total time: 0.187 s [INFO] Finished at: 2021-07-06T07:20:13+00:00 [INFO] Final Memory: 7M/106M [INFO] ------------------------------------------------------------------------ [ERROR] Plugin org.openmrs.maven.plugins:openmrs-packager-maven-plugin:1.5.0-SNAPSHOT or one of its dependencies could not be resolved: Could not find artifact org.openmrs.maven.plugins:openmrs-packager-maven-plugin:jar:1.5.0-SNAPSHOT -> [Help 1] org.apache.maven.plugin.PluginResolutionException: Plugin org.openmrs.maven.plugins:openmrs-packager-maven-plugin:1.5.0-SNAPSHOT or one of its dependencies could not be resolved: Could not find artifact org.openmrs.maven.plugins:openmrs-packager-maven-plugin:jar:1.5.0-SNAPSHOT  at org.apache.maven.plugin.internal.DefaultPluginDependenciesResolver.resolve(DefaultPluginDependenciesResolver.java:128)  at org.apache.maven.plugin.internal.DefaultMavenPluginManager.getPluginDescriptor(DefaultMavenPluginManager.java:179)  at org.apache.maven.plugin.internal.DefaultMavenPluginManager.getMojoDescriptor(DefaultMavenPluginManager.java:284)  at org.apache.maven.plugin.DefaultBuildPluginManager.getMojoDescriptor(DefaultBuildPluginManager.java:241)  at org.apache.maven.lifecycle.internal.DefaultLifecycleExecutionPlanCalculator.setupMojoExecution(DefaultLifecycleExecutionPlanCalculator.java:169)  at org.apache.maven.lifecycle.internal.DefaultLifecycleExecutionPlanCalculator.setupMojoExecutions(DefaultLifecycleExecutionPlanCalculator.java:155)  at org.apache.maven.lifecycle.internal.DefaultLifecycleExecutionPlanCalculator.calculateExecutionPlan(DefaultLifecycleExecutionPlanCalculator.java:131)  at org.apache.maven.lifecycle.internal.DefaultLifecycleExecutionPlanCalculator.calculateExecutionPlan(DefaultLifecycleExecutionPlanCalculator.java:145)  at org.apache.maven.lifecycle.internal.builder.BuilderCommon.resolveBuildPlan(BuilderCommon.java:96)  at org.apache.maven.lifecycle.internal.LifecycleModuleBuilder.buildProject(LifecycleModuleBuilder.java:109)  at org.apache.maven.lifecycle.internal.LifecycleModuleBuilder.buildProject(LifecycleModuleBuilder.java:80)  at org.apache.maven.lifecycle.internal.builder.singlethreaded.SingleThreadedBuilder.build(SingleThreadedBuilder.java:51)  at org.apache.maven.lifecycle.internal.LifecycleStarter.execute(LifecycleStarter.java:128)  at org.apache.maven.DefaultMaven.doExecute(DefaultMaven.java:307)  at org.apache.maven.DefaultMaven.doExecute(DefaultMaven.java:193)  at org.apache.maven.DefaultMaven.execute(DefaultMaven.java:106)  at org.apache.maven.cli.MavenCli.execute(MavenCli.java:863)  at org.apache.maven.cli.MavenCli.doMain(MavenCli.java:288)  at org.apache.maven.cli.MavenCli.main(MavenCli.java:199)  at sun.reflect.NativeMethodAccessorImpl.invoke0(Native Method)  at sun.reflect.NativeMethodAccessorImpl.invoke(NativeMethodAccessorImpl.java:62)  at sun.reflect.DelegatingMethodAccessorImpl.invoke(DelegatingMethodAccessorImpl.java:43)  at java.lang.reflect.Method.invoke(Method.java:498)  at org.codehaus.plexus.classworlds.launcher.Launcher.launchEnhanced(Launcher.java:289)  at org.codehaus.plexus.classworlds.launcher.Launcher.launch(Launcher.java:229)  at org.codehaus.plexus.classworlds.launcher.Launcher.mainWithExitCode(Launcher.java:415)  at org.codehaus.plexus.classworlds.launcher.Launcher.main(Launcher.java:356) Caused by: org.eclipse.aether.resolution.ArtifactResolutionException: Could not find artifact org.openmrs.maven.plugins:openmrs-packager-maven-plugin:jar:1.5.0-SNAPSHOT  at org.eclipse.aether.internal.impl.DefaultArtifactResolver.resolve(DefaultArtifactResolver.java:444)  at org.eclipse.aether.internal.impl.DefaultArtifactResolver.resolveArtifacts(DefaultArtifactResolver.java:246)  at org.eclipse.aether.internal.impl.DefaultArtifactResolver.resolveArtifact(DefaultArtifactResolver.java:223)  at org.eclipse.aether.internal.impl.DefaultRepositorySystem.resolveArtifact(DefaultRepositorySystem.java:294)  at org.apache.maven.plugin.internal.DefaultPluginDependenciesResolver.resolve(DefaultPluginDependenciesResolver.java:124)  ... 26 more Caused by: org.eclipse.aether.transfer.ArtifactNotFoundException: Could not find artifact org.openmrs.maven.plugins:openmrs-packager-maven-plugin:jar:1.5.0-SNAPSHOT  at org.eclipse.aether.internal.impl.DefaultArtifactResolver.resolve(DefaultArtifactResolver.java:434)  ... 30 more [ERROR]  [ERROR]  [ERROR] For more information about the errors and possible solutions, please read the following articles: [ERROR] [Help 1] http://cwiki.apache.org/confluence/display/MAVEN/PluginResolutionException 
org.apache.maven.it.VerificationException: Exit code was non-zero: 1; command line and log = 
/usr/share/apache-maven-3.3.9/bin/mvn -N -X -e --batch-mode -Dmaven.repo.local=/home/bamboo-agent/.m2/repository org.apache.maven.plugins:maven-clean-plugin:clean package
Apache Maven 3.3.9 (bb52d8502b132ec0a5a3f4c09453c07478323dc5; 2015-11-10T16:41:47+00:00)
Maven home: /usr/share/apache-maven-3.3.9
Java version: 1.8.0_292, vendor: Private Build
Java home: /usr/lib/jvm/java-8-openjdk-amd64/jre
Default locale: en_US, platform encoding: UTF-8
(179 more lines...)