Build #2,214

More details of the release in https://wiki.openmrs.org/x/i4DTAw

Build: #2214 failed Changes by dkayiwa <kayiwadaniel@gmail.com>

Stages & jobs

  1. Default Stage

  2. Release

    Requires a user to start manually

Build result summary

Details

Completed
Duration
1 minute
Labels
None
Revisions
Git
d60b41b10c4233a4aea2ecd782a62a1ea215910d d60b41b10c4233a4aea2ecd782a62a1ea215910d
Release scripts
63acfae3024f50d743ed89da44c014b3f2c7cff6 63acfae3024f50d743ed89da44c014b3f2c7cff6
Total tests
385
Failing since
#2213 (Run by child build REFAPP-OMODDISTRO)
Fixed in
#2218 (Manual run by Daniel Kayiwa)

Tests

Responsible

This build has been failing since #2213
No one has taken responsibility

Code commits

Git
Author Commit Message Commit date
dkayiwa <kayiwadaniel@gmail.com> dkayiwa <kayiwadaniel@gmail.com> d60b41b10c4233a4aea2ecd782a62a1ea215910d d60b41b10c4233a4aea2ecd782a62a1ea215910d Third debug commit for bamboo failing test - TRUNK-5342

Tests

New test failures 2
Status Test View job Duration
Collapse Failed DiagnosisServiceComponentTest getDiagnosesShouldReturnDiagnosesInReverseChronologicalOrder History
Default Job < 1 sec
java.lang.AssertionError:  Expected: is <Obs #1026>      but: was <Obs #1034>
java.lang.AssertionError: 
Expected: is <Obs #1026>
     but: was <Obs #1034>
	at org.hamcrest.MatcherAssert.assertThat(MatcherAssert.java:20)
	at org.junit.Assert.assertThat(Assert.java:865)
	at org.junit.Assert.assertThat(Assert.java:832)
	at org.openmrs.module.emrapi.diagnosis.DiagnosisServiceComponentTest.getDiagnosesShouldReturnDiagnosesInReverseChronologicalOrder(DiagnosisServiceComponentTest.java:147)
(35 more lines...)
Collapse Failed DiagnosisServiceComponentTest getDiagnosesShouldReturnDiagnosesAfterDate History
Default Job < 1 sec
java.lang.AssertionError:  Expected: iterable containing [obs is <Obs #1038>]      but: Not matched: <non-coded pain, PRESUMED, PRIMARY>
java.lang.AssertionError: 
Expected: iterable containing [obs is <Obs #1038>]
     but: Not matched: <non-coded pain, PRESUMED, PRIMARY>
	at org.hamcrest.MatcherAssert.assertThat(MatcherAssert.java:20)
	at org.junit.Assert.assertThat(Assert.java:865)
	at org.junit.Assert.assertThat(Assert.java:832)
	at org.openmrs.module.emrapi.diagnosis.DiagnosisServiceComponentTest.getDiagnosesShouldReturnDiagnosesAfterDate(DiagnosisServiceComponentTest.java:133)
(35 more lines...)

Jira issues

IssueDescriptionStatus
Unknown Issue TypeTRUNK-5342Could not obtain issue details from Jira