Build #2,257

More details of the release in https://wiki.openmrs.org/x/i4DTAw

Build: #2257 failed Child of RESTWS-RESTWS-786

Stages & jobs

  1. Default Stage

  2. Release

    Requires a user to start manually

Build result summary

Details

Completed
Duration
16 minutes
Labels
None
Revisions
Git
c34ca575794c751e05b426570eebe34c1e5684de c34ca575794c751e05b426570eebe34c1e5684de
Release scripts
88c804f1da6143fe9bc0737eb8de78d56ac59c2b 88c804f1da6143fe9bc0737eb8de78d56ac59c2b
Total tests
385
Fixed in
#2258 (Changes by Samuel Male <samuelsmalek@gmail.com>)

Tests

Responsible

No one has taken responsibility for this failure

Tests

New test failures 94
Status Test View job Duration
Collapse Failed EmrApiActivatorComponentTest confirmThatUnknownProviderCreated History
Default Job < 1 sec
org.dbunit.dataset.NoSuchTableException: person
Collapse Failed EmrApiActivatorComponentTest testExtraPatientIdentifierTypesMappedToSet History
Default Job < 1 sec
org.dbunit.dataset.NoSuchTableException: person
Collapse Failed EmrApiActivatorComponentTest shouldCreateMappingIfProviderAlreadyExistsForEmrApiGlobalProperty History
Default Job < 1 sec
org.dbunit.dataset.NoSuchTableException: person
Collapse Failed EmrApiActivatorComponentTest testMetadataMappingsCreated History
Default Job < 1 sec
org.dbunit.dataset.NoSuchTableException: person
Collapse Failed EmrApiActivatorComponentTest shouldCreateMappingIfProviderAlreadyExistsForCoreGlobalProperty History
Default Job < 1 sec
org.dbunit.dataset.NoSuchTableException: person
Collapse Failed EmrApiActivatorComponentTest confirmThatMetadataSourceIsCreated History
Default Job < 1 sec
org.dbunit.dataset.NoSuchTableException: person
Collapse Failed EmrApiActivatorComponentTest testPrivilegeLevelsCreated History
Default Job < 1 sec
org.dbunit.dataset.NoSuchTableException: person
Collapse Failed AccountComponentTest shouldRetireExistingUser History
Default Job < 1 sec
org.dbunit.dataset.NoSuchTableException: person
Collapse Failed AccountComponentTest shouldHandlePersonWithoutUser History
Default Job < 1 sec
org.dbunit.dataset.NoSuchTableException: person
Collapse Failed AccountComponentTest shouldLoadExistingPersonAndUserAndProvider History
Default Job < 1 sec
org.dbunit.dataset.NoSuchTableException: person
Collapse Failed AccountComponentTest shouldSavePerson History
Default Job < 1 sec
org.dbunit.dataset.NoSuchTableException: person
Collapse Failed AccountComponentTest shouldUnretireExistingUser History
Default Job < 1 sec
org.dbunit.dataset.NoSuchTableException: person
Collapse Failed AccountComponentTest shouldSetProviderRoleToNull History
Default Job < 1 sec
org.dbunit.dataset.NoSuchTableException: person
Collapse Failed AccountComponentTest shouldSavePersonAndUserAndProvider History
Default Job < 1 sec
org.dbunit.dataset.NoSuchTableException: person
Collapse Failed AccountDomainWrapperComponentTest testThatBeanCanHavePropertiesAutowired History
Default Job < 1 sec
org.dbunit.dataset.NoSuchTableException: person
Collapse Failed AdtServiceComponentTest test_shouldNotCloseVisitOpenedInDifferentLocation History
Default Job < 1 sec
org.dbunit.dataset.NoSuchTableException: person
Collapse Failed AdtServiceComponentTest test_MergePatientsWithOverlappingVisits History
Default Job < 1 sec
org.dbunit.dataset.NoSuchTableException: person
Collapse Failed AdtServiceComponentTest integrationTest_ADT_workflow_duplicate_visits History
Default Job < 1 sec
org.dbunit.dataset.NoSuchTableException: person
Collapse Failed AdtServiceComponentTest test_shouldCloseActiveVisits History
Default Job < 1 sec
org.dbunit.dataset.NoSuchTableException: person
Collapse Failed AdtServiceComponentTest integrationTest_ADT_workflow History
Default Job < 1 sec
org.dbunit.dataset.NoSuchTableException: person
Collapse Failed AdtServiceComponentTest test_shouldNotCloseVisitIfMostRecentDispositionKeepsVisitOpen History
Default Job < 1 sec
org.dbunit.dataset.NoSuchTableException: person
Collapse Failed AdtServiceComponentTest integrationTest_createRetrospectiveVisit History
Default Job < 1 sec
org.dbunit.dataset.NoSuchTableException: person
Collapse Failed EncounterTypeToVisitTypeMapperTest testMappingWithNoMappingString History
Default Job < 1 sec
org.dbunit.dataset.NoSuchTableException: person
Collapse Failed EncounterTypeToVisitTypeMapperTest testMappingWithDefaultEncounterTypeMapping History
Default Job < 1 sec
org.dbunit.dataset.NoSuchTableException: person
Collapse Failed EncounterTypeToVisitTypeMapperTest testMappingWithDefaultEncounterTypeMappingOverrideWithDefaultLast History
Default Job < 1 sec
org.dbunit.dataset.NoSuchTableException: person
Collapse Failed EncounterTypeToVisitTypeMapperTest testMappingWithEncounterTypeUuids History
Default Job < 1 sec
org.dbunit.dataset.NoSuchTableException: person
Collapse Failed EncounterTypeToVisitTypeMapperTest testMappingWithEncounterTypeIds History
Default Job < 1 sec
org.dbunit.dataset.NoSuchTableException: person
Collapse Failed EncounterTypeToVisitTypeMapperTest testMappingWithDefaultEncounterTypeMappingOverride History
Default Job < 1 sec
org.dbunit.dataset.NoSuchTableException: person
Collapse Failed AwaitingAdmissionVisitQueryEvaluatorTest shouldFindVisitWithDispositionOfAdmitIfFollowedByAdmissionDenialObsFollowedByAnotherAdmissionDisposition History
Default Job < 1 sec
org.dbunit.dataset.NoSuchTableException: person
Collapse Failed AwaitingAdmissionVisitQueryEvaluatorTest shouldNotReturnSameVisitTwice History
Default Job < 1 sec
org.dbunit.dataset.NoSuchTableException: person
Collapse Failed AwaitingAdmissionVisitQueryEvaluatorTest shouldFindVisitWithDispositionOfAdmitIfFollowedByAdmissionDenialObsThatIsVoided History
Default Job < 1 sec
org.dbunit.dataset.NoSuchTableException: person
Collapse Failed AwaitingAdmissionVisitQueryEvaluatorTest shouldNotFindVisitWithDispositionOfAdmitIfFollowedByAdmissionDenialObsFollowedByAnotherAdmissionDispositionFollowedByAnotherAdmissionDenial History
Default Job < 1 sec
org.dbunit.dataset.NoSuchTableException: person
Collapse Failed AwaitingAdmissionVisitQueryEvaluatorTest shouldNotFindVisitAwaitingAdmissionIfVisitNotInContext History
Default Job < 1 sec
org.dbunit.dataset.NoSuchTableException: person
Collapse Failed AwaitingAdmissionVisitQueryEvaluatorTest shouldNotFindVisitIfNoAdmitDisposition History
Default Job < 1 sec
org.dbunit.dataset.NoSuchTableException: person
Collapse Failed AwaitingAdmissionVisitQueryEvaluatorTest shouldFindVisitWithDispositionOfAdmitIfFollowedByAdmissionDecisionThatIsNotDeny History
Default Job < 1 sec
org.dbunit.dataset.NoSuchTableException: person
Collapse Failed AwaitingAdmissionVisitQueryEvaluatorTest shouldFindVisitEvenIfPatientHasMoreRecentVisitNoteWithoutAdmissionDisposition History
Default Job < 1 sec
org.dbunit.dataset.NoSuchTableException: person
Collapse Failed AwaitingAdmissionVisitQueryEvaluatorTest shouldFindVisitIfAtSameLocation History
Default Job < 1 sec
org.dbunit.dataset.NoSuchTableException: person
Collapse Failed AwaitingAdmissionVisitQueryEvaluatorTest shouldNotFindVisitWithDispositionOfAdmitIfFollowedByAdmissionDenialObs History
Default Job < 1 sec
org.dbunit.dataset.NoSuchTableException: person
Collapse Failed AwaitingAdmissionVisitQueryEvaluatorTest shouldNotFindVisitAwaitingAdmissionIfPatientNotInContext History
Default Job < 1 sec
org.dbunit.dataset.NoSuchTableException: person
Collapse Failed AwaitingAdmissionVisitQueryEvaluatorTest shouldFindVisitWithDispositionOfAdmitIfPrecededByAdmissionDenialObs History
Default Job < 1 sec
org.dbunit.dataset.NoSuchTableException: person
Collapse Failed AwaitingAdmissionVisitQueryEvaluatorTest shouldNotFindVisitIfPatientAdmitted History
Default Job < 1 sec
org.dbunit.dataset.NoSuchTableException: person
Collapse Failed AwaitingAdmissionVisitQueryEvaluatorTest shouldNotConsiderVoidedAdmissionEncounter History
Default Job < 1 sec
org.dbunit.dataset.NoSuchTableException: person
Collapse Failed AwaitingAdmissionVisitQueryEvaluatorTest shouldNotFindVisitAwaitingAdmissionIfPatientIsDead History
Default Job < 1 sec
org.dbunit.dataset.NoSuchTableException: person
Collapse Failed AwaitingAdmissionVisitQueryEvaluatorTest shouldNotCountDispositionOnVoidedEncounter History
Default Job < 1 sec
org.dbunit.dataset.NoSuchTableException: person
Collapse Failed AwaitingAdmissionVisitQueryEvaluatorTest shouldFindVisitAwaitingAdmission History
Default Job < 1 sec
org.dbunit.dataset.NoSuchTableException: person
Collapse Failed AwaitingAdmissionVisitQueryEvaluatorTest shouldNotFindVisitIfAtAnotherLocation History
Default Job < 1 sec
org.dbunit.dataset.NoSuchTableException: person
Collapse Failed MostRecentAdmissionRequestVisitDataEvaluatorTest shouldReturnMostRecentAdmissionRequestForVisit History
Default Job < 1 sec
org.dbunit.dataset.NoSuchTableException: person
Collapse Failed EmrConceptServiceComponentTest testGetConceptsSameOrNarrowerThanTerm History
Default Job < 1 sec
org.dbunit.dataset.NoSuchTableException: person
Collapse Failed EmrConceptServiceComponentTest testConceptSearchByIcd10Code History
Default Job < 1 sec
org.dbunit.dataset.NoSuchTableException: person
Collapse Failed EmrConceptServiceComponentTest testConceptSearchInAnotherLocale History
Default Job < 1 sec
org.dbunit.dataset.NoSuchTableException: person