Builds, runs unit tests and deploys artifacts to nexus repo

Build: #102 failed

Job: Default Job failed

Stages & jobs

  1. Default Stage

Job result summary

Completed
Duration
3 minutes
Revision
e31395026470c9b42e8da8455906b3ecc4cc1e1c e31395026470c9b42e8da8455906b3ecc4cc1e1c
Total tests
404
Fixed in
#103 (Code changes detected)

Tests

  • 404 tests in total
  • 3 tests failed
  • 3 failures are new
  • 2 minutes taken in total.
New test failures 3
Status Test Duration
Collapse Failed RegressionTest viewEmptyEncounterSuccess History
< 1 sec
java.lang.AssertionError: Date:01/02/2003 Location:Xanadu Provider:Hippocrates of Cos does not match <div class="htmlform">  Date: <span id='encounterDate'><span class="value">01/02/2003</span></span>  Location: <span id='encounterLocation'><span class="value">Xanadu</span></span>  Provider: <span id='encounterProvider'><span class="value">Hippocrates of Cos</span></span>   </div>
java.lang.AssertionError: Date:01/02/2003 Location:Xanadu Provider:Hippocrates of Cos does not match <div class="htmlform">
	Date: <span id='encounterDate'><span class="value">01/02/2003</span></span>
	Location: <span id='encounterLocation'><span class="value">Xanadu</span></span>
	Provider: <span id='encounterProvider'><span class="value">Hippocrates of Cos</span></span>
	
</div>
	at org.junit.Assert.fail(Assert.java:74)
(33 more lines...)
Collapse Failed RegressionTest viewSingleObsEncounterSuccess History
< 1 sec
java.lang.AssertionError: Date:01/02/2003 Location:Xanadu Provider:Hippocrates of Cos Weight:12.3 does not match <div class="htmlform">  Date: <span id='encounterDate'><span class="value">01/02/2003</span></span>  Location: <span id='encounterLocation'><span class="value">Xanadu</span></span>  Provider: <span id='encounterProvider'><span class="value">Hippocrates of Cos</span></span>  Weight: <span class="value">12.3</span>   </div>
java.lang.AssertionError: Date:01/02/2003 Location:Xanadu Provider:Hippocrates of Cos Weight:12.3 does not match <div class="htmlform">
	Date: <span id='encounterDate'><span class="value">01/02/2003</span></span>
	Location: <span id='encounterLocation'><span class="value">Xanadu</span></span>
	Provider: <span id='encounterProvider'><span class="value">Hippocrates of Cos</span></span>
	Weight: <span class="value">12.3</span>
	
</div>
(34 more lines...)
Collapse Failed RegressionTest viewSingleObsEncounterWithObsOfAnotherConcept History
< 1 sec
java.lang.AssertionError: Date:01/02/2003 Location:Xanadu Provider:Hippocrates of Cos Weight: does not match <div class="htmlform">  Date: <span id='encounterDate'><span class="value">01/02/2003</span></span>  Location: <span id='encounterLocation'><span class="value">Xanadu</span></span>  Provider: <span id='encounterProvider'><span class="value">Hippocrates of Cos</span></span>  Weight: <span class="emptyValue">____</span>   </div>
java.lang.AssertionError: Date:01/02/2003 Location:Xanadu Provider:Hippocrates of Cos Weight: does not match <div class="htmlform">
	Date: <span id='encounterDate'><span class="value">01/02/2003</span></span>
	Location: <span id='encounterLocation'><span class="value">Xanadu</span></span>
	Provider: <span id='encounterProvider'><span class="value">Hippocrates of Cos</span></span>
	Weight: <span class="emptyValue">____</span>
	
</div>
(34 more lines...)

Error summary

The build generated some errors. See the full build log for more details.

[INFO] ------------------------------------------------------------------------
[ERROR] BUILD FAILURE
[INFO] ------------------------------------------------------------------------
[INFO] There are test failures.

Please refer to /opt/bamboo-agent/agent1-home/xml-data/build-dir/HTML-HTML-JOB1/api/target/surefire-reports for the individual test results.
[INFO] ------------------------------------------------------------------------
[INFO] For more information, run Maven with the -e switch