Build: #198 failed Changes by mgoodrich <mark.goodrich@live.com>

Stages & jobs

  1. Default Stage

  2. Release

    Requires a user to start manually

Build result summary

Details

Completed
Duration
3 minutes
Labels
None
Revisions
Git
92f6944692b09855703a6f7c7c3226d0a385253e 92f6944692b09855703a6f7c7c3226d0a385253e
Release scripts
c56cad8f5570dd7670aa2b5f8fec893ae4606be9 c56cad8f5570dd7670aa2b5f8fec893ae4606be9
Total tests
131
Fixed in
#199 (Changes by mgoodrich <mark.goodrich@live.com>)

Tests

Responsible

No one has taken responsibility for this failure

Code commits

Git
Author Commit Message Commit date
mgoodrich <mark.goodrich@live.com> mgoodrich <mark.goodrich@live.com> 92f6944692b09855703a6f7c7c3226d0a385253e 92f6944692b09855703a6f7c7c3226d0a385253e MAP-33: Add one-liner for updating/creating a mapping/set

Tests

New test failures 3
Status Test View job Duration
Collapse Failed MetadataSetResourceOperationTest shouldGetAll History
Default Job < 1 sec
java.lang.AssertionError: expected:<2> but was:<3>
	at org.junit.Assert.fail(Assert.java:88)
	at org.junit.Assert.failNotEquals(Assert.java:743)
	at org.junit.Assert.assertEquals(Assert.java:118)
	at org.junit.Assert.assertEquals(Assert.java:555)
	at org.junit.Assert.assertEquals(Assert.java:542)
	at org.openmrs.module.webservices.rest.web.v1_0.controller.MainResourceControllerTest.shouldGetAll(MainResourceControllerTest.java:205)
	at sun.reflect.NativeMethodAccessorImpl.invoke0(Native Method)
(36 more lines...)
Collapse Failed MetadataTermMappingResourceOperationTest search_shouldSupportAllSearchParameters History
Default Job < 1 sec
java.lang.AssertionError: default parameters expected:<8> but was:<9>
	at org.junit.Assert.fail(Assert.java:88)
	at org.junit.Assert.failNotEquals(Assert.java:743)
	at org.junit.Assert.assertEquals(Assert.java:118)
	at org.junit.Assert.assertEquals(Assert.java:555)
	at org.openmrs.module.metadatamapping.web.rest.MetadataTermMappingResourceOperationTest.search_shouldSupportAllSearchParameters(MetadataTermMappingResourceOperationTest.java:169)
	at sun.reflect.NativeMethodAccessorImpl.invoke0(Native Method)
	at sun.reflect.NativeMethodAccessorImpl.invoke(NativeMethodAccessorImpl.java:57)
(35 more lines...)
Collapse Failed MetadataTermMappingResourceOperationTest shouldGetAll History
Default Job < 1 sec
java.lang.AssertionError: expected:<8> but was:<9>
	at org.junit.Assert.fail(Assert.java:88)
	at org.junit.Assert.failNotEquals(Assert.java:743)
	at org.junit.Assert.assertEquals(Assert.java:118)
	at org.junit.Assert.assertEquals(Assert.java:555)
	at org.junit.Assert.assertEquals(Assert.java:542)
	at org.openmrs.module.webservices.rest.web.v1_0.controller.MainResourceControllerTest.shouldGetAll(MainResourceControllerTest.java:205)
	at sun.reflect.NativeMethodAccessorImpl.invoke0(Native Method)
(36 more lines...)

Jira issues

IssueDescriptionStatus
Unknown Issue TypeMAP-33Could not obtain issue details from Jira