Build: #189 failed Rebuilt by Rafal Korytkowski

Build result summary

Details

Completed
Duration
8 minutes
Labels
None
Revision
4d6776381d74fc313ab74bc1a416f7250fd9b3eb 4d6776381d74fc313ab74bc1a416f7250fd9b3eb
Fixed in
#190 (Manual run by Rafal Korytkowski)
Number of retries
1
No failed test found. A possible compilation error occurred.

Responsible

No one has taken responsibility for this failure

Error summary for Run integration tests

The job generated some errors, drill down into the full build log for more details.

  return Response({'detail': ex.message}, status=status.HTTP_400_BAD_REQUEST)

INFO 2018/11/27 03:35:27 [middlewares.py:32 process_response()] 0.028076171875 sec DELETE /orgs/org1/ : 400
ERROR 2018/11/27 03:35:27 [log.py:278 log()] {"detail": "Source 5bfd01ceb14fba00018fefb9 cannot be deleted because others have created mapping or references that point to it.\n                To delete this source, you must first delete all linked mappings and references and try again."}, - 400
.INFO 2018/11/27 03:35:28 [middlewares.py:22 process_request()] superuser 127.0.0.1 DELETE /orgs/org1/
INFO 2018/11/27 03:35:28 [middlewares.py:35 process_response()] 0.0265769958496 sec DELETE /orgs/org1/ : 200
.INFO 2018/11/27 03:35:29 [middlewares.py:22 process_request()] user1 127.0.0.1 DELETE /orgs/org1/sources/source/
/code/sources/views.py:120: DeprecationWarning: BaseException.message has been deprecated as of Python 2.6
  return Response({'detail': ex.message}, status=status.HTTP_400_BAD_REQUEST)

WARNING 2018/11/27 03:35:29 [views.py:120 destroy()] /code/sources/views.py:120: DeprecationWarning: BaseException.message has been deprecated as of Python 2.6
  return Response({'detail': ex.message}, status=status.HTTP_400_BAD_REQUEST)

INFO 2018/11/27 03:35:29 [middlewares.py:32 process_response()] 0.0377969741821 sec DELETE /orgs/org1/sources/source/ : 400
ERROR 2018/11/27 03:35:29 [log.py:278 log()] {"detail": "Source 5bfd01d1b14fba00018ff07e cannot be deleted because others have created mapping or references that point to it.\n                To delete this source, you must first delete all linked mappings and references and try again."}, - 400
.INFO 2018/11/27 03:35:30 [middlewares.py:22 process_request()] user1 127.0.0.1 DELETE /orgs/org1/sources/source/
INFO 2018/11/27 03:35:30 [middlewares.py:32 process_response()] 0.0133700370789 sec DELETE /orgs/org1/sources/source/ : 400
ERROR 2018/11/27 03:35:30 [log.py:278 log()] {"detail": "Source 5bfd01d2b14fba00018ff0e3 cannot be deleted because others have created mapping or references that point to it.\n                To delete this source, you must first delete all linked mappings and references and try again."}, - 400
.INFO 2018/11/27 03:35:31 [middlewares.py:22 process_request()] user1 127.0.0.1 DELETE /orgs/org1/sources/source/
INFO 2018/11/27 03:35:31 [middlewares.py:32 process_response()] 0.0163929462433 sec DELETE /orgs/org1/sources/source/ : 400
ERROR 2018/11/27 03:35:31 [log.py:278 log()] {"detail": "Source 5bfd01d3b14fba00018ff143 cannot be deleted because others have created mapping or references that point to it.\n                To delete this source, you must first delete all linked mappings and references and try again."}, - 400
.INFO 2018/11/27 03:35:32 [middlewares.py:22 process_request()] user1 127.0.0.1 GET /orgs/org1/sources/source/versionnotexist/export/
INFO 2018/11/27 03:35:32 [middlewares.py:32 process_response()] 0.00840210914612 sec GET /orgs/org1/sources/source/versionnotexist/export/ : 404
ERROR 2018/11/27 03:35:32 [log.py:278 log()] {"detail": "Not found"}, - 404
.INFO 2018/11/27 03:35:34 [middlewares.py:22 process_request()] user1 127.0.0.1 GET /orgs/org1/sources/source/version1/export/
DEBUG 2018/11/27 03:35:34 [views.py:374 get()] Export requested for source version version1 - Requesting AWS-S3 key
DEBUG 2018/11/27 03:35:34 [views.py:374 get()] Export requested for source version version1 - Requesting AWS-S3 key
DEBUG 2018/11/27 03:35:34 [views.py:386 get()]    Key does not exist for source version version1
DEBUG 2018/11/27 03:35:34 [views.py:386 get()]    Key does not exist for source version version1
INFO 2018/11/27 03:35:34 [middlewares.py:35 process_response()] 0.0197429656982 sec GET /orgs/org1/sources/source/version1/export/ : 204
.INFO 2018/11/27 03:35:35 [middlewares.py:22 process_request()] user1 127.0.0.1 GET /orgs/org1/sources/source/HEAD/export/
DEBUG 2018/11/27 03:35:35 [views.py:374 get()] Export requested for source version HEAD - Requesting AWS-S3 key
DEBUG 2018/11/27 03:35:35 [views.py:374 get()] Export requested for source version HEAD - Requesting AWS-S3 key
INFO 2018/11/27 03:35:35 [middlewares.py:32 process_response()] 0.0133140087128 sec GET /orgs/org1/sources/source/HEAD/export/ : 405
.INFO 2018/11/27 03:35:36 [middlewares.py:22 process_request()] user1 127.0.0.1 POST /orgs/org1/sources/source/version1/export/
DEBUG 2018/11/27 03:35:36 [views.py:423 post()] Source Export requested for version version1 (post)
DEBUG 2018/11/27 03:35:36 [views.py:423 post()] Source Export requested for version version1 (post)
INFO 2018/11/27 03:35:36 [middlewares.py:35 process_response()] 0.0307369232178 sec POST /orgs/org1/sources/source/version1/export/ : 202
.INFO 2018/11/27 03:35:37 [middlewares.py:22 process_request()] user1 127.0.0.1 POST /orgs/org1/sources/source/version1/export/
DEBUG 2018/11/27 03:35:37 [views.py:423 post()] Source Export requested for version version1 (post)
DEBUG 2018/11/27 03:35:37 [views.py:423 post()] Source Export requested for version version1 (post)
INFO 2018/11/27 03:35:37 [middlewares.py:35 process_response()] 0.0288200378418 sec POST /orgs/org1/sources/source/version1/export/ : 202
INFO 2018/11/27 03:35:37 [middlewares.py:22 process_request()] user1 127.0.0.1 POST /orgs/org1/sources/source/version1/export/
DEBUG 2018/11/27 03:35:37 [views.py:423 post()] Source Export requested for version version1 (post)
DEBUG 2018/11/27 03:35:37 [views.py:423 post()] Source Export requested for version version1 (post)
INFO 2018/11/27 03:35:37 [middlewares.py:32 process_response()] 0.0256850719452 sec POST /orgs/org1/sources/source/version1/export/ : 409
.INFO 2018/11/27 03:35:38 [middlewares.py:22 process_request()] user1 127.0.0.1 POST /orgs/org1/sources/source/versionnotexist/export/
INFO 2018/11/27 03:35:38 [middlewares.py:32 process_response()] 0.00973296165466 sec POST /orgs/org1/sources/source/versionnotexist/export/ : 404
ERROR 2018/11/27 03:35:38 [log.py:278 log()] {"detail": "Not found"}, - 404
.INFO 2018/11/27 03:35:39 [middlewares.py:22 process_request()] user1 127.0.0.1 POST /orgs/org1/sources/source/HEAD/export/
INFO 2018/11/27 03:35:39 [middlewares.py:32 process_response()] 0.0137848854065 sec POST /orgs/org1/sources/source/HEAD/export/ : 405
.INFO 2018/11/27 03:35:40 [middlewares.py:22 process_request()] user1 127.0.0.1 POST /orgs/org1/sources/source/version1/export/
DEBUG 2018/11/27 03:35:40 [views.py:423 post()] Source Export requested for version version1 (post)
DEBUG 2018/11/27 03:35:40 [views.py:423 post()] Source Export requested for version version1 (post)
INFO 2018/11/27 03:35:40 [middlewares.py:35 process_response()] 0.0265297889709 sec POST /orgs/org1/sources/source/version1/export/ : 202
.INFO 2018/11/27 03:35:41 [middlewares.py:22 process_request()] user1 127.0.0.1 POST /orgs/org1/sources/source/version1/export/
DEBUG 2018/11/27 03:35:41 [views.py:423 post()] Source Export requested for version version1 (post)
DEBUG 2018/11/27 03:35:41 [views.py:423 post()] Source Export requested for version version1 (post)
INFO 2018/11/27 03:35:41 [middlewares.py:35 process_response()] 0.0293588638306 sec POST /orgs/org1/sources/source/version1/export/ : 202
.INFO 2018/11/27 03:35:42 [middlewares.py:22 process_request()]  127.0.0.1 POST /orgs/org1/sources/source/versions/
INFO 2018/11/27 03:35:42 [middlewares.py:35 process_response()] 0.0482940673828 sec POST /orgs/org1/sources/source/versions/ : 201
.INFO 2018/11/27 03:35:43 [middlewares.py:22 process_request()] user1 127.0.0.1 GET /orgs/org1/sources/source/version1/processing/
DEBUG 2018/11/27 03:35:43 [views.py:333 get()] Processing flag requested for source version version1
DEBUG 2018/11/27 03:35:43 [views.py:333 get()] Processing flag requested for source version version1
INFO 2018/11/27 03:35:43 [middlewares.py:35 process_response()] 0.0124580860138 sec GET /orgs/org1/sources/source/version1/processing/ : 200
INFO 2018/11/27 03:35:43 [middlewares.py:22 process_request()] user1 127.0.0.1 POST /orgs/org1/sources/source/version1/processing/
DEBUG 2018/11/27 03:35:43 [views.py:343 post()] Processing flag clearance requested for source version version1
DEBUG 2018/11/27 03:35:43 [views.py:343 post()] Processing flag clearance requested for source version version1
INFO 2018/11/27 03:35:43 [middlewares.py:35 process_response()] 0.0218729972839 sec POST /orgs/org1/sources/source/version1/processing/ : 200
INFO 2018/11/27 03:35:43 [middlewares.py:22 process_request()] user1 127.0.0.1 GET /orgs/org1/sources/source/version1/processing/
DEBUG 2018/11/27 03:35:43 [views.py:333 get()] Processing flag requested for source version version1
DEBUG 2018/11/27 03:35:43 [views.py:333 get()] Processing flag requested for source version version1
INFO 2018/11/27 03:35:43 [middlewares.py:35 process_response()] 0.0116801261902 sec GET /orgs/org1/sources/source/version1/processing/ : 200
.INFO 2018/11/27 03:35:44 [middlewares.py:22 process_request()] user1 127.0.0.1 GET /orgs/org1/sources/source/latest/
INFO 2018/11/27 03:35:44 [middlewares.py:35 process_response()] 0.0130169391632 sec GET /orgs/org1/sources/source/latest/ : 200
.INFO 2018/11/27 03:35:45 [middlewares.py:22 process_request()] user1 127.0.0.1 POST /orgs/org1/sources/source/versions/
INFO 2018/11/27 03:35:45 [middlewares.py:32 process_response()] 0.0188961029053 sec POST /orgs/org1/sources/source/versions/ : 409
ERROR 2018/11/27 03:35:45 [log.py:278 log()] {"detail": "Source version  'version1' already exist. ", "error": "E11000 duplicate key error collection: test_ocl.sources_sourceversion index: mnemonic_1_versioned_object_id_1 dup key: { : \"version1\", : \"5bfd01e1b14fba00018ff5cc\" }"}, - 409
.INFO 2018/11/27 03:35:47 [middlewares.py:22 process_request()] user1 127.0.0.1 GET /orgs/org1/sources/source/latest/
INFO 2018/11/27 03:35:47 [middlewares.py:35 process_response()] 0.0135810375214 sec GET /orgs/org1/sources/source/latest/ : 200
.INFO 2018/11/27 03:35:48 [middlewares.py:22 process_request()] user1 127.0.0.1 PUT /orgs/org1/sources/source12/
INFO 2018/11/27 03:35:48 [middlewares.py:35 process_response()] 0.040470123291 sec PUT /orgs/org1/sources/source12/ : 200
..INFO 2018/11/27 03:35:50 [middlewares.py:22 process_request()] test3ER6F 127.0.0.1 PUT /orgs/org1/sources/sourceDGQEZ/
INFO 2018/11/27 03:35:50 [middlewares.py:32 process_response()] 0.0301830768585 sec PUT /orgs/org1/sources/sourceDGQEZ/ : 400
ERROR 2018/11/27 03:35:50 [log.py:278 log()] {"failed_concept_validations": [{"mnemonic": "concept1", "url": "/orgs/org1/sources/sourceDGQEZ/concepts/concept1/", "errors": {"names": ["Concept fully specified name must be unique for same source and locale: Non Unique (locale: en, preferred: no)"]}}, {"mnemonic": "concept2", "url": "/orgs/org1/sources/sourceDGQEZ/concepts/concept2/", "errors": {"names": ["Concept fully specified name must be unique for same source and locale: Non Unique (locale: en, preferred: no)"]}}]}, - 400
.INFO 2018/11/27 03:35:51 [middlewares.py:22 process_request()] test377DJ 127.0.0.1 PUT /orgs/org1/sources/sourceH7QR6/
INFO 2018/11/27 03:35:51 [middlewares.py:35 process_response()] 0.0542168617249 sec PUT /orgs/org1/sources/sourceH7QR6/ : 200
.
======================================================================
FAIL: test_collection_concept_version_list (integration_tests.tests.all.ConceptVersionAllView)
----------------------------------------------------------------------
Traceback (most recent call last):
  File "/code/integration_tests/tests/all.py", line 765, in test_collection_concept_version_list
    self.assertEquals(len(result), 10)
AssertionError: 0 != 10

----------------------------------------------------------------------
Ran 152 tests in 231.172s

FAILED (failures=1, skipped=7)
+ docker-compose down -v
The AWS_ACCESS_KEY_ID variable is not set. Defaulting to a blank string.
The AWS_SECRET_ACCESS_KEY variable is not set. Defaulting to a blank string.
The AWS_STORAGE_BUCKET_NAME variable is not set. Defaulting to a blank string.
Stopping ocl-oa-rit_celery_1 ...
Stopping ocl-oa-rit_solr_1   ...
Stopping ocl-oa-rit_redis_1  ...
Stopping ocl-oa-rit_mongo_1  ...

Stopping ocl-oa-rit_celery_1 ... done

Stopping ocl-oa-rit_redis_1  ... done

Stopping ocl-oa-rit_solr_1   ... done

Stopping ocl-oa-rit_mongo_1  ... done
Removing ocl-oa-rit_celery_1 ...
Removing ocl-oa-rit_solr_1   ...
Removing ocl-oa-rit_redis_1  ...
Removing ocl-oa-rit_mongo_1  ...

Removing ocl-oa-rit_mongo_1  ... done

Removing ocl-oa-rit_redis_1  ... done

Removing ocl-oa-rit_celery_1 ... done

Removing ocl-oa-rit_solr_1   ... done
Removing network ocl-oa-rit_default
Removing volume ocl-oa-rit_mongo_data
Removing volume ocl-oa-rit_solr_data