Build: #214 failed Manual run by Rafal Korytkowski

Build result summary

Details

Completed
Duration
38 minutes
Labels
None
Revision
47938ef6e9d2c00cb3daddd0946153c955e34602 47938ef6e9d2c00cb3daddd0946153c955e34602
Fixed in
#215 (Changes by Rafal Korytkowski)
No failed test found. A possible compilation error occurred.

Responsible

Code commits

Author Commit Message Commit date
Rafal Korytkowski Rafal Korytkowski 47938ef6e9d2c00cb3daddd0946153c955e34602 47938ef6e9d2c00cb3daddd0946153c955e34602 Adding usage summary on source deletion

Error summary for Run integration tests

The job generated some errors, drill down into the full build log for more details.

DEBUG 2019/04/03 05:32:18 [views.py:334 get()] Export requested for source version version1 - Requesting AWS-S3 key
DEBUG 2019/04/03 05:32:18 [views.py:346 get()]    Key does not exist for source version version1
DEBUG 2019/04/03 05:32:18 [views.py:346 get()]    Key does not exist for source version version1
INFO 2019/04/03 05:32:18 [middlewares.py:35 process_response()] 0.0204741954803 sec GET /orgs/org1/sources/source/version1/export/ : 204
.INFO 2019/04/03 05:32:19 [middlewares.py:22 process_request()] user1 127.0.0.1 GET /orgs/org1/sources/source/HEAD/export/
DEBUG 2019/04/03 05:32:19 [views.py:334 get()] Export requested for source version HEAD - Requesting AWS-S3 key
DEBUG 2019/04/03 05:32:19 [views.py:334 get()] Export requested for source version HEAD - Requesting AWS-S3 key
INFO 2019/04/03 05:32:19 [middlewares.py:32 process_response()] 0.0147299766541 sec GET /orgs/org1/sources/source/HEAD/export/ : 405
.INFO 2019/04/03 05:32:20 [middlewares.py:22 process_request()] user1 127.0.0.1 POST /orgs/org1/sources/source/version1/export/
DEBUG 2019/04/03 05:32:20 [views.py:383 post()] Source Export requested for version version1 (post)
DEBUG 2019/04/03 05:32:20 [views.py:383 post()] Source Export requested for version version1 (post)
INFO 2019/04/03 05:32:20 [middlewares.py:35 process_response()] 0.0256330966949 sec POST /orgs/org1/sources/source/version1/export/ : 202
.INFO 2019/04/03 05:32:21 [middlewares.py:22 process_request()] user1 127.0.0.1 POST /orgs/org1/sources/source/version1/export/
DEBUG 2019/04/03 05:32:21 [views.py:383 post()] Source Export requested for version version1 (post)
DEBUG 2019/04/03 05:32:21 [views.py:383 post()] Source Export requested for version version1 (post)
INFO 2019/04/03 05:32:21 [middlewares.py:35 process_response()] 0.0286979675293 sec POST /orgs/org1/sources/source/version1/export/ : 202
INFO 2019/04/03 05:32:21 [middlewares.py:22 process_request()] user1 127.0.0.1 POST /orgs/org1/sources/source/version1/export/
DEBUG 2019/04/03 05:32:21 [views.py:383 post()] Source Export requested for version version1 (post)
DEBUG 2019/04/03 05:32:21 [views.py:383 post()] Source Export requested for version version1 (post)
INFO 2019/04/03 05:32:21 [middlewares.py:32 process_response()] 0.0250589847565 sec POST /orgs/org1/sources/source/version1/export/ : 409
.INFO 2019/04/03 05:32:22 [middlewares.py:22 process_request()] user1 127.0.0.1 POST /orgs/org1/sources/source/versionnotexist/export/
INFO 2019/04/03 05:32:22 [middlewares.py:32 process_response()] 0.0149600505829 sec POST /orgs/org1/sources/source/versionnotexist/export/ : 404
ERROR 2019/04/03 05:32:22 [log.py:278 log()] {"detail": "Not found"}, - 404
.INFO 2019/04/03 05:32:23 [middlewares.py:22 process_request()] user1 127.0.0.1 POST /orgs/org1/sources/source/HEAD/export/
INFO 2019/04/03 05:32:23 [middlewares.py:32 process_response()] 0.0139861106873 sec POST /orgs/org1/sources/source/HEAD/export/ : 405
.INFO 2019/04/03 05:32:24 [middlewares.py:22 process_request()] user1 127.0.0.1 POST /orgs/org1/sources/source/version1/export/
DEBUG 2019/04/03 05:32:24 [views.py:383 post()] Source Export requested for version version1 (post)
DEBUG 2019/04/03 05:32:24 [views.py:383 post()] Source Export requested for version version1 (post)
INFO 2019/04/03 05:32:24 [middlewares.py:35 process_response()] 0.029011964798 sec POST /orgs/org1/sources/source/version1/export/ : 202
.INFO 2019/04/03 05:32:25 [middlewares.py:22 process_request()] user1 127.0.0.1 POST /orgs/org1/sources/source/version1/export/
DEBUG 2019/04/03 05:32:25 [views.py:383 post()] Source Export requested for version version1 (post)
DEBUG 2019/04/03 05:32:25 [views.py:383 post()] Source Export requested for version version1 (post)
INFO 2019/04/03 05:32:25 [middlewares.py:35 process_response()] 0.0259690284729 sec POST /orgs/org1/sources/source/version1/export/ : 202
.INFO 2019/04/03 05:32:26 [middlewares.py:22 process_request()]  127.0.0.1 POST /orgs/org1/sources/source/versions/
INFO 2019/04/03 05:32:26 [middlewares.py:35 process_response()] 0.0500919818878 sec POST /orgs/org1/sources/source/versions/ : 201
.INFO 2019/04/03 05:32:28 [middlewares.py:22 process_request()] user1 127.0.0.1 GET /orgs/org1/sources/source/version1/processing/
DEBUG 2019/04/03 05:32:28 [views.py:293 get()] Processing flag requested for source version version1
DEBUG 2019/04/03 05:32:28 [views.py:293 get()] Processing flag requested for source version version1
INFO 2019/04/03 05:32:28 [middlewares.py:35 process_response()] 0.0147688388824 sec GET /orgs/org1/sources/source/version1/processing/ : 200
INFO 2019/04/03 05:32:28 [middlewares.py:22 process_request()] user1 127.0.0.1 POST /orgs/org1/sources/source/version1/processing/
DEBUG 2019/04/03 05:32:28 [views.py:303 post()] Processing flag clearance requested for source version version1
DEBUG 2019/04/03 05:32:28 [views.py:303 post()] Processing flag clearance requested for source version version1
INFO 2019/04/03 05:32:28 [middlewares.py:35 process_response()] 0.0263700485229 sec POST /orgs/org1/sources/source/version1/processing/ : 200
INFO 2019/04/03 05:32:28 [middlewares.py:22 process_request()] user1 127.0.0.1 GET /orgs/org1/sources/source/version1/processing/
DEBUG 2019/04/03 05:32:28 [views.py:293 get()] Processing flag requested for source version version1
DEBUG 2019/04/03 05:32:28 [views.py:293 get()] Processing flag requested for source version version1
INFO 2019/04/03 05:32:28 [middlewares.py:35 process_response()] 0.0133650302887 sec GET /orgs/org1/sources/source/version1/processing/ : 200
.INFO 2019/04/03 05:32:29 [middlewares.py:22 process_request()] user1 127.0.0.1 GET /orgs/org1/sources/source/latest/
INFO 2019/04/03 05:32:29 [middlewares.py:35 process_response()] 0.0134890079498 sec GET /orgs/org1/sources/source/latest/ : 200
.INFO 2019/04/03 05:32:30 [middlewares.py:22 process_request()] user1 127.0.0.1 POST /orgs/org1/sources/source/versions/
INFO 2019/04/03 05:32:30 [middlewares.py:32 process_response()] 0.0215220451355 sec POST /orgs/org1/sources/source/versions/ : 409
ERROR 2019/04/03 05:32:30 [log.py:278 log()] {"detail": "Source version  'version1' already exist. ", "error": "E11000 duplicate key error collection: test_ocl.sources_sourceversion index: mnemonic_1_versioned_object_id_1 dup key: { : \"version1\", : \"5ca47dae039ab100014cdde7\" }"}, - 409
.INFO 2019/04/03 05:32:31 [middlewares.py:22 process_request()] user1 127.0.0.1 GET /orgs/org1/sources/source/latest/
INFO 2019/04/03 05:32:31 [middlewares.py:35 process_response()] 0.0117440223694 sec GET /orgs/org1/sources/source/latest/ : 200
.INFO 2019/04/03 05:32:32 [middlewares.py:22 process_request()] user1 127.0.0.1 GET /orgs/org1/sources/source12/?includeConcepts=true&includeMappings=true
INFO 2019/04/03 05:32:32 [middlewares.py:35 process_response()] 0.038015127182 sec GET /orgs/org1/sources/source12/?includeConcepts=true&includeMappings=true : 200
.INFO 2019/04/03 05:32:33 [middlewares.py:22 process_request()] user1 127.0.0.1 PUT /orgs/org1/sources/source12/
INFO 2019/04/03 05:32:33 [middlewares.py:35 process_response()] 0.033833026886 sec PUT /orgs/org1/sources/source12/ : 200
..INFO 2019/04/03 05:32:35 [middlewares.py:22 process_request()] test1USMN 127.0.0.1 PUT /orgs/org1/sources/sourceDOKGR/
INFO 2019/04/03 05:32:35 [middlewares.py:32 process_response()] 0.024710893631 sec PUT /orgs/org1/sources/sourceDOKGR/ : 400
ERROR 2019/04/03 05:32:35 [log.py:278 log()] {"failed_concept_validations": [{"mnemonic": "concept1", "url": "/orgs/org1/sources/sourceDOKGR/concepts/concept1/", "errors": {"names": ["Concept fully specified name must be unique for same source and locale: Non Unique (locale: en, preferred: no)"]}}, {"mnemonic": "concept2", "url": "/orgs/org1/sources/sourceDOKGR/concepts/concept2/", "errors": {"names": ["Concept fully specified name must be unique for same source and locale: Non Unique (locale: en, preferred: no)"]}}]}, - 400
.INFO 2019/04/03 05:32:36 [middlewares.py:22 process_request()] test867UM 127.0.0.1 PUT /orgs/org1/sources/sourceILS2W/
INFO 2019/04/03 05:32:36 [middlewares.py:35 process_response()] 0.0517380237579 sec PUT /orgs/org1/sources/sourceILS2W/ : 200
.
======================================================================
FAIL: test_delete_org_with_referenced_concept_in_collection_in_another_org (integration_tests.tests.all.OrganizationDeleteViewTest)
----------------------------------------------------------------------
Traceback (most recent call last):
  File "/code/integration_tests/tests/all.py", line 3570, in test_delete_org_with_referenced_concept_in_collection_in_another_org
    'To delete this source, you must first delete all linked mappings and references and try again.' in message)
AssertionError: False is not true

======================================================================
FAIL: test_delete_source_with_concept_referenced_in_mapping_of_another_source (integration_tests.tests.all.SourceDeleteViewTest)
----------------------------------------------------------------------
Traceback (most recent call last):
  File "/code/integration_tests/tests/all.py", line 3465, in test_delete_source_with_concept_referenced_in_mapping_of_another_source
    self.assertTrue('To delete this source, you must first delete all linked mappings and references and try again.' in message)
AssertionError: False is not true

======================================================================
FAIL: test_delete_source_with_referenced_concept_in_collection (integration_tests.tests.all.SourceDeleteViewTest)
----------------------------------------------------------------------
Traceback (most recent call last):
  File "/code/integration_tests/tests/all.py", line 3427, in test_delete_source_with_referenced_concept_in_collection
    'To delete this source, you must first delete all linked mappings and references and try again.' in message)
AssertionError: False is not true

======================================================================
FAIL: test_delete_source_with_referenced_mapping_in_collection (integration_tests.tests.all.SourceDeleteViewTest)
----------------------------------------------------------------------
Traceback (most recent call last):
  File "/code/integration_tests/tests/all.py", line 3414, in test_delete_source_with_referenced_mapping_in_collection
    'To delete this source, you must first delete all linked mappings and references and try again.' in message)
AssertionError: False is not true

----------------------------------------------------------------------
Ran 154 tests in 230.738s

FAILED (failures=4, skipped=7)
+ docker-compose down -v
The AWS_ACCESS_KEY_ID variable is not set. Defaulting to a blank string.
The AWS_SECRET_ACCESS_KEY variable is not set. Defaulting to a blank string.
The AWS_STORAGE_BUCKET_NAME variable is not set. Defaulting to a blank string.
Stopping ocl-oa-rit_mongo_1 ...
Stopping ocl-oa-rit_redis_1 ...
Stopping ocl-oa-rit_solr_1  ...

Stopping ocl-oa-rit_redis_1 ... done

Stopping ocl-oa-rit_mongo_1 ... done

Stopping ocl-oa-rit_solr_1  ... done
Removing ocl-oa-rit_mongo_1 ...
Removing ocl-oa-rit_redis_1 ...
Removing ocl-oa-rit_solr_1  ...

Removing ocl-oa-rit_solr_1  ... done

Removing ocl-oa-rit_mongo_1 ... done

Removing ocl-oa-rit_redis_1 ... done
Removing network ocl-oa-rit_default
Removing volume ocl-oa-rit_mongo_data
Removing volume ocl-oa-rit_solr_data