Build: #253 failed Changes by Rafal Korytkowski

Build result summary

Details

Completed
Duration
8 minutes
Labels
None
Revision
398e3a827c4ae964962628f4ba7b48245a5b5204 398e3a827c4ae964962628f4ba7b48245a5b5204
Failing since
#252 (Changes by Rafal Korytkowski)
Fixed in
#254 (Changes by Rafal Korytkowski)
No failed test found. A possible compilation error occurred.

Responsible

Code commits

Author Commit Message Commit date
Rafal Korytkowski Rafal Korytkowski 398e3a827c4ae964962628f4ba7b48245a5b5204 398e3a827c4ae964962628f4ba7b48245a5b5204 OpenConceptLab/ocl_issues#106 Adding source tests

Error summary for Run deprecated integration tests

The job generated some errors, drill down into the full build log for more details.

======================================================================
FAIL: test_create_concept_without_fully_specified_name (integration_tests.tests.all.ConceptCreateViewTest)
----------------------------------------------------------------------
Traceback (most recent call last):
  File "/code/integration_tests/tests/all.py", line 93, in test_create_concept_without_fully_specified_name
    self.assertEquals(response.status_code, status.HTTP_400_BAD_REQUEST)
AssertionError: 401 != 400

======================================================================
FAIL: test_data_type_is_valid_attribute_negative (integration_tests.tests.all.ConceptCreateViewTest)
----------------------------------------------------------------------
Traceback (most recent call last):
  File "/code/integration_tests/tests/all.py", line 162, in test_data_type_is_valid_attribute_negative
    self.assertEquals(response.status_code, status.HTTP_400_BAD_REQUEST)
AssertionError: 401 != 400

======================================================================
FAIL: test_data_type_is_valid_attribute_positive (integration_tests.tests.all.ConceptCreateViewTest)
----------------------------------------------------------------------
Traceback (most recent call last):
  File "/code/integration_tests/tests/all.py", line 185, in test_data_type_is_valid_attribute_positive
    self.assertEquals(response.status_code, status.HTTP_201_CREATED)
AssertionError: 401 != 201

======================================================================
FAIL: test_description_type_is_valid_attribute_negative (integration_tests.tests.all.ConceptCreateViewTest)
----------------------------------------------------------------------
Traceback (most recent call last):
  File "/code/integration_tests/tests/all.py", line 263, in test_description_type_is_valid_attribute_negative
    self.assertEquals(response.status_code, status.HTTP_400_BAD_REQUEST)
AssertionError: 401 != 400

======================================================================
FAIL: test_desription_type_is_valid_attribute_positive (integration_tests.tests.all.ConceptCreateViewTest)
----------------------------------------------------------------------
Traceback (most recent call last):
  File "/code/integration_tests/tests/all.py", line 291, in test_desription_type_is_valid_attribute_positive
    self.assertEquals(response.status_code, status.HTTP_201_CREATED)
AssertionError: 401 != 201

======================================================================
FAIL: test_name_type_is_valid_attribute_negative (integration_tests.tests.all.ConceptCreateViewTest)
----------------------------------------------------------------------
Traceback (most recent call last):
  File "/code/integration_tests/tests/all.py", line 212, in test_name_type_is_valid_attribute_negative
    self.assertEquals(response.status_code, status.HTTP_400_BAD_REQUEST)
AssertionError: 401 != 400

======================================================================
FAIL: test_name_type_is_valid_attribute_positive (integration_tests.tests.all.ConceptCreateViewTest)
----------------------------------------------------------------------
Traceback (most recent call last):
  File "/code/integration_tests/tests/all.py", line 235, in test_name_type_is_valid_attribute_positive
    self.assertEquals(response.status_code, status.HTTP_201_CREATED)
AssertionError: 401 != 201

======================================================================
FAIL: test_remove_names_on_edit_concept_should_fail (integration_tests.tests.all.ConceptCreateViewTest)
----------------------------------------------------------------------
Traceback (most recent call last):
  File "/code/integration_tests/tests/all.py", line 697, in test_remove_names_on_edit_concept_should_fail
    self.assertEquals(response.status_code, status.HTTP_400_BAD_REQUEST)
AssertionError: 401 != 400

======================================================================
FAIL: test_same_source_validation_rule_for_different_source_versions_on_concept_create (integration_tests.tests.all.ConceptCreateViewTest)
----------------------------------------------------------------------
Traceback (most recent call last):
  File "/code/integration_tests/tests/all.py", line 571, in test_same_source_validation_rule_for_different_source_versions_on_concept_create
    self.assertEquals(response.status_code, status.HTTP_201_CREATED)
AssertionError: 401 != 201

======================================================================
FAIL: test_same_source_validation_rule_for_different_source_versions_on_concept_edit (integration_tests.tests.all.ConceptCreateViewTest)
----------------------------------------------------------------------
Traceback (most recent call last):
  File "/code/integration_tests/tests/all.py", line 649, in test_same_source_validation_rule_for_different_source_versions_on_concept_edit
    self.assertEquals(response.status_code, status.HTTP_400_BAD_REQUEST)
AssertionError: 401 != 400

======================================================================
FAIL: test_update_concept_without_changing_names (integration_tests.tests.all.ConceptCreateViewTest)
----------------------------------------------------------------------
Traceback (most recent call last):
  File "/code/integration_tests/tests/all.py", line 489, in test_update_concept_without_changing_names
    self.assertEquals(response.status_code, status.HTTP_200_OK)
AssertionError: 401 != 200

======================================================================
FAIL: test_update_concept_without_fully_specified_name (integration_tests.tests.all.ConceptCreateViewTest)
----------------------------------------------------------------------
Traceback (most recent call last):
  File "/code/integration_tests/tests/all.py", line 431, in test_update_concept_without_fully_specified_name
    self.assertEquals(responseUpdate.status_code, status.HTTP_400_BAD_REQUEST)
AssertionError: 401 != 400

----------------------------------------------------------------------
Ran 154 tests in 236.427s

FAILED (failures=17, errors=1, skipped=7)
+ docker-compose down -v
Stopping ocl-oa-rit_mongo_1 ...
Stopping ocl-oa-rit_solr_1  ...
Stopping ocl-oa-rit_redis_1 ...

Stopping ocl-oa-rit_redis_1 ... done

Stopping ocl-oa-rit_mongo_1 ... done

Stopping ocl-oa-rit_solr_1  ... done
Removing ocl-oa-rit_mongo_1 ...
Removing ocl-oa-rit_solr_1  ...
Removing ocl-oa-rit_redis_1 ...

Removing ocl-oa-rit_solr_1  ... done

Removing ocl-oa-rit_mongo_1 ... done

Removing ocl-oa-rit_redis_1 ... done
Removing network ocl-oa-rit_default
Removing volume ocl-oa-rit_mongo_data
Removing volume ocl-oa-rit_solr_data