A clone of ReffApp 3.x with e2e tests

Build: #82 failed Changes by Daniel Kayiwa

Stages & jobs

  1. Build

  2. Build and Run 3.x instance

Build result summary

Details

Completed
Queue duration
11 seconds
Duration
3 minutes
Labels
None
Revisions
Distribution 3.x
4d1c94b9152ef8a59ad1eb1e97edaf887303b4d2 4d1c94b9152ef8a59ad1eb1e97edaf887303b4d2
Release scripts
ced9ff00825ca1cb8c744547be4ba8ff994bd71b ced9ff00825ca1cb8c744547be4ba8ff994bd71b
openmrs-test-3refapp
1d076339b33d20ccd161b17522c419258f2c1729 1d076339b33d20ccd161b17522c419258f2c1729
Failing since
#51 (Changes by Ian Bacher)
No failed test found. A possible compilation error occurred.

Responsible

Code commits

Distribution 3.x
Author Commit Message Commit date
Daniel Kayiwa Daniel Kayiwa 4d1c94b9152ef8a59ad1eb1e97edaf887303b4d2 4d1c94b9152ef8a59ad1eb1e97edaf887303b4d2 Remove space from the ANC DAK concept source

Configuration changes

Plan configuration has changed since the last successful build. See the plan audit log for more details.

Some of the jobs or stages referenced by this result no longer exist.

Restarting failed/incomplete builds only is not possible as some of the affected jobs no longer exist.

Error summary for E2E Test

The job generated some errors, drill down into the full build log for more details.

npm WARN deprecated rollup-plugin-inject@3.0.2: This package has been deprecated and is no longer maintained. Please use @rollup/plugin-inject.
npm WARN deprecated sourcemap-codec@1.4.8: Please use @jridgewell/sourcemap-codec instead
rm: cannot remove 'cypress/results/*': No such file or directory
[4069822:0124/194658.118328:ERROR:gpu_memory_buffer_support_x11.cc(44)] dri3 extension not supported.
[4069568:0124/194658.995831:ERROR:object_proxy.cc(623)] Failed to call method: org.freedesktop.DBus.StartServiceByName: object_path= /org/freedesktop/DBus: org.freedesktop.DBus.Error.NoReply: Did not receive a reply. Possible causes include: the remote application did not send a reply, the message bus security policy blocked the reply, the reply timeout expired, or the network connection was broken.
npm ERR! Lifecycle script `allCypressTest` failed with error:
npm ERR! Error: command failed
npm ERR!   in workspace: openmrs-test-3refapp-cypress@0.1.0
npm ERR!   at location: /home/bamboo-agent/bamboo-agent/xml-data/build-dir/REFAPP-D3E-ET/packages/cypress
ERROR: "allCypressTest" exited with 1.
npm ERR! Lifecycle script `refappCypress` failed with error:
npm ERR! Error: command failed
npm ERR!   in workspace: openmrs-test-3refapp-cypress@0.1.0
npm ERR!   at location: /home/bamboo-agent/bamboo-agent/xml-data/build-dir/REFAPP-D3E-ET/packages/cypress