Plan responsible for building Docker images for the 3.x demo and development sites

Build: #475 failed Manual run by Github Actions

Stages & jobs

  1. Build

  2. Deploy

Build result summary

Details

Completed
Queue duration
1 second
Duration
88 minutes
Labels
None
Revisions
Distribution 3.x
5d8f4436b40838c82b7225d9b88dc2a2ba0e6e38 5d8f4436b40838c82b7225d9b88dc2a2ba0e6e38
Release scripts
39269cb8f38c786e7c5c4df804871bc2073177ad 39269cb8f38c786e7c5c4df804871bc2073177ad
Failing since
#474 (Changes by MAKOBA REAGAN PATRICK <47450907+reagan-meant@users.noreply.github.com>)
Fixed in
#476 (Manual run by Github Actions)
No failed test found. A possible compilation error occurred.

Responsible

This build has been failing since #474
No one has taken responsibility

Error summary for Build Backend

The job generated some errors, drill down into the full build log for more details.

#23 5285.2 [ERROR] Re-run Maven using the -X switch to enable full debug logging.
#23 5285.2 [ERROR]
#23 5285.2 [ERROR] For more information about the errors and possible solutions, please read the following articles:
#23 5285.2 [ERROR] [Help 1] http://cwiki.apache.org/confluence/display/MAVEN/DependencyResolutionException
#23 5285.2 [ERROR]
#23 5285.2 [ERROR] After correcting the problems, you can resume the build with the command
#23 5285.2 [ERROR]   mvn <args> -rf :referenceapplication-distro
#23 ERROR: process "/dev/.buildkit_qemu_emulator /bin/sh -c mvn $MVN_ARGS_SETTINGS $MVN_ARGS" did not complete successfully: exit code: 1

#19 [linux/amd64 dev  5/10] RUN --mount=type=secret,id=m2settings,target=/root/.m2/settings.xml mvn -U deploy
#19 5241.4 Progress (1): 0.3/79 MB
Progress (1): 0.5/79 MB
Progress (1): 0.8/79 MB
Progress (1): 1.1/79 MB
Progress (1): 1.3/79 MB
Progress (1): 1.6/79 MB
Progress (1): 1.9/79 MB
Progress (1): 2.1/79 MB
Progress (1): 2.4/79 MB
Progress (1): 2.7/79 MB
Progress (1): 2.9/79 MB
Progress (1): 3.2/79 MB
Progress (1): 3.5/79 MB
Progress (1): 3.7/79 MB
Progress (1): 4.0/79 MB
Progress (1): 4.3/79 MB
Progress (1): 4.5/79 MB
Progress (1): 4.8/79 MB
Progress (1): 5.1/79 MB
Progress (1): 5.3/79 MB
Progress (1): 5.6/79 MB
Progress (1): 5.9/79 MB
Progress (1): 6.1/79 MB
Progress (1): 6.4/79 MB
Progress (1): 6.7/79 MB
Progress (1): 6.9/79 MB
Progress (1): 7.2/79 MB
Progress (1): 7.5/79 MB
Progress (1): 7.7/79 MB
Progress (1): 8.0/79 MB
Progress (1): 8.3/79 MB
Progress (1): 8.5/79 MB
Progress (1): 8.8/79 MB
Progress (1): 9.1/79 MB
Progress (1): 9.3/79 MB
Progress (1): 9.6/79 MB
Progress (1): 9.9/79 MB
Progress (1): 10/79 MB
Progress (1): 10/79 MB
Progress (1): 11/79 MB
Progress (1): 11/79 MB
Progress (1): 11/79 MB
Progress (1): 11/79 MB
Progress (1): 12/79 MB
Progress (1): 12/79 MB
Progress (1): 12/79 MB
Progress (1): 13/79 MB
Progress (1): 13/79 MB
Progress (1): 13/79 MB
Progress (1): 13/79 MB
Progress (1): 14/79 MB
Progress (1): 14/79 MB
Progress (1): 14/79 MB
Progress (1): 14/79 MB
Progress (1): 15/79 MB
Progress (1): 15/79 MB
Progress (1): 15/79 MB
Progress (1): 15/79 MB
Progress (1): 16/79 MB
Progress (1): 16/79 MB
Progress (1): 16/79 MB
Progress (1): 17/79 MB
Progress (1): 17/79 MB
Progress (1): 17/79 MB
Progress (1): 17/79 MB
Progress (1): 18/79 MB
Progress (1): 18/79 MB
#19 CANCELED
------
> [linux/arm64 dev  5/10] RUN --mount=type=secret,id=m2settings,target=/root/.m2/settings.xml mvn -U deploy:
#23 5285.2 [ERROR] Failed to execute goal on project referenceapplication-distro: Could not resolve dependencies for project org.openmrs.distro:referenceapplication-distro:pom:3.0.0-SNAPSHOT: Could not transfer artifact org.openmrs.module:fhir2-omod:jar:1.7.0 from/to openmrs-repo (https://mavenrepo.openmrs.org/nexus/content/repositories/public): GET request of: org/openmrs/module/fhir2-omod/1.7.0/fhir2-omod-1.7.0.jar from openmrs-repo failed: Connection reset -> [Help 1]
#23 5285.2 [ERROR]
#23 5285.2 [ERROR] To see the full stack trace of the errors, re-run Maven with the -e switch.
#23 5285.2 [ERROR] Re-run Maven using the -X switch to enable full debug logging.
#23 5285.2 [ERROR]
#23 5285.2 [ERROR] For more information about the errors and possible solutions, please read the following articles:
#23 5285.2 [ERROR] [Help 1] http://cwiki.apache.org/confluence/display/MAVEN/DependencyResolutionException
#23 5285.2 [ERROR]
#23 5285.2 [ERROR] After correcting the problems, you can resume the build with the command
#23 5285.2 [ERROR]   mvn <args> -rf :referenceapplication-distro
------
Dockerfile:15
--------------------
  13 |     
  14 |     # Build the distro
  15 | >>> RUN --mount=type=secret,id=m2settings,target=/root/.m2/settings.xml mvn $MVN_ARGS_SETTINGS $MVN_ARGS
  16 |     
  17 |     RUN cp /openmrs_distro/distro/target/sdk-distro/web/openmrs.war /openmrs/distribution/openmrs_core/
--------------------
error: failed to solve: process "/dev/.buildkit_qemu_emulator /bin/sh -c mvn $MVN_ARGS_SETTINGS $MVN_ARGS" did not complete successfully: exit code: 1