Build #4,941

Deploys Reference Application SNAPSHOT to maven

Build: #4941 failed Child of UITF-UITF-101

Stages & jobs

  1. Create Reference Application packages

  2. Deploy to Automated Functional Test Server

  3. Run UI Tests

  4. Deploy to Manual Test Server

  5. Release

    Requires a user to start manually
  6. Create Standalone

Test results

  • 10 tests in total
  • 2 tests failed
  • 2 failures are new
  • 2 tests were quarantined / skipped
  • 13 minutes taken in total.
New test failures 2
Status Test View job Duration
Collapse Failed AddDiagnosisToVisitNoteTest AddDiagnosisToVisitNoteTest History
Run UI tests on Travis 1 min
org.openqa.selenium.TimeoutException: Timed out after 30 seconds waiting for visibility of element located by By.className: toast-item-wrapper
Build info: version: '2.52.0', revision: '4c2593cfc3689a7fcd7be52549167e5ccc93ad28', time: '2016-02-11 11:22:43'
System info: host: 'gw107', ip: '149.165.228.105', os.name: 'Linux', os.arch: 'amd64', os.version: '3.13.0-91-generic', java.version: '1.8.0_91'
Driver info: org.openqa.selenium.remote.RemoteWebDriver
Capabilities [{applicationCacheEnabled=true, rotatable=false, hasMetadata=true, databaseEnabled=true, handlesAlerts=true, version=42.0, platform=LINUX, nativeEvents=false, acceptSslCerts=true, webdriver.remote.sessionid=fbb7566b596b4be49630398798adcd5d, locationContextEnabled=true, webStorageEnabled=true, takesScreenshot=true, browserName=firefox, javascriptEnabled=true, cssSelectorsEnabled=true}]
Session ID: fbb7566b596b4be49630398798adcd5d
	at sun.reflect.NativeConstructorAccessorImpl.newInstance0(Native Method)
	at sun.reflect.NativeConstructorAccessorImpl.newInstance(NativeConstructorAccessorImpl.java:62)
(27 more lines...)
Collapse Failed SearchActiveVisitsTest searchActiveVisitsByPatientNameOrIdOrLastSeenTest History
Run UI tests on Travis 49 secs
org.openqa.selenium.TimeoutException: Timed out after 15 seconds waiting for visibility of element located by By.className: odd
Build info: version: '2.52.0', revision: '4c2593cfc3689a7fcd7be52549167e5ccc93ad28', time: '2016-02-11 11:22:43'
System info: host: 'gw107', ip: '149.165.228.105', os.name: 'Linux', os.arch: 'amd64', os.version: '3.13.0-91-generic', java.version: '1.8.0_91'
Driver info: org.openqa.selenium.remote.RemoteWebDriver
Capabilities [{applicationCacheEnabled=true, rotatable=false, hasMetadata=true, databaseEnabled=true, handlesAlerts=true, version=42.0, platform=LINUX, nativeEvents=false, acceptSslCerts=true, webdriver.remote.sessionid=bbc5efeb48c740e8950f5dd78336c05a, locationContextEnabled=true, webStorageEnabled=true, takesScreenshot=true, browserName=firefox, javascriptEnabled=true, cssSelectorsEnabled=true}]
Session ID: bbc5efeb48c740e8950f5dd78336c05a
	at sun.reflect.NativeConstructorAccessorImpl.newInstance0(Native Method)
	at sun.reflect.NativeConstructorAccessorImpl.newInstance(NativeConstructorAccessorImpl.java:62)
(28 more lines...)
Quarantined tests 1
Status Test Failing since Quarantined by View job Duration
Collapse Failed RegistrationAppTest registerAPatient History
Failing since build #4915 (Rebuilt by Robby O'Connor) Daniel Kayiwa Daniel Kayiwa
Run UI tests on Travis 1 min
org.openqa.selenium.TimeoutException: Timed out after 15 seconds waiting for org.openmrs.uitestframework.page.Page$1@1ca4892
Build info: version: '2.52.0', revision: '4c2593cfc3689a7fcd7be52549167e5ccc93ad28', time: '2016-02-11 11:22:43'
System info: host: 'gw107', ip: '149.165.228.105', os.name: 'Linux', os.arch: 'amd64', os.version: '3.13.0-91-generic', java.version: '1.8.0_91'
Driver info: org.openqa.selenium.remote.RemoteWebDriver
Capabilities [{applicationCacheEnabled=true, rotatable=false, hasMetadata=true, databaseEnabled=true, handlesAlerts=true, version=42.0, platform=LINUX, nativeEvents=false, acceptSslCerts=true, webdriver.remote.sessionid=145494985eba409ca7f8b95ee84c4269, locationContextEnabled=true, webStorageEnabled=true, takesScreenshot=true, browserName=firefox, javascriptEnabled=true, cssSelectorsEnabled=true}]
Session ID: 145494985eba409ca7f8b95ee84c4269
	at org.openqa.selenium.support.ui.WebDriverWait.timeoutException(WebDriverWait.java:80)
	at org.openqa.selenium.support.ui.FluentWait.until(FluentWait.java:261)
(6 more lines...)
Skipped tests 1
Status Test Failing since View job
Skipped VisitTest testStartVisit History
Run UI tests on Travis