Build #5,102

Deploys Reference Application SNAPSHOT to maven

Stages & jobs

  1. Create Reference Application packages

  2. Deploy to Automated Functional Test Server

  3. Run UI Tests

  4. Deploy to Manual Test Server

  5. Release

    Requires a user to start manually
  6. Create Standalone

Test results

  • 32 tests in total
  • 9 tests failed
  • 9 failures are new
  • 1 test was quarantined / skipped
  • 156 minutes taken in total.
New test failures 9
Status Test View job Duration
Collapse Failed AddDiagnosisToVisitNoteTest AddDiagnosisToVisitNoteTest History
Run UI tests on Travis 5 mins
java.lang.IllegalStateException: Delete request failed: http://int02.openmrs.org/openmrs/ws/rest/v1/location/c6cac12e-6d4a-4956-b41f-008ed061d20f?purge=true
	at org.openmrs.uitestframework.test.RestClient.delete(RestClient.java:67)
	at org.openmrs.reference.VisitReferenceApplicationTestBase.deleteTestLocation(VisitReferenceApplicationTestBase.java:26)
	at sun.reflect.NativeMethodAccessorImpl.invoke0(Native Method)
	at sun.reflect.NativeMethodAccessorImpl.invoke(NativeMethodAccessorImpl.java:62)
	at sun.reflect.DelegatingMethodAccessorImpl.invoke(DelegatingMethodAccessorImpl.java:43)
	at java.lang.reflect.Method.invoke(Method.java:498)
	at org.junit.runners.model.FrameworkMethod$1.runReflectiveCall(FrameworkMethod.java:47)
(85 more lines...)
Collapse Failed CaptureVitalsTest captureVital History
Run UI tests on Travis 3 mins
java.lang.IllegalStateException: Delete request failed: http://int02.openmrs.org/openmrs/ws/rest/v1/location/7534f5fd-54d6-4c3d-b271-b17df638b86f?purge=true
	at org.openmrs.uitestframework.test.RestClient.delete(RestClient.java:67)
	at org.openmrs.reference.VisitReferenceApplicationTestBase.deleteTestLocation(VisitReferenceApplicationTestBase.java:26)
	at sun.reflect.NativeMethodAccessorImpl.invoke0(Native Method)
	at sun.reflect.NativeMethodAccessorImpl.invoke(NativeMethodAccessorImpl.java:62)
	at sun.reflect.DelegatingMethodAccessorImpl.invoke(DelegatingMethodAccessorImpl.java:43)
	at java.lang.reflect.Method.invoke(Method.java:498)
	at org.junit.runners.model.FrameworkMethod$1.runReflectiveCall(FrameworkMethod.java:47)
(85 more lines...)
Collapse Failed EditAllergyTest editAllergyTest History
Run UI tests on Travis 6 mins
org.openqa.selenium.TimeoutException: Timed out after 120 seconds waiting for visibility of element located by By.tagName: input
Build info: version: '2.52.0', revision: '4c2593cfc3689a7fcd7be52549167e5ccc93ad28', time: '2016-02-11 11:22:43'
System info: host: 'gw108', ip: '149.165.228.106', os.name: 'Linux', os.arch: 'amd64', os.version: '3.13.0-91-generic', java.version: '1.8.0_91'
Driver info: org.openqa.selenium.remote.RemoteWebDriver
Capabilities [{applicationCacheEnabled=true, rotatable=false, hasMetadata=true, databaseEnabled=true, handlesAlerts=true, version=42.0, platform=LINUX, nativeEvents=false, acceptSslCerts=true, webdriver.remote.sessionid=9c4100482f084e5db8d5e9de06ef080a, locationContextEnabled=true, webStorageEnabled=true, takesScreenshot=true, browserName=firefox, javascriptEnabled=true, cssSelectorsEnabled=true}]
Session ID: 9c4100482f084e5db8d5e9de06ef080a
	at sun.reflect.NativeConstructorAccessorImpl.newInstance0(Native Method)
	at sun.reflect.NativeConstructorAccessorImpl.newInstance(NativeConstructorAccessorImpl.java:62)
(29 more lines...)
Collapse Failed EndVisitTest EndVisitTest History
Run UI tests on Travis 7 mins
java.lang.IllegalStateException: Delete request failed: http://int02.openmrs.org/openmrs/ws/rest/v1/location/26902a0a-14c8-4cc2-b441-17331f37eba7?purge=true
	at org.openmrs.uitestframework.test.RestClient.delete(RestClient.java:67)
	at org.openmrs.reference.VisitReferenceApplicationTestBase.deleteTestLocation(VisitReferenceApplicationTestBase.java:26)
	at sun.reflect.NativeMethodAccessorImpl.invoke0(Native Method)
	at sun.reflect.NativeMethodAccessorImpl.invoke(NativeMethodAccessorImpl.java:62)
	at sun.reflect.DelegatingMethodAccessorImpl.invoke(DelegatingMethodAccessorImpl.java:43)
	at java.lang.reflect.Method.invoke(Method.java:498)
	at org.junit.runners.model.FrameworkMethod$1.runReflectiveCall(FrameworkMethod.java:47)
(85 more lines...)
Collapse Failed MergeVisitsTest mergeVisitsTest History
Run UI tests on Travis 7 mins
java.lang.IllegalStateException: Delete request failed: http://int02.openmrs.org/openmrs/ws/rest/v1/location/c00a586a-78ac-4ecc-a22a-c6f3e4e0aaf5?purge=true
	at org.openmrs.uitestframework.test.RestClient.delete(RestClient.java:67)
	at org.openmrs.reference.VisitReferenceApplicationTestBase.deleteTestLocation(VisitReferenceApplicationTestBase.java:26)
	at sun.reflect.NativeMethodAccessorImpl.invoke0(Native Method)
	at sun.reflect.NativeMethodAccessorImpl.invoke(NativeMethodAccessorImpl.java:62)
	at sun.reflect.DelegatingMethodAccessorImpl.invoke(DelegatingMethodAccessorImpl.java:43)
	at java.lang.reflect.Method.invoke(Method.java:498)
	at org.junit.runners.model.FrameworkMethod$1.runReflectiveCall(FrameworkMethod.java:47)
(85 more lines...)
Collapse Failed RegisterPatientTest registerPatient History
Run UI tests on Travis 6 mins
org.openqa.selenium.TimeoutException: Timed out after 120 seconds waiting for visibility of element located by By.cssSelector: #content div span.PersonName-givenName
Build info: version: '2.52.0', revision: '4c2593cfc3689a7fcd7be52549167e5ccc93ad28', time: '2016-02-11 11:22:43'
System info: host: 'gw108', ip: '149.165.228.106', os.name: 'Linux', os.arch: 'amd64', os.version: '3.13.0-91-generic', java.version: '1.8.0_91'
Driver info: org.openqa.selenium.remote.RemoteWebDriver
Capabilities [{applicationCacheEnabled=true, rotatable=false, hasMetadata=true, databaseEnabled=true, handlesAlerts=true, version=42.0, platform=LINUX, nativeEvents=false, acceptSslCerts=true, webdriver.remote.sessionid=ddebe3b232ba43f38a3f86f4c8420f0b, locationContextEnabled=true, webStorageEnabled=true, takesScreenshot=true, browserName=firefox, javascriptEnabled=true, cssSelectorsEnabled=true}]
Session ID: ddebe3b232ba43f38a3f86f4c8420f0b
	at sun.reflect.NativeConstructorAccessorImpl.newInstance0(Native Method)
	at sun.reflect.NativeConstructorAccessorImpl.newInstance(NativeConstructorAccessorImpl.java:62)
(28 more lines...)
Collapse Failed SearchActiveVisitsTest searchActiveVisitsByPatientNameOrIdOrLastSeenTest History
Run UI tests on Travis 3 mins
org.openqa.selenium.TimeoutException: Timed out after 120 seconds waiting for visibility of element located by By.className: odd
Build info: version: '2.52.0', revision: '4c2593cfc3689a7fcd7be52549167e5ccc93ad28', time: '2016-02-11 11:22:43'
System info: host: 'gw108', ip: '149.165.228.106', os.name: 'Linux', os.arch: 'amd64', os.version: '3.13.0-91-generic', java.version: '1.8.0_91'
Driver info: org.openqa.selenium.remote.RemoteWebDriver
Capabilities [{applicationCacheEnabled=true, rotatable=false, hasMetadata=true, databaseEnabled=true, handlesAlerts=true, version=42.0, platform=LINUX, nativeEvents=false, acceptSslCerts=true, webdriver.remote.sessionid=259f0ee5990541ea89cd0509bb6c0f19, locationContextEnabled=true, webStorageEnabled=true, takesScreenshot=true, browserName=firefox, javascriptEnabled=true, cssSelectorsEnabled=true}]
Session ID: 259f0ee5990541ea89cd0509bb6c0f19
	at sun.reflect.NativeConstructorAccessorImpl.newInstance0(Native Method)
	at sun.reflect.NativeConstructorAccessorImpl.newInstance(NativeConstructorAccessorImpl.java:62)
(28 more lines...)
Collapse Failed StartVisitTest startVisitTest History
Run UI tests on Travis 1 min
java.lang.IllegalStateException: Delete request failed: http://int02.openmrs.org/openmrs/ws/rest/v1/location/8ce463c7-f251-4068-ba6f-fcda64ac3f60?purge=true
	at org.openmrs.uitestframework.test.RestClient.delete(RestClient.java:67)
	at org.openmrs.reference.VisitReferenceApplicationTestBase.deleteTestLocation(VisitReferenceApplicationTestBase.java:26)
	at sun.reflect.NativeMethodAccessorImpl.invoke0(Native Method)
	at sun.reflect.NativeMethodAccessorImpl.invoke(NativeMethodAccessorImpl.java:62)
	at sun.reflect.DelegatingMethodAccessorImpl.invoke(DelegatingMethodAccessorImpl.java:43)
	at java.lang.reflect.Method.invoke(Method.java:498)
	at org.junit.runners.model.FrameworkMethod$1.runReflectiveCall(FrameworkMethod.java:47)
(85 more lines...)
Collapse Failed XSSOnPhoneNumberFieldTest XSSOnPhoneNumberFieldTest History
Run UI tests on Travis 2 mins
java.lang.IllegalStateException: Delete request failed: http://int02.openmrs.org/openmrs/ws/rest/v1/location/cead751e-70a2-4a2d-9761-39c0d7780c39?purge=true
	at org.openmrs.uitestframework.test.RestClient.delete(RestClient.java:67)
	at org.openmrs.reference.VisitReferenceApplicationTestBase.deleteTestLocation(VisitReferenceApplicationTestBase.java:26)
	at sun.reflect.NativeMethodAccessorImpl.invoke0(Native Method)
	at sun.reflect.NativeMethodAccessorImpl.invoke(NativeMethodAccessorImpl.java:62)
	at sun.reflect.DelegatingMethodAccessorImpl.invoke(DelegatingMethodAccessorImpl.java:43)
	at java.lang.reflect.Method.invoke(Method.java:498)
	at org.junit.runners.model.FrameworkMethod$1.runReflectiveCall(FrameworkMethod.java:47)
(85 more lines...)
Skipped tests 1
Status Test Failing since View job
Skipped NamePatientAccentedLetterTest namePatientAccentedLetterTest History
Run UI tests on Travis