Build #9,751

Deploys Reference Application SNAPSHOT to maven

Build: #9751 failed Manual run from the stage: Release by Mutesasira Moses

Stages & jobs

  1. Deploy Reference Application

  2. Deploy docker image

  3. Deploy to qa-refapp

  4. Validate

  5. Release

    Requires a user to start manually
  6. Set variables

  7. Release others

Logs

The following logs have been generated by the jobs in this plan.
  • Expand all
  • Collapse all
Job Logs
Collapse Release to maven Release Download or View
05-Apr-2020 23:15:09 [INFO] ------------------------------------------------------------------------
05-Apr-2020 23:15:09 [INFO] BUILD FAILURE
05-Apr-2020 23:15:09 [INFO] ------------------------------------------------------------------------
05-Apr-2020 23:15:09 [INFO] Total time: 1.298 s
05-Apr-2020 23:15:09 [INFO] Finished at: 2020-04-05T23:15:09+00:00
05-Apr-2020 23:15:09 [INFO] Final Memory: 14M/175M
05-Apr-2020 23:15:09 [INFO] ------------------------------------------------------------------------
05-Apr-2020 23:15:09 [ERROR] Failed to execute goal org.apache.maven.plugins:maven-release-plugin:2.5.1:rollback (default-cli) on project referenceapplication: An error is occurred in the checkin process: Exception while executing SCM command. Detecting the current branch failed: fatal: ref HEAD is not a symbolic ref -> [Help 1]
05-Apr-2020 23:15:09 [ERROR]
05-Apr-2020 23:15:09 [ERROR] To see the full stack trace of the errors, re-run Maven with the -e switch.
05-Apr-2020 23:15:09 [ERROR] Re-run Maven using the -X switch to enable full debug logging.
05-Apr-2020 23:15:09 [ERROR]
05-Apr-2020 23:15:09 [ERROR] For more information about the errors and possible solutions, please read the following articles:
05-Apr-2020 23:15:09 [ERROR] [Help 1] http://cwiki.apache.org/confluence/display/MAVEN/MojoExecutionException
05-Apr-2020 23:15:09 [ERROR] mvn release:prepare failed, scroll up the logs to see the error. release:rollback was attempted. Delete the tag from the repository (if it exists), check if the SCM tag is a ssh and not http and try again.
05-Apr-2020 23:15:09 Unable to publish artifact [referenceapplication-addons]: the source directory /home/bamboo-agent/bamboo-agent/xml-data/build-dir/REFAPP-OMODDISTRO-RTM/target/checkout/package/target does not exist.
05-Apr-2020 23:15:09 The artifact is required for down stream Stages and Jobs, build will now fail.
05-Apr-2020 23:15:09 Unable to publish artifact [ referenceapplication-war]: the source directory /home/bamboo-agent/bamboo-agent/xml-data/build-dir/REFAPP-OMODDISTRO-RTM/target/checkout/package/target/bundled-distro/web does not exist.
05-Apr-2020 23:15:09 The artifact is required for down stream Stages and Jobs, build will now fail.
05-Apr-2020 23:15:09 Unable to publish artifact [ referenceapplication-properties]: the source directory /home/bamboo-agent/bamboo-agent/xml-data/build-dir/REFAPP-OMODDISTRO-RTM/target/checkout/package/target/distro/web does not exist.
05-Apr-2020 23:15:09 The artifact is required for down stream Stages and Jobs, build will now fail.
05-Apr-2020 23:15:09 Unable to publish artifact [referenceapplication-docker]: the source directory /home/bamboo-agent/bamboo-agent/xml-data/build-dir/REFAPP-OMODDISTRO-RTM/target/checkout/package/target/bundled-distro/web does not exist.
05-Apr-2020 23:15:09 The artifact is required for down stream Stages and Jobs, build will now fail.
05-Apr-2020 23:15:09 Unable to publish artifact [referenceapplication-readme]: the source directory /home/bamboo-agent/bamboo-agent/xml-data/build-dir/REFAPP-OMODDISTRO-RTM/target/checkout/package/target/classes does not exist.
05-Apr-2020 23:15:09 The artifact is required for down stream Stages and Jobs, build will now fail.