Deploys Reference Application SNAPSHOT to maven

Build: #3500 failed

Job: Run UI tests on Travis failed

Stages & jobs

  1. Create Reference Application packages

  2. Upload parent pom to maven

  3. Deploy to Automated Functional Test Server

  4. Run UI Tests

  5. Deploy to Manual Test Server

  6. Release

    Requires a user to start manually
  7. Create Standalone

Job result summary

Completed
Duration
188 minutes
Revision
8faa9c5261e5fc4ad8f7b102957197b867563bf8 8faa9c5261e5fc4ad8f7b102957197b867563bf8
Total tests
10
Failing since
#3496 (Code changes detected – )
Fixed in
#3515 (Child of REGAPP-REGAPP-2159)

Tests

  • 10 tests in total
  • 4 tests failed
  • 1 failure is new
  • 3 minutes taken in total.
New test failures 1
Status Test Duration
Collapse Failed RegistrationAppTest org.openmrs.reference.RegistrationAppTest History
< 1 sec
org.openqa.selenium.remote.UnreachableBrowserException: Could not start a new session. Possible causes are invalid address of the remote server or browser start-up failure. Build info: version: '2.37.0', revision: 'a7c61cbd68657e133ae96672cf995890bad2ee42', time: '2013-10-18 09:51:02' System info: host: 'gw107', ip: '149.165.228.105', os.name: 'Linux', os.arch: 'amd64', os.version: '3.13.0-45-generic', java.version: '1.7.0_79' Driver info: driver.version: ChromeDriver
org.openqa.selenium.remote.UnreachableBrowserException: Could not start a new session. Possible causes are invalid address of the remote server or browser start-up failure.
Build info: version: '2.37.0', revision: 'a7c61cbd68657e133ae96672cf995890bad2ee42', time: '2013-10-18 09:51:02'
System info: host: 'gw107', ip: '149.165.228.105', os.name: 'Linux', os.arch: 'amd64', os.version: '3.13.0-45-generic', java.version: '1.7.0_79'
Driver info: driver.version: ChromeDriver
	at org.openqa.selenium.remote.RemoteWebDriver.execute(RemoteWebDriver.java:548)
	at org.openqa.selenium.remote.RemoteWebDriver.startSession(RemoteWebDriver.java:216)
	at org.openqa.selenium.remote.RemoteWebDriver.<init>(RemoteWebDriver.java:111)
(60 more lines...)
Existing test failures 3
Status Test Failing since Duration
org.openqa.selenium.TimeoutException: Timed out after 30 seconds waiting for org.openmrs.uitestframework.page.AbstractBasePage$3@66229420 Build info: version: '2.37.0', revision: 'a7c61cbd68657e133ae96672cf995890bad2ee42', time: '2013-10-18 09:51:02' System info: host: 'gw107', ip: '149.165.228.105', os.name: 'Linux', os.arch: 'amd64', os.version: '3.13.0-45-generic', java.version: '1.7.0_79' Driver info: driver.version: unknown
org.openqa.selenium.TimeoutException: Timed out after 30 seconds waiting for org.openmrs.uitestframework.page.AbstractBasePage$3@66229420
Build info: version: '2.37.0', revision: 'a7c61cbd68657e133ae96672cf995890bad2ee42', time: '2013-10-18 09:51:02'
System info: host: 'gw107', ip: '149.165.228.105', os.name: 'Linux', os.arch: 'amd64', os.version: '3.13.0-45-generic', java.version: '1.7.0_79'
Driver info: driver.version: unknown
	at org.openqa.selenium.support.ui.FluentWait.timeoutException(FluentWait.java:259)
	at org.openqa.selenium.support.ui.FluentWait.until(FluentWait.java:228)
	at org.openmrs.uitestframework.page.AbstractBasePage.waitForJsVariable(AbstractBasePage.java:174)
(39 more lines...)
org.junit.ComparisonFailure: module not ready: Registration App Module [Not Started] expected:<st[op]> but was:<st[art]>
	at org.junit.Assert.assertEquals(Assert.java:115)
	at org.openmrs.reference.CheckModules.checkModules(CheckModules.java:40)
	at sun.reflect.NativeMethodAccessorImpl.invoke0(Native Method)
	at sun.reflect.NativeMethodAccessorImpl.invoke(NativeMethodAccessorImpl.java:57)
	at sun.reflect.DelegatingMethodAccessorImpl.invoke(DelegatingMethodAccessorImpl.java:43)
	at java.lang.reflect.Method.invoke(Method.java:606)
	at org.junit.runners.model.FrameworkMethod$1.runReflectiveCall(FrameworkMethod.java:47)
(30 more lines...)
org.openqa.selenium.TimeoutException: Timed out after 30 seconds waiting for org.openmrs.uitestframework.page.AbstractBasePage$3@4d2b6d39 Build info: version: '2.37.0', revision: 'a7c61cbd68657e133ae96672cf995890bad2ee42', time: '2013-10-18 09:51:02' System info: host: 'gw107', ip: '149.165.228.105', os.name: 'Linux', os.arch: 'amd64', os.version: '3.13.0-45-generic', java.version: '1.7.0_79' Driver info: driver.version: unknown
org.openqa.selenium.TimeoutException: Timed out after 30 seconds waiting for org.openmrs.uitestframework.page.AbstractBasePage$3@4d2b6d39
Build info: version: '2.37.0', revision: 'a7c61cbd68657e133ae96672cf995890bad2ee42', time: '2013-10-18 09:51:02'
System info: host: 'gw107', ip: '149.165.228.105', os.name: 'Linux', os.arch: 'amd64', os.version: '3.13.0-45-generic', java.version: '1.7.0_79'
Driver info: driver.version: unknown
	at org.openqa.selenium.support.ui.FluentWait.timeoutException(FluentWait.java:259)
	at org.openqa.selenium.support.ui.FluentWait.until(FluentWait.java:228)
	at org.openmrs.uitestframework.page.AbstractBasePage.waitForJsVariable(AbstractBasePage.java:174)
(40 more lines...)