Build #3,525

Deploys Reference Application SNAPSHOT to maven

Build: #3525 failed

Job: Run UI tests on Travis failed

Stages & jobs

  1. Create Reference Application packages

  2. Upload parent pom to maven

  3. Deploy to Automated Functional Test Server

  4. Run UI Tests

  5. Deploy to Manual Test Server

  6. Release

    Requires a user to start manually
  7. Create Standalone

Job result summary

Completed
Duration
8 minutes
Revision
6476166da3f933359b40d8076d266d1f547c5dc3 6476166da3f933359b40d8076d266d1f547c5dc3
Total tests
14
Failing since
#3523 (Code changes detected – )
Fixed in
#3526 (Code changes detected)

Tests

  • 14 tests in total
  • 2 tests failed
  • 2 failures are new
  • 1 test was fixed
  • 3 minutes taken in total.
New test failures 2
Status Test Duration
Collapse Failed DuplicatePatientRegisterTest DuplicateRegisterTest History
14 secs
org.openqa.selenium.WebDriverException: unknown error: Element is not clickable at point (88, 268). Other element would receive the click: <span>...</span>   (Session info: chrome=43.0.2357.81)   (Driver info: chromedriver=2.14.313457 (3d645c400edf2e2c500566c9aa096063e707c9cf),platform=Linux 3.13.0-45-generic x86_64) (WARNING: The server did not provide any stacktrace information) Command duration or timeout: 65 milliseconds Build info: version: '2.37.0', revision: 'a7c61cbd68657e133ae96672cf995890bad2ee42', time: '2013-10-18 09:51:02' System info: host: 'gw107', ip: '149.165.228.105', os.name: 'Linux', os.arch: 'amd64', os.version: '3.13.0-45-generic', java.version: '1.7.0_79' Session ID: 6751d0f4a10609494cb305ceccfbba43 Driver info: org.openqa.selenium.chrome.ChromeDriver Capabilities [{platform=LINUX, acceptSslCerts=true, javascriptEnabled=true, browserName=chrome, chrome={userDataDir=/tmp/.com.google.Chrome.ETfnny}, rotatable=false, locationContextEnabled=true, mobileEmulationEnabled=false, version=43.0.2357.81, takesHeapSnapshot=true, cssSelectorsEnabled=true, databaseEnabled=false, handlesAlerts=true, browserConnectionEnabled=false, webStorageEnabled=true, nativeEvents=true, applicationCacheEnabled=false, takesScreenshot=true}]
org.openqa.selenium.WebDriverException: unknown error: Element is not clickable at point (88, 268). Other element would receive the click: <span>...</span>
  (Session info: chrome=43.0.2357.81)
  (Driver info: chromedriver=2.14.313457 (3d645c400edf2e2c500566c9aa096063e707c9cf),platform=Linux 3.13.0-45-generic x86_64) (WARNING: The server did not provide any stacktrace information)
Command duration or timeout: 65 milliseconds
Build info: version: '2.37.0', revision: 'a7c61cbd68657e133ae96672cf995890bad2ee42', time: '2013-10-18 09:51:02'
System info: host: 'gw107', ip: '149.165.228.105', os.name: 'Linux', os.arch: 'amd64', os.version: '3.13.0-45-generic', java.version: '1.7.0_79'
Session ID: 6751d0f4a10609494cb305ceccfbba43
(52 more lines...)
Collapse Failed VisitNoteTest testAddVisitNote History
1 min
org.openqa.selenium.NoSuchElementException: no such element   (Session info: chrome=43.0.2357.81)   (Driver info: chromedriver=2.14.313457 (3d645c400edf2e2c500566c9aa096063e707c9cf),platform=Linux 3.13.0-45-generic x86_64) (WARNING: The server did not provide any stacktrace information) Command duration or timeout: 2.92 seconds For documentation on this error, please visit: http://seleniumhq.org/exceptions/no_such_element.html Build info: version: '2.37.0', revision: 'a7c61cbd68657e133ae96672cf995890bad2ee42', time: '2013-10-18 09:51:02' System info: host: 'gw107', ip: '149.165.228.105', os.name: 'Linux', os.arch: 'amd64', os.version: '3.13.0-45-generic', java.version: '1.7.0_79' Session ID: 8483a09ce86eba9863445a31ba8288dc Driver info: org.openqa.selenium.chrome.ChromeDriver Capabilities [{platform=LINUX, acceptSslCerts=true, javascriptEnabled=true, browserName=chrome, chrome={userDataDir=/tmp/.com.google.Chrome.mcYl9R}, rotatable=false, locationContextEnabled=true, mobileEmulationEnabled=false, version=43.0.2357.81, takesHeapSnapshot=true, cssSelectorsEnabled=true, databaseEnabled=false, handlesAlerts=true, browserConnectionEnabled=false, webStorageEnabled=true, nativeEvents=true, applicationCacheEnabled=false, takesScreenshot=true}]
org.openqa.selenium.NoSuchElementException: no such element
  (Session info: chrome=43.0.2357.81)
  (Driver info: chromedriver=2.14.313457 (3d645c400edf2e2c500566c9aa096063e707c9cf),platform=Linux 3.13.0-45-generic x86_64) (WARNING: The server did not provide any stacktrace information)
Command duration or timeout: 2.92 seconds
For documentation on this error, please visit: http://seleniumhq.org/exceptions/no_such_element.html
Build info: version: '2.37.0', revision: 'a7c61cbd68657e133ae96672cf995890bad2ee42', time: '2013-10-18 09:51:02'
System info: host: 'gw107', ip: '149.165.228.105', os.name: 'Linux', os.arch: 'amd64', os.version: '3.13.0-45-generic', java.version: '1.7.0_79'
(51 more lines...)
Fixed tests 1
Status Test Failing since Duration
Successful CaptureVitalsTest captureVital History
Failing since build #3523 (Code changes detected) 47 secs