Build #3,641

Deploys Reference Application SNAPSHOT to maven

Build: #3641 did not complete

Job: Run UI tests on Travis did not complete

Stages & jobs

  1. Create Reference Application packages

  2. Deploy to Automated Functional Test Server

  3. Run UI Tests

  4. Deploy to Manual Test Server

  5. Release

    Requires a user to start manually
  6. Create Standalone

Build log

The build generated 663 lines of output. Download or view full build log

27-Jul-2015 12:19:06 Build Reference Application - Distribution - Run UI Tests #3641 (REFAPP-OMODDISTRO-INTTESTS-3641) started building on agent gw107.iu.xsede.org (2)
27-Jul-2015 12:19:06 Build working directory is /home/bamboo-agent-1/bamboo-agent/xml-data/build-dir/REFAPP-OMODDISTRO-INTTESTS
27-Jul-2015 12:19:06 Executing build Reference Application - Distribution - Run UI Tests #3641 (REFAPP-OMODDISTRO-INTTESTS-3641)
27-Jul-2015 12:19:06 Starting task 'Git' of type 'com.atlassian.bamboo.plugins.vcs:task.vcs.checkout'
27-Jul-2015 12:19:06 Build always requires a clean checkout
27-Jul-2015 12:19:06 Cleaning build directory '/home/bamboo-agent-1/bamboo-agent/xml-data/build-dir/REFAPP-OMODDISTRO-INTTESTS'
27-Jul-2015 12:19:06 Updating source code to revision: 869b889e1ffd1d6e301ca719bd0361717bb9af23
27-Jul-2015 12:19:06 Creating local git repository in '/home/bamboo-agent-1/bamboo-agent/xml-data/build-dir/REFAPP-OMODDISTRO-INTTESTS/.git'.
27-Jul-2015 12:19:06 Initialized empty Git repository in /home/bamboo-agent-1/bamboo-agent/xml-data/build-dir/REFAPP-OMODDISTRO-INTTESTS/.git/
27-Jul-2015 12:19:07 Fetching 'refs/heads/master' from 'git://github.com/openmrs/openmrs-distro-referenceapplication.git'. Will try to do a shallow fetch.
27-Jul-2015 12:19:07 From git://github.com/openmrs/openmrs-distro-referenceapplication
27-Jul-2015 12:19:07 * [new branch]      master     -> master
27-Jul-2015 12:19:07 Checking out revision 869b889e1ffd1d6e301ca719bd0361717bb9af23.
27-Jul-2015 12:19:07 Already on 'master'
27-Jul-2015 12:19:07 Updated source code to revision: 869b889e1ffd1d6e301ca719bd0361717bb9af23
27-Jul-2015 12:19:07 Finished task 'Git' with result: Success
27-Jul-2015 12:19:07 Running pre-build action: VCS Version Collector
27-Jul-2015 12:19:07 Running pre-build action: Clover Grails PreBuild Action
27-Jul-2015 12:19:08 Running pre-build action: Run Predator
27-Jul-2015 12:19:08 [PredatorPreBuildAction] Starting predator plugin, pre build agent cleaner
27-Jul-2015 12:19:08 [PredatorPreBuildAction] Identifying Bamboo agent process (or parent): 23257 java       24802 bamboo-age 2956Mb  310Mb 00:55:25 java -Dbamboo.home=/hom
27-Jul-2015 12:19:08 [PredatorPreBuildAction] Identifying Bamboo agent process (or parent): 24802 wrapper        1 bamboo-age   17Mb    0Mb 00:45:07 /home/bamboo-agent-1/ba
27-Jul-2015 12:19:08 [PredatorPreBuildAction] Identifying Bamboo agent process (or parent):     1 init           0 root         32Mb    1Mb 00:00:34 /sbin/init             
27-Jul-2015 12:19:08 [PredatorPreBuildAction] No processes found for (chromium|chrome|webdriver)
27-Jul-2015 12:19:08 [PredatorPreBuildAction] Initial free space: 35.261444 GB
27-Jul-2015 12:19:08 [PredatorPreBuildAction] Deleting folder /home/bamboo-agent-1/bamboo-agent/xml-data/build-dir/REPUI-REPUI-JOB1
27-Jul-2015 12:19:10 [PredatorPreBuildAction] Deleting 3 snapshot folders from /home/bamboo-agent-1/.m2/repository
27-Jul-2015 12:19:10 [PredatorPreBuildAction] Maven snapshot disk freed: 0 GB
27-Jul-2015 12:19:10 [PredatorPreBuildAction] Skipping the removal of maven stable artifacts
27-Jul-2015 12:19:10 [PredatorPreBuildAction] File /home/bamboo-agent-1/.npmrc does not exist.
27-Jul-2015 12:19:10 [PredatorPreBuildAction] Final free space: 35.29209 GB
27-Jul-2015 12:19:10 [PredatorPreBuildAction] Done
27-Jul-2015 12:19:10 Starting task 'Clear out Tomcat Logs' of type 'com.atlassian.bamboo.plugins.scripttask:task.builder.command'
27-Jul-2015 12:19:10
Beginning to execute external process for build 'Reference Application - Distribution - Run UI Tests #3641 (REFAPP-OMODDISTRO-INTTESTS-3641)'
... running command line:
/bin/bash tomcatLogCollector.sh cleanTomcatLog
... in: /home/bamboo-agent-1/bamboo-agent/xml-data/build-dir/REFAPP-OMODDISTRO-INTTESTS/utility-scripts
... using extra environment variables:
bamboo_planRepository_3_repositoryUrl=https://github.com/openmrs/openmrs-contrib-bamboo.git
bamboo_capability_system_jdk_JDK_1_8=/usr/lib/jvm/java-8-openjdk-amd64
bamboo_capability_system_jdk_JDK_1_7=/usr/lib/jvm/java-7-openjdk-amd64
bamboo_repository_40632324_name=Release scripts
bamboo_repository_40632324_git_branch=master
bamboo_planKey=REFAPP-OMODDISTRO
bamboo_refapp_distro_dev_branch=master
bamboo_capability_system_jdk_JDK_1_7_0_79=/usr/lib/jvm/java-7-openjdk-amd64
bamboo_repository_git_repositoryUrl=git://github.com/openmrs/openmrs-distro-referenceapplication.git
bamboo_repository_2752530_git_branch=master
bamboo_capability_system_jdk_JDK_1_7_0_75=/usr/lib/jvm/java-7-openjdk-amd64
bamboo_capability_system_jdk_openjdk_6_jdk=/usr/lib/jvm/java-6-openjdk-amd64
bamboo_shortJobKey=INTTESTS
bamboo_planRepository_3_name=Release scripts
bamboo_repository_40632324_git_username=cintiadr
bamboo_planRepository_1_branch=master
bamboo_repository_revision_number=869b889e1ffd1d6e301ca719bd0361717bb9af23
bamboo_capability_system_builder_mvn3_Maven_3=/usr/share/apache-maven-3.2.3
bamboo_planName=Reference Application - Distribution
bamboo_buildResultsUrl=https://ci.openmrs.org/browse/REFAPP-OMODDISTRO-INTTESTS-3641
bamboo_buildResultKey=REFAPP-OMODDISTRO-INTTESTS-3641
bamboo_repository_19857409_git_repositoryUrl=https://github.com/openmrs/openmrs-standalone
bamboo_repository_previous_revision_number=0d5ac7ef808c4d003573c4b54ca6ae395c9d4501
bamboo_buildKey=REFAPP-OMODDISTRO-INTTESTS
bamboo_working_directory=/home/bamboo-agent-1/bamboo-agent/xml-data/build-dir/REFAPP-OMODDISTRO-INTTESTS
bamboo_repository_19857409_branch_name=openmrs-emr
bamboo_planRepository_2_previousRevision=2cc1eedc8952f87a71cc34e7c976f30d82d62c32
bamboo_planRepository_3_branch=master
bamboo_repository_name=Release scripts
bamboo_repository_2752530_revision_number=869b889e1ffd1d6e301ca719bd0361717bb9af23
bamboo_repository_19857409_revision_number=2cc1eedc8952f87a71cc34e7c976f30d82d62c32
bamboo_repository_git_branch=master
bamboo_ManualBuildTriggerReason_userName=raff
bamboo_planRepository_1_type=git
bamboo_checkVersions=versions:update-properties -Pupdate-to-latest
bamboo_repository_40632324_branch_name=master
bamboo_mavenBuildGoals=clean install
bamboo_capability_system_jdk_openjdk_7_jdk=/usr/lib/jvm/java-7-openjdk-amd64
bamboo_planRepository_2_branchName=openmrs-emr
bamboo_repository_2752530_name=Distribution
bamboo_repository_19857409_git_branch=openmrs-emr
bamboo_capability_system_jdk_JDK=/usr/lib/jvm/java-7-openjdk-amd64
bamboo_repository_40632324_previous_revision_number=fd5310f196074c1101fc7f1e2349005e2f083d72
bamboo_capability_system_builder_grailsBuilder_Grails_2=/opt/grails
bamboo_repository_branch_name=master
bamboo_agentId=50495494
bamboo_planRepository_3_username=cintiadr
bamboo_repository_19857409_git_username=
bamboo_maven_release_version=2.3
bamboo_planRepository_2_name=Git openmrs-standalone
bamboo_planRepository_1_username=
bamboo_buildNumber=3641
bamboo_capability_system_builder_ant_Ant=/usr/share/ant
bamboo_buildTimeStamp=2015-07-27T12:19:06.491Z
bamboo_planRepository_type=git
bamboo_repository_19857409_name=Git openmrs-standalone
bamboo_shortPlanName=Distribution
bamboo_repository_40632324_revision_number=fd5310f196074c1101fc7f1e2349005e2f083d72
bamboo_repository_2752530_git_repositoryUrl=git://github.com/openmrs/openmrs-distro-referenceapplication.git
bamboo_refapp_distro_scm=git@github.com:openmrs/openmrs-distro-referenceapplication.git
bamboo_preparing_refapp_distro_release=true
bamboo_planRepository_1_branchName=master
bamboo_planRepository_3_revision=fd5310f196074c1101fc7f1e2349005e2f083d72
bamboo_shortPlanKey=OMODDISTRO
bamboo_build_working_directory=/home/bamboo-agent-1/bamboo-agent/xml-data/build-dir/REFAPP-OMODDISTRO-INTTESTS
bamboo_planRepository_2_repositoryUrl=https://github.com/openmrs/openmrs-standalone
bamboo_planRepository_3_previousRevision=fd5310f196074c1101fc7f1e2349005e2f083d72
bamboo_repository_19857409_previous_revision_number=2cc1eedc8952f87a71cc34e7c976f30d82d62c32
bamboo_planRepository_revision=869b889e1ffd1d6e301ca719bd0361717bb9af23
bamboo_capability_system_builder_grailsBuilder_Grails_2_3_7=/opt/grails
bamboo_repository_git_username=
bamboo_planRepository_3_type=git
bamboo_capability_system_git_executable=/usr/bin/git
bamboo_maven_development_version=
bamboo_capability_system_jdk_openjdk_8_jdk=/usr/lib/jvm/java-8-openjdk-amd64
bamboo_capability_system_builder_node_Node_js=/usr/bin/nodejs
bamboo_agentWorkingDirectory=/home/bamboo-agent-1/bamboo-agent/xml-data/build-dir
bamboo_buildPlanName=Reference Application - Distribution - Run UI Tests
bamboo_repository_40632324_git_repositoryUrl=https://github.com/openmrs/openmrs-contrib-bamboo.git
bamboo_planRepository_2_revision=2cc1eedc8952f87a71cc34e7c976f30d82d62c32
bamboo_jdbc_password=********
bamboo_resultsUrl=https://ci.openmrs.org/browse/REFAPP-OMODDISTRO-INTTESTS-3641
bamboo_planRepository_3_branchName=master
bamboo_planRepository_1_revision=869b889e1ffd1d6e301ca719bd0361717bb9af23
bamboo_planRepository_2_branch=openmrs-emr
bamboo_planRepository_1_previousRevision=0d5ac7ef808c4d003573c4b54ca6ae395c9d4501
bamboo_capability_system_builder_command_Bash=/bin/bash
bamboo_planRepository_1_name=Distribution
bamboo_planRepository_branch=master
bamboo_openMRSVersion=1.11.2
bamboo_planRepository_username=
bamboo_planRepository_branchName=master
bamboo_capability_system_builder_mvn2_Maven_2=/usr/share/maven2
bamboo_shortJobName=Run UI Tests
bamboo_repository_2752530_branch_name=master
bamboo_planRepository_previousRevision=0d5ac7ef808c4d003573c4b54ca6ae395c9d4501
bamboo_refapp_bamboo_build_number=
bamboo_planRepository_1_repositoryUrl=git://github.com/openmrs/openmrs-distro-referenceapplication.git
bamboo_planRepository_repositoryUrl=git://github.com/openmrs/openmrs-distro-referenceapplication.git
bamboo_planRepository_2_type=git
bamboo_dependenciesDisabled=false
bamboo_test_db_bamboo_admin_password=********
bamboo_planRepository_name=Distribution
bamboo_planRepository_2_username=
bamboo_repository_2752530_previous_revision_number=0d5ac7ef808c4d003573c4b54ca6ae395c9d4501
bamboo_repository_2752530_git_username=
27-Jul-2015 12:19:12 Finished task 'Clear out Tomcat Logs' with result: Success
27-Jul-2015 12:19:12 Starting task 'Restart Tomcat' of type 'com.atlassian.bamboo.plugins.scripttask:task.builder.script'
27-Jul-2015 12:19:12
Beginning to execute external process for build 'Reference Application - Distribution - Run UI Tests #3641 (REFAPP-OMODDISTRO-INTTESTS-3641)'
... running command line:
/bin/sh /home/bamboo-agent-1/bamboo-agent/.agent_tmp/REFAPP-OMODDISTRO-INTTESTS-3641-ScriptBuildTask-5118841785149439031.sh
... in: /home/bamboo-agent-1/bamboo-agent/xml-data/build-dir/REFAPP-OMODDISTRO-INTTESTS
... using extra environment variables:
bamboo_planRepository_3_repositoryUrl=https://github.com/openmrs/openmrs-contrib-bamboo.git
bamboo_capability_system_jdk_JDK_1_8=/usr/lib/jvm/java-8-openjdk-amd64
bamboo_capability_system_jdk_JDK_1_7=/usr/lib/jvm/java-7-openjdk-amd64
bamboo_repository_40632324_name=Release scripts
bamboo_repository_40632324_git_branch=master
bamboo_planKey=REFAPP-OMODDISTRO
bamboo_refapp_distro_dev_branch=master
bamboo_capability_system_jdk_JDK_1_7_0_79=/usr/lib/jvm/java-7-openjdk-amd64
bamboo_repository_git_repositoryUrl=git://github.com/openmrs/openmrs-distro-referenceapplication.git
bamboo_repository_2752530_git_branch=master
bamboo_capability_system_jdk_JDK_1_7_0_75=/usr/lib/jvm/java-7-openjdk-amd64
bamboo_capability_system_jdk_openjdk_6_jdk=/usr/lib/jvm/java-6-openjdk-amd64
bamboo_shortJobKey=INTTESTS
bamboo_planRepository_3_name=Release scripts
bamboo_repository_40632324_git_username=cintiadr
bamboo_planRepository_1_branch=master
bamboo_repository_revision_number=869b889e1ffd1d6e301ca719bd0361717bb9af23
bamboo_capability_system_builder_mvn3_Maven_3=/usr/share/apache-maven-3.2.3
bamboo_planName=Reference Application - Distribution
bamboo_buildResultsUrl=https://ci.openmrs.org/browse/REFAPP-OMODDISTRO-INTTESTS-3641
bamboo_buildResultKey=REFAPP-OMODDISTRO-INTTESTS-3641
bamboo_repository_19857409_git_repositoryUrl=https://github.com/openmrs/openmrs-standalone
bamboo_repository_previous_revision_number=0d5ac7ef808c4d003573c4b54ca6ae395c9d4501
bamboo_buildKey=REFAPP-OMODDISTRO-INTTESTS
bamboo_working_directory=/home/bamboo-agent-1/bamboo-agent/xml-data/build-dir/REFAPP-OMODDISTRO-INTTESTS
bamboo_repository_19857409_branch_name=openmrs-emr
bamboo_planRepository_2_previousRevision=2cc1eedc8952f87a71cc34e7c976f30d82d62c32
bamboo_planRepository_3_branch=master
bamboo_repository_name=Release scripts
bamboo_repository_2752530_revision_number=869b889e1ffd1d6e301ca719bd0361717bb9af23
bamboo_repository_19857409_revision_number=2cc1eedc8952f87a71cc34e7c976f30d82d62c32
bamboo_repository_git_branch=master
bamboo_ManualBuildTriggerReason_userName=raff
bamboo_planRepository_1_type=git
bamboo_checkVersions=versions:update-properties -Pupdate-to-latest
bamboo_repository_40632324_branch_name=master
bamboo_mavenBuildGoals=clean install
bamboo_capability_system_jdk_openjdk_7_jdk=/usr/lib/jvm/java-7-openjdk-amd64
bamboo_planRepository_2_branchName=openmrs-emr
bamboo_repository_2752530_name=Distribution
bamboo_repository_19857409_git_branch=openmrs-emr
bamboo_capability_system_jdk_JDK=/usr/lib/jvm/java-7-openjdk-amd64
bamboo_repository_40632324_previous_revision_number=fd5310f196074c1101fc7f1e2349005e2f083d72
bamboo_capability_system_builder_grailsBuilder_Grails_2=/opt/grails
bamboo_repository_branch_name=master
bamboo_agentId=50495494
bamboo_planRepository_3_username=cintiadr
bamboo_build_commandline_com_atlassian_bamboo_plugins_scripttask_task_builder_command_8=/bin/bash tomcatLogCollector.sh cleanTomcatLog
bamboo_repository_19857409_git_username=
bamboo_maven_release_version=2.3
bamboo_planRepository_2_name=Git openmrs-standalone
bamboo_planRepository_1_username=
bamboo_buildNumber=3641
bamboo_capability_system_builder_ant_Ant=/usr/share/ant
bamboo_buildTimeStamp=2015-07-27T12:19:06.491Z
bamboo_planRepository_type=git
bamboo_repository_19857409_name=Git openmrs-standalone
bamboo_shortPlanName=Distribution
bamboo_repository_40632324_revision_number=fd5310f196074c1101fc7f1e2349005e2f083d72
bamboo_repository_2752530_git_repositoryUrl=git://github.com/openmrs/openmrs-distro-referenceapplication.git
bamboo_refapp_distro_scm=git@github.com:openmrs/openmrs-distro-referenceapplication.git
bamboo_preparing_refapp_distro_release=true
bamboo_planRepository_1_branchName=master
bamboo_planRepository_3_revision=fd5310f196074c1101fc7f1e2349005e2f083d72
bamboo_shortPlanKey=OMODDISTRO
bamboo_build_working_directory=/home/bamboo-agent-1/bamboo-agent/xml-data/build-dir/REFAPP-OMODDISTRO-INTTESTS
bamboo_planRepository_2_repositoryUrl=https://github.com/openmrs/openmrs-standalone
bamboo_planRepository_3_previousRevision=fd5310f196074c1101fc7f1e2349005e2f083d72
bamboo_repository_19857409_previous_revision_number=2cc1eedc8952f87a71cc34e7c976f30d82d62c32
bamboo_planRepository_revision=869b889e1ffd1d6e301ca719bd0361717bb9af23
bamboo_capability_system_builder_grailsBuilder_Grails_2_3_7=/opt/grails
bamboo_repository_git_username=
bamboo_planRepository_3_type=git
bamboo_capability_system_git_executable=/usr/bin/git
bamboo_maven_development_version=
bamboo_capability_system_jdk_openjdk_8_jdk=/usr/lib/jvm/java-8-openjdk-amd64
bamboo_capability_system_builder_node_Node_js=/usr/bin/nodejs
bamboo_agentWorkingDirectory=/home/bamboo-agent-1/bamboo-agent/xml-data/build-dir
bamboo_buildPlanName=Reference Application - Distribution - Run UI Tests
bamboo_repository_40632324_git_repositoryUrl=https://github.com/openmrs/openmrs-contrib-bamboo.git
bamboo_planRepository_2_revision=2cc1eedc8952f87a71cc34e7c976f30d82d62c32
bamboo_jdbc_password=********
bamboo_resultsUrl=https://ci.openmrs.org/browse/REFAPP-OMODDISTRO-INTTESTS-3641
bamboo_planRepository_3_branchName=master
bamboo_planRepository_1_revision=869b889e1ffd1d6e301ca719bd0361717bb9af23
bamboo_planRepository_2_branch=openmrs-emr
bamboo_planRepository_1_previousRevision=0d5ac7ef808c4d003573c4b54ca6ae395c9d4501
bamboo_capability_system_builder_command_Bash=/bin/bash
bamboo_planRepository_1_name=Distribution
bamboo_planRepository_branch=master
bamboo_openMRSVersion=1.11.2
bamboo_planRepository_username=
bamboo_planRepository_branchName=master
bamboo_capability_system_builder_mvn2_Maven_2=/usr/share/maven2
bamboo_shortJobName=Run UI Tests
bamboo_repository_2752530_branch_name=master
bamboo_planRepository_previousRevision=0d5ac7ef808c4d003573c4b54ca6ae395c9d4501
bamboo_refapp_bamboo_build_number=
bamboo_planRepository_1_repositoryUrl=git://github.com/openmrs/openmrs-distro-referenceapplication.git
bamboo_planRepository_repositoryUrl=git://github.com/openmrs/openmrs-distro-referenceapplication.git
bamboo_planRepository_2_type=git
bamboo_dependenciesDisabled=false
bamboo_test_db_bamboo_admin_password=********
bamboo_planRepository_name=Distribution
bamboo_planRepository_2_username=
bamboo_repository_2752530_previous_revision_number=0d5ac7ef808c4d003573c4b54ca6ae395c9d4501
bamboo_repository_2752530_git_username=
27-Jul-2015 12:19:13 * Stopping Tomcat servlet engine tomcat7
27-Jul-2015 12:19:13    ...done.
27-Jul-2015 12:19:14 * Starting Tomcat servlet engine tomcat7
27-Jul-2015 12:19:19    ...done.
27-Jul-2015 12:19:19 Finished task 'Restart Tomcat' with result: Success
27-Jul-2015 12:19:19 Starting task 'Wait for App to truly start' of type 'com.atlassian.bamboo.plugins.scripttask:task.builder.command'
27-Jul-2015 12:19:19
Beginning to execute external process for build 'Reference Application - Distribution - Run UI Tests #3641 (REFAPP-OMODDISTRO-INTTESTS-3641)'
... running command line:
/bin/bash appStartupCheck.sh devtest01.openmrs.org
... in: /home/bamboo-agent-1/bamboo-agent/xml-data/build-dir/REFAPP-OMODDISTRO-INTTESTS/utility-scripts
... using extra environment variables:
bamboo_planRepository_3_repositoryUrl=https://github.com/openmrs/openmrs-contrib-bamboo.git
bamboo_capability_system_jdk_JDK_1_8=/usr/lib/jvm/java-8-openjdk-amd64
bamboo_capability_system_jdk_JDK_1_7=/usr/lib/jvm/java-7-openjdk-amd64
bamboo_repository_40632324_name=Release scripts
bamboo_repository_40632324_git_branch=master
bamboo_planKey=REFAPP-OMODDISTRO
bamboo_refapp_distro_dev_branch=master
bamboo_capability_system_jdk_JDK_1_7_0_79=/usr/lib/jvm/java-7-openjdk-amd64
bamboo_repository_git_repositoryUrl=git://github.com/openmrs/openmrs-distro-referenceapplication.git
bamboo_repository_2752530_git_branch=master
bamboo_capability_system_jdk_JDK_1_7_0_75=/usr/lib/jvm/java-7-openjdk-amd64
bamboo_capability_system_jdk_openjdk_6_jdk=/usr/lib/jvm/java-6-openjdk-amd64
bamboo_shortJobKey=INTTESTS
bamboo_planRepository_3_name=Release scripts
bamboo_repository_40632324_git_username=cintiadr
bamboo_planRepository_1_branch=master
bamboo_repository_revision_number=869b889e1ffd1d6e301ca719bd0361717bb9af23
bamboo_capability_system_builder_mvn3_Maven_3=/usr/share/apache-maven-3.2.3
bamboo_planName=Reference Application - Distribution
bamboo_buildResultsUrl=https://ci.openmrs.org/browse/REFAPP-OMODDISTRO-INTTESTS-3641
bamboo_buildResultKey=REFAPP-OMODDISTRO-INTTESTS-3641
bamboo_repository_19857409_git_repositoryUrl=https://github.com/openmrs/openmrs-standalone
bamboo_repository_previous_revision_number=0d5ac7ef808c4d003573c4b54ca6ae395c9d4501
bamboo_buildKey=REFAPP-OMODDISTRO-INTTESTS
bamboo_working_directory=/home/bamboo-agent-1/bamboo-agent/xml-data/build-dir/REFAPP-OMODDISTRO-INTTESTS
bamboo_repository_19857409_branch_name=openmrs-emr
bamboo_planRepository_2_previousRevision=2cc1eedc8952f87a71cc34e7c976f30d82d62c32
bamboo_planRepository_3_branch=master
bamboo_repository_name=Release scripts
bamboo_repository_2752530_revision_number=869b889e1ffd1d6e301ca719bd0361717bb9af23
bamboo_repository_19857409_revision_number=2cc1eedc8952f87a71cc34e7c976f30d82d62c32
bamboo_repository_git_branch=master
bamboo_ManualBuildTriggerReason_userName=raff
bamboo_planRepository_1_type=git
bamboo_checkVersions=versions:update-properties -Pupdate-to-latest
bamboo_repository_40632324_branch_name=master
bamboo_mavenBuildGoals=clean install
bamboo_capability_system_jdk_openjdk_7_jdk=/usr/lib/jvm/java-7-openjdk-amd64
bamboo_build_commandline_com_atlassian_bamboo_plugins_scripttask_task_builder_script_7=/bin/sh /home/bamboo-agent-1/bamboo-agent/.agent_tmp/REFAPP-OMODDISTRO-INTTESTS-3641-ScriptBuildTask-5118841785149439031.sh
bamboo_planRepository_2_branchName=openmrs-emr
bamboo_repository_2752530_name=Distribution
bamboo_repository_19857409_git_branch=openmrs-emr
bamboo_capability_system_jdk_JDK=/usr/lib/jvm/java-7-openjdk-amd64
bamboo_repository_40632324_previous_revision_number=fd5310f196074c1101fc7f1e2349005e2f083d72
bamboo_capability_system_builder_grailsBuilder_Grails_2=/opt/grails
bamboo_repository_branch_name=master
bamboo_agentId=50495494
bamboo_planRepository_3_username=cintiadr
bamboo_build_commandline_com_atlassian_bamboo_plugins_scripttask_task_builder_command_8=/bin/bash tomcatLogCollector.sh cleanTomcatLog
bamboo_repository_19857409_git_username=
bamboo_maven_release_version=2.3
bamboo_planRepository_2_name=Git openmrs-standalone
bamboo_planRepository_1_username=
bamboo_buildNumber=3641
bamboo_capability_system_builder_ant_Ant=/usr/share/ant
bamboo_buildTimeStamp=2015-07-27T12:19:06.491Z
bamboo_planRepository_type=git
bamboo_repository_19857409_name=Git openmrs-standalone
bamboo_shortPlanName=Distribution
bamboo_repository_40632324_revision_number=fd5310f196074c1101fc7f1e2349005e2f083d72
bamboo_repository_2752530_git_repositoryUrl=git://github.com/openmrs/openmrs-distro-referenceapplication.git
bamboo_refapp_distro_scm=git@github.com:openmrs/openmrs-distro-referenceapplication.git
bamboo_preparing_refapp_distro_release=true
bamboo_planRepository_1_branchName=master
bamboo_planRepository_3_revision=fd5310f196074c1101fc7f1e2349005e2f083d72
bamboo_shortPlanKey=OMODDISTRO
bamboo_build_working_directory=/home/bamboo-agent-1/bamboo-agent/xml-data/build-dir/REFAPP-OMODDISTRO-INTTESTS
bamboo_planRepository_2_repositoryUrl=https://github.com/openmrs/openmrs-standalone
bamboo_planRepository_3_previousRevision=fd5310f196074c1101fc7f1e2349005e2f083d72
bamboo_repository_19857409_previous_revision_number=2cc1eedc8952f87a71cc34e7c976f30d82d62c32
bamboo_planRepository_revision=869b889e1ffd1d6e301ca719bd0361717bb9af23
bamboo_capability_system_builder_grailsBuilder_Grails_2_3_7=/opt/grails
bamboo_repository_git_username=
bamboo_planRepository_3_type=git
bamboo_capability_system_git_executable=/usr/bin/git
bamboo_maven_development_version=
bamboo_capability_system_jdk_openjdk_8_jdk=/usr/lib/jvm/java-8-openjdk-amd64
bamboo_capability_system_builder_node_Node_js=/usr/bin/nodejs
bamboo_agentWorkingDirectory=/home/bamboo-agent-1/bamboo-agent/xml-data/build-dir
bamboo_buildPlanName=Reference Application - Distribution - Run UI Tests
bamboo_repository_40632324_git_repositoryUrl=https://github.com/openmrs/openmrs-contrib-bamboo.git
bamboo_planRepository_2_revision=2cc1eedc8952f87a71cc34e7c976f30d82d62c32
bamboo_jdbc_password=********
bamboo_resultsUrl=https://ci.openmrs.org/browse/REFAPP-OMODDISTRO-INTTESTS-3641
bamboo_planRepository_3_branchName=master
bamboo_planRepository_1_revision=869b889e1ffd1d6e301ca719bd0361717bb9af23
bamboo_planRepository_2_branch=openmrs-emr
bamboo_planRepository_1_previousRevision=0d5ac7ef808c4d003573c4b54ca6ae395c9d4501
bamboo_capability_system_builder_command_Bash=/bin/bash
bamboo_planRepository_1_name=Distribution
bamboo_planRepository_branch=master
bamboo_openMRSVersion=1.11.2
bamboo_planRepository_username=
bamboo_planRepository_branchName=master
bamboo_capability_system_builder_mvn2_Maven_2=/usr/share/maven2
bamboo_shortJobName=Run UI Tests
bamboo_repository_2752530_branch_name=master
bamboo_planRepository_previousRevision=0d5ac7ef808c4d003573c4b54ca6ae395c9d4501
bamboo_refapp_bamboo_build_number=
bamboo_planRepository_1_repositoryUrl=git://github.com/openmrs/openmrs-distro-referenceapplication.git
bamboo_planRepository_repositoryUrl=git://github.com/openmrs/openmrs-distro-referenceapplication.git
bamboo_planRepository_2_type=git
bamboo_dependenciesDisabled=false
bamboo_test_db_bamboo_admin_password=********
bamboo_planRepository_name=Distribution
bamboo_planRepository_2_username=
bamboo_repository_2752530_previous_revision_number=0d5ac7ef808c4d003573c4b54ca6ae395c9d4501
bamboo_repository_2752530_git_username=
27-Jul-2015 12:19:19 Waiting for OpenMRS to start.  This could take a few minutes.
27-Jul-2015 12:22:21 Tomcat started in 114 seconds.
27-Jul-2015 12:22:21 OpenMRS Reference Application is ready for use.
27-Jul-2015 12:22:22 Finished task 'Wait for App to truly start' with result: Success
27-Jul-2015 12:22:22 Skipping execution of task 'Run UI tests' as it is disabled
27-Jul-2015 12:22:22
Substituting password variable: ${bamboo.jdbc_password}
27-Jul-2015 12:22:22 Starting task 'Run UI tests' of type 'com.atlassian.bamboo.plugins.maven:task.builder.mvn3'
27-Jul-2015 12:22:22
Beginning to execute external process for build 'Reference Application - Distribution - Run UI Tests #3641 (REFAPP-OMODDISTRO-INTTESTS-3641)'
... running command line:
/usr/share/apache-maven-3.2.3/bin/mvn --batch-mode -Djava.io.tmpdir=/home/bamboo-agent-1/bamboo-agent/.agent_tmp/REFAPP-OMODDISTRO-INTTESTS clean integration-test -P ci-headless -Ddatabase.username=root -Ddatabase.password=******** -Djdbc.connectionurl=jdbc:mysql://devtest01.openmrs.org:3306/openmrs -Dwebdriver=chrome
... in: /home/bamboo-agent-1/bamboo-agent/xml-data/build-dir/REFAPP-OMODDISTRO-INTTESTS/ui-tests
... using extra environment variables:
bamboo_planRepository_3_repositoryUrl=https://github.com/openmrs/openmrs-contrib-bamboo.git
bamboo_capability_system_jdk_JDK_1_8=/usr/lib/jvm/java-8-openjdk-amd64
bamboo_capability_system_jdk_JDK_1_7=/usr/lib/jvm/java-7-openjdk-amd64
JAVA_HOME=/usr/lib/jvm/java-7-openjdk-amd64
bamboo_repository_40632324_name=Release scripts
bamboo_repository_40632324_git_branch=master
bamboo_planKey=REFAPP-OMODDISTRO
bamboo_capability_system_jdk_JDK_1_7_0_79=/usr/lib/jvm/java-7-openjdk-amd64
bamboo_refapp_distro_dev_branch=master
bamboo_repository_git_repositoryUrl=git://github.com/openmrs/openmrs-distro-referenceapplication.git
bamboo_repository_2752530_git_branch=master
bamboo_capability_system_jdk_JDK_1_7_0_75=/usr/lib/jvm/java-7-openjdk-amd64
bamboo_capability_system_jdk_openjdk_6_jdk=/usr/lib/jvm/java-6-openjdk-amd64
bamboo_planRepository_3_name=Release scripts
bamboo_shortJobKey=INTTESTS
bamboo_repository_40632324_git_username=cintiadr
bamboo_planRepository_1_branch=master
bamboo_repository_revision_number=869b889e1ffd1d6e301ca719bd0361717bb9af23
bamboo_capability_system_builder_mvn3_Maven_3=/usr/share/apache-maven-3.2.3
bamboo_planName=Reference Application - Distribution
bamboo_buildResultsUrl=https://ci.openmrs.org/browse/REFAPP-OMODDISTRO-INTTESTS-3641
bamboo_buildResultKey=REFAPP-OMODDISTRO-INTTESTS-3641
bamboo_repository_19857409_git_repositoryUrl=https://github.com/openmrs/openmrs-standalone
bamboo_repository_previous_revision_number=0d5ac7ef808c4d003573c4b54ca6ae395c9d4501
bamboo_buildKey=REFAPP-OMODDISTRO-INTTESTS
bamboo_working_directory=/home/bamboo-agent-1/bamboo-agent/xml-data/build-dir/REFAPP-OMODDISTRO-INTTESTS
bamboo_repository_19857409_branch_name=openmrs-emr
bamboo_planRepository_2_previousRevision=2cc1eedc8952f87a71cc34e7c976f30d82d62c32
bamboo_planRepository_3_branch=master
bamboo_repository_name=Release scripts
useMavenReturnCode=false
bamboo_repository_2752530_revision_number=869b889e1ffd1d6e301ca719bd0361717bb9af23
bamboo_repository_19857409_revision_number=2cc1eedc8952f87a71cc34e7c976f30d82d62c32
bamboo_repository_git_branch=master
bamboo_ManualBuildTriggerReason_userName=raff
bamboo_planRepository_1_type=git
bamboo_checkVersions=versions:update-properties -Pupdate-to-latest
bamboo_repository_40632324_branch_name=master
bamboo_mavenBuildGoals=clean install
MAVEN2_HOME=/usr/share/apache-maven-3.2.3
bamboo_capability_system_jdk_openjdk_7_jdk=/usr/lib/jvm/java-7-openjdk-amd64
bamboo_build_commandline_com_atlassian_bamboo_plugins_scripttask_task_builder_script_7=/bin/sh /home/bamboo-agent-1/bamboo-agent/.agent_tmp/REFAPP-OMODDISTRO-INTTESTS-3641-ScriptBuildTask-5118841785149439031.sh
bamboo_planRepository_2_branchName=openmrs-emr
bamboo_repository_2752530_name=Distribution
bamboo_repository_19857409_git_branch=openmrs-emr
bamboo_capability_system_jdk_JDK=/usr/lib/jvm/java-7-openjdk-amd64
bamboo_repository_40632324_previous_revision_number=fd5310f196074c1101fc7f1e2349005e2f083d72
bamboo_capability_system_builder_grailsBuilder_Grails_2=/opt/grails
bamboo_repository_branch_name=master
bamboo_agentId=50495494
bamboo_planRepository_3_username=cintiadr
bamboo_build_commandline_com_atlassian_bamboo_plugins_scripttask_task_builder_command_8=/bin/bash tomcatLogCollector.sh cleanTomcatLog
bamboo_repository_19857409_git_username=
bamboo_build_commandline_com_atlassian_bamboo_plugins_scripttask_task_builder_command_4=/bin/bash appStartupCheck.sh devtest01.openmrs.org
bamboo_maven_release_version=2.3
bamboo_planRepository_2_name=Git openmrs-standalone
bamboo_planRepository_1_username=
bamboo_buildNumber=3641
bamboo_capability_system_builder_ant_Ant=/usr/share/ant
bamboo_buildTimeStamp=2015-07-27T12:19:06.491Z
bamboo_planRepository_type=git
bamboo_repository_19857409_name=Git openmrs-standalone
bamboo_shortPlanName=Distribution
bamboo_repository_40632324_revision_number=fd5310f196074c1101fc7f1e2349005e2f083d72
bamboo_repository_2752530_git_repositoryUrl=git://github.com/openmrs/openmrs-distro-referenceapplication.git
bamboo_refapp_distro_scm=git@github.com:openmrs/openmrs-distro-referenceapplication.git
bamboo_preparing_refapp_distro_release=true
bamboo_planRepository_1_branchName=master
bamboo_planRepository_3_revision=fd5310f196074c1101fc7f1e2349005e2f083d72
bamboo_shortPlanKey=OMODDISTRO
bamboo_build_working_directory=/home/bamboo-agent-1/bamboo-agent/xml-data/build-dir/REFAPP-OMODDISTRO-INTTESTS
bamboo_planRepository_2_repositoryUrl=https://github.com/openmrs/openmrs-standalone
bamboo_planRepository_3_previousRevision=fd5310f196074c1101fc7f1e2349005e2f083d72
bamboo_repository_19857409_previous_revision_number=2cc1eedc8952f87a71cc34e7c976f30d82d62c32
M2_HOME=/usr/share/apache-maven-3.2.3
bamboo_planRepository_revision=869b889e1ffd1d6e301ca719bd0361717bb9af23
bamboo_capability_system_builder_grailsBuilder_Grails_2_3_7=/opt/grails
bamboo_repository_git_username=
bamboo_planRepository_3_type=git
bamboo_capability_system_git_executable=/usr/bin/git
bamboo_maven_development_version=
bamboo_capability_system_jdk_openjdk_8_jdk=/usr/lib/jvm/java-8-openjdk-amd64
bamboo_capability_system_builder_node_Node_js=/usr/bin/nodejs
bamboo_agentWorkingDirectory=/home/bamboo-agent-1/bamboo-agent/xml-data/build-dir
bamboo_buildPlanName=Reference Application - Distribution - Run UI Tests
bamboo_repository_40632324_git_repositoryUrl=https://github.com/openmrs/openmrs-contrib-bamboo.git
bamboo_planRepository_2_revision=2cc1eedc8952f87a71cc34e7c976f30d82d62c32
bamboo_jdbc_password=********
bamboo_resultsUrl=https://ci.openmrs.org/browse/REFAPP-OMODDISTRO-INTTESTS-3641
bamboo_planRepository_3_branchName=master
bamboo_planRepository_1_revision=869b889e1ffd1d6e301ca719bd0361717bb9af23
bamboo_planRepository_2_branch=openmrs-emr
bamboo_planRepository_1_previousRevision=0d5ac7ef808c4d003573c4b54ca6ae395c9d4501
bamboo_capability_system_builder_command_Bash=/bin/bash
bamboo_planRepository_1_name=Distribution
bamboo_planRepository_branch=master
bamboo_openMRSVersion=1.11.2
bamboo_planRepository_username=
bamboo_planRepository_branchName=master
bamboo_capability_system_builder_mvn2_Maven_2=/usr/share/maven2
bamboo_shortJobName=Run UI Tests
bamboo_repository_2752530_branch_name=master
bamboo_planRepository_previousRevision=0d5ac7ef808c4d003573c4b54ca6ae395c9d4501
bamboo_refapp_bamboo_build_number=
bamboo_planRepository_1_repositoryUrl=git://github.com/openmrs/openmrs-distro-referenceapplication.git
bamboo_planRepository_repositoryUrl=git://github.com/openmrs/openmrs-distro-referenceapplication.git
bamboo_planRepository_2_type=git
bamboo_dependenciesDisabled=false
bamboo_test_db_bamboo_admin_password=********
bamboo_planRepository_name=Distribution
bamboo_planRepository_2_username=
bamboo_repository_2752530_previous_revision_number=0d5ac7ef808c4d003573c4b54ca6ae395c9d4501
bamboo_repository_2752530_git_username=
PATH=/usr/lib/jvm/java-7-openjdk-amd64/bin:/bin:/usr/local/bin:/usr/bin:/bin:/usr/local/games:/usr/games
27-Jul-2015 12:22:24 [INFO] Scanning for projects...
27-Jul-2015 12:22:24 [WARNING]
27-Jul-2015 12:22:24 [WARNING] Some problems were encountered while building the effective model for org.openmrs.distro:referenceapplication-ui-tests:jar:2.3-SNAPSHOT
27-Jul-2015 12:22:24 [WARNING] 'build.plugins.plugin.(groupId:artifactId)' must be unique but found duplicate declaration of plugin org.apache.maven.plugins:maven-failsafe-plugin @ line 141, column 21
27-Jul-2015 12:22:24 [WARNING] 'build.plugins.plugin.version' for org.apache.maven.plugins:maven-deploy-plugin is missing. @ line 162, column 21
27-Jul-2015 12:22:24 [WARNING] 'build.plugins.plugin.version' for org.apache.maven.plugins:maven-compiler-plugin is missing. @ line 124, column 21
27-Jul-2015 12:22:24 [WARNING] 'build.plugins.plugin.version' for org.apache.maven.plugins:maven-surefire-plugin is missing. @ line 133, column 21
27-Jul-2015 12:22:24 [WARNING]
27-Jul-2015 12:22:24 [WARNING] It is highly recommended to fix these problems because they threaten the stability of your build.
27-Jul-2015 12:22:24 [WARNING]
27-Jul-2015 12:22:24 [WARNING] For this reason, future Maven versions might no longer support building such malformed projects.
27-Jul-2015 12:22:24 [WARNING]
27-Jul-2015 12:22:24 [INFO]                                                                         
27-Jul-2015 12:22:24 [INFO] ------------------------------------------------------------------------
27-Jul-2015 12:22:24 [INFO] Building Reference Application Distribution UI Tests 2.3-SNAPSHOT
27-Jul-2015 12:22:24 [INFO] ------------------------------------------------------------------------
27-Jul-2015 12:22:25 [INFO] Downloading: http://mavenrepo.openmrs.org/nexus/content/repositories/public/org/openmrs/contrib/uitestframework/1.6-SNAPSHOT/maven-metadata.xml
27-Jul-2015 12:22:25 [INFO] Downloaded: http://mavenrepo.openmrs.org/nexus/content/repositories/public/org/openmrs/contrib/uitestframework/1.6-SNAPSHOT/maven-metadata.xml (781 B at 4.0 KB/sec)
27-Jul-2015 12:22:25 [INFO] Downloading: http://mavenrepo.openmrs.org/nexus/content/repositories/public/org/openmrs/contrib/uitestframework/1.6-SNAPSHOT/uitestframework-1.6-20150714.081543-10.pom
27-Jul-2015 12:22:25 [INFO] Downloaded: http://mavenrepo.openmrs.org/nexus/content/repositories/public/org/openmrs/contrib/uitestframework/1.6-SNAPSHOT/uitestframework-1.6-20150714.081543-10.pom (5 KB at 138.4 KB/sec)
27-Jul-2015 12:22:26 [INFO] Downloading: http://mavenrepo.openmrs.org/nexus/content/repositories/public/org/openmrs/contrib/uitestframework/1.6-SNAPSHOT/uitestframework-1.6-20150714.081543-10.jar
27-Jul-2015 12:22:26 [INFO] Downloaded: http://mavenrepo.openmrs.org/nexus/content/repositories/public/org/openmrs/contrib/uitestframework/1.6-SNAPSHOT/uitestframework-1.6-20150714.081543-10.jar (7984 KB at 22808.6 KB/sec)
27-Jul-2015 12:22:26 [INFO]
27-Jul-2015 12:22:26 [INFO] --- maven-clean-plugin:2.5:clean (default-clean) @ referenceapplication-ui-tests ---
27-Jul-2015 12:22:26 [INFO]
27-Jul-2015 12:22:26 [INFO] --- maven-resources-plugin:2.6:resources (default-resources) @ referenceapplication-ui-tests ---
27-Jul-2015 12:22:26 [INFO] Using 'UTF-8' encoding to copy filtered resources.
27-Jul-2015 12:22:26 [INFO] Copying 1 resource
27-Jul-2015 12:22:26 [INFO]
27-Jul-2015 12:22:26 [INFO] --- maven-compiler-plugin:3.1:compile (default-compile) @ referenceapplication-ui-tests ---
27-Jul-2015 12:22:27 [INFO] Changes detected - recompiling the module!
27-Jul-2015 12:22:27 [INFO] Compiling 26 source files to /home/bamboo-agent-1/bamboo-agent/xml-data/build-dir/REFAPP-OMODDISTRO-INTTESTS/ui-tests/target/classes
27-Jul-2015 12:22:28 [INFO]
27-Jul-2015 12:22:28 [INFO] --- maven-resources-plugin:2.6:testResources (default-testResources) @ referenceapplication-ui-tests ---
27-Jul-2015 12:22:28 [INFO] Using 'UTF-8' encoding to copy filtered resources.
27-Jul-2015 12:22:28 [INFO] skip non existing resourceDirectory /home/bamboo-agent-1/bamboo-agent/xml-data/build-dir/REFAPP-OMODDISTRO-INTTESTS/ui-tests/src/test/resources
27-Jul-2015 12:22:28 [INFO]
27-Jul-2015 12:22:28 [INFO] --- maven-compiler-plugin:3.1:testCompile (default-testCompile) @ referenceapplication-ui-tests ---
27-Jul-2015 12:22:28 [INFO] Changes detected - recompiling the module!
27-Jul-2015 12:22:28 [INFO] Compiling 65 source files to /home/bamboo-agent-1/bamboo-agent/xml-data/build-dir/REFAPP-OMODDISTRO-INTTESTS/ui-tests/target/test-classes
27-Jul-2015 12:22:29 [WARNING] /home/bamboo-agent-1/bamboo-agent/xml-data/build-dir/REFAPP-OMODDISTRO-INTTESTS/ui-tests/src/test/java/org/openmrs/reference/MergeVisitsTest.java: /home/bamboo-agent-1/bamboo-agent/xml-data/build-dir/REFAPP-OMODDISTRO-INTTESTS/ui-tests/src/test/java/org/openmrs/reference/MergeVisitsTest.java uses or overrides a deprecated API.
27-Jul-2015 12:22:29 [WARNING] /home/bamboo-agent-1/bamboo-agent/xml-data/build-dir/REFAPP-OMODDISTRO-INTTESTS/ui-tests/src/test/java/org/openmrs/reference/MergeVisitsTest.java: Recompile with -Xlint:deprecation for details.
27-Jul-2015 12:22:29 [WARNING] /home/bamboo-agent-1/bamboo-agent/xml-data/build-dir/REFAPP-OMODDISTRO-INTTESTS/ui-tests/src/test/java/org/openmrs/reference/AddRolesToUserTest.java: /home/bamboo-agent-1/bamboo-agent/xml-data/build-dir/REFAPP-OMODDISTRO-INTTESTS/ui-tests/src/test/java/org/openmrs/reference/AddRolesToUserTest.java uses unchecked or unsafe operations.
27-Jul-2015 12:22:29 [WARNING] /home/bamboo-agent-1/bamboo-agent/xml-data/build-dir/REFAPP-OMODDISTRO-INTTESTS/ui-tests/src/test/java/org/openmrs/reference/AddRolesToUserTest.java: Recompile with -Xlint:unchecked for details.
27-Jul-2015 12:22:29 [INFO]
27-Jul-2015 12:22:29 [INFO] --- maven-surefire-plugin:2.12.4:test (default-test) @ referenceapplication-ui-tests ---
27-Jul-2015 12:22:29 [INFO]
27-Jul-2015 12:22:29 [INFO] --- maven-jar-plugin:2.4:jar (default-jar) @ referenceapplication-ui-tests ---
27-Jul-2015 12:22:29 [INFO] Building jar: /home/bamboo-agent-1/bamboo-agent/xml-data/build-dir/REFAPP-OMODDISTRO-INTTESTS/ui-tests/target/referenceapplication-ui-tests-2.3-SNAPSHOT.jar
27-Jul-2015 12:22:29 [INFO]
27-Jul-2015 12:22:29 [INFO] --- selenium-maven-plugin:2.3:xvfb (xvfb) @ referenceapplication-ui-tests ---
27-Jul-2015 12:22:30 [INFO] Starting Xvfb...
27-Jul-2015 12:22:30 [INFO] Using display: :99
27-Jul-2015 12:22:30 [INFO] Using Xauthority file: /home/bamboo-agent-1/bamboo-agent/.agent_tmp/REFAPP-OMODDISTRO-INTTESTS/Xvfb1766403376590395251.Xauthority
27-Jul-2015 12:22:30 Deleting: /home/bamboo-agent-1/bamboo-agent/.agent_tmp/REFAPP-OMODDISTRO-INTTESTS/Xvfb1766403376590395251.Xauthority
27-Jul-2015 12:22:31 xauth:  file /home/bamboo-agent-1/bamboo-agent/.agent_tmp/REFAPP-OMODDISTRO-INTTESTS/Xvfb1766403376590395251.Xauthority does not exist
27-Jul-2015 12:22:31 Created dir: /home/bamboo-agent-1/bamboo-agent/xml-data/build-dir/REFAPP-OMODDISTRO-INTTESTS/ui-tests/target/selenium
27-Jul-2015 12:22:31 Launching Xvfb
27-Jul-2015 12:22:31 Waiting for Xvfb...
27-Jul-2015 12:22:31 [INFO] Redirecting output to: /home/bamboo-agent-1/bamboo-agent/xml-data/build-dir/REFAPP-OMODDISTRO-INTTESTS/ui-tests/target/selenium/xvfb.log
27-Jul-2015 12:22:32 Xvfb started
27-Jul-2015 12:22:32 [INFO]
27-Jul-2015 12:22:32 [INFO] --- maven-failsafe-plugin:2.18.1:integration-test (default) @ referenceapplication-ui-tests ---
27-Jul-2015 12:22:32 [INFO] Failsafe report directory: /home/bamboo-agent-1/bamboo-agent/xml-data/build-dir/REFAPP-OMODDISTRO-INTTESTS/ui-tests/target/failsafe-reports
27-Jul-2015 12:22:32
27-Jul-2015 12:22:32 -------------------------------------------------------
27-Jul-2015 12:22:32 T E S T S
27-Jul-2015 12:22:32 -------------------------------------------------------
27-Jul-2015 12:22:33 Running org.openmrs.reference.MergeVisitsTest
27-Jul-2015 12:22:33 test.properties found: file:/home/bamboo-agent-1/bamboo-agent/xml-data/build-dir/REFAPP-OMODDISTRO-INTTESTS/ui-tests/target/classes/org/openmrs/uitestframework/test.properties
27-Jul-2015 12:22:33 test.properties:
27-Jul-2015 12:22:33 {webapp.url=http://devtest01.openmrs.org:8080/openmrs, login.password=Admin123, login.username=admin, webdriver=chrome}
27-Jul-2015 12:22:33 webapp.url: http://devtest01.openmrs.org:8080/openmrs
27-Jul-2015 12:22:33 login.username: admin
27-Jul-2015 12:22:33 login.password: Admin123
27-Jul-2015 12:22:33 webdriver: chrome
27-Jul-2015 12:22:33 jdbc.connectionurl: jdbc:mysql://devtest01.openmrs.org:3306/openmrs
27-Jul-2015 12:22:33 log4j:WARN No appenders could be found for logger (org.apache.commons.vfs2.impl.StandardFileSystemManager).
27-Jul-2015 12:22:33 log4j:WARN Please initialize the log4j system properly.
27-Jul-2015 12:22:34 Starting ChromeDriver 2.14.313457 (3d645c400edf2e2c500566c9aa096063e707c9cf) on port 9476
27-Jul-2015 12:22:34 Only local connections are allowed.
27-Jul-2015 12:22:37 Tests run: 1, Failures: 0, Errors: 0, Skipped: 1, Time elapsed: 4.353 sec - in org.openmrs.reference.MergeVisitsTest
27-Jul-2015 12:22:37 Running org.openmrs.reference.ManagePersonTest
27-Jul-2015 12:22:37 Starting ChromeDriver 2.14.313457 (3d645c400edf2e2c500566c9aa096063e707c9cf) on port 6852
27-Jul-2015 12:22:37 Only local connections are allowed.
27-Jul-2015 12:23:23 Tests run: 1, Failures: 0, Errors: 0, Skipped: 0, Time elapsed: 45.562 sec - in org.openmrs.reference.ManagePersonTest
27-Jul-2015 12:23:23 Running org.openmrs.reference.XSSOnPhoneNumberFieldTest
27-Jul-2015 12:23:23 Starting ChromeDriver 2.14.313457 (3d645c400edf2e2c500566c9aa096063e707c9cf) on port 23728
27-Jul-2015 12:23:23 Only local connections are allowed.
27-Jul-2015 12:24:03 Tests run: 1, Failures: 0, Errors: 0, Skipped: 0, Time elapsed: 40.839 sec - in org.openmrs.reference.XSSOnPhoneNumberFieldTest
27-Jul-2015 12:24:03 Running org.openmrs.reference.StartVisitTest
27-Jul-2015 12:24:03 Starting ChromeDriver 2.14.313457 (3d645c400edf2e2c500566c9aa096063e707c9cf) on port 13154
27-Jul-2015 12:24:03 Only local connections are allowed.
27-Jul-2015 12:24:06 Tests run: 1, Failures: 0, Errors: 0, Skipped: 1, Time elapsed: 2.892 sec - in org.openmrs.reference.StartVisitTest
27-Jul-2015 12:24:06 Running org.openmrs.reference.AdmitToInpatientTest
27-Jul-2015 12:24:06 Starting ChromeDriver 2.14.313457 (3d645c400edf2e2c500566c9aa096063e707c9cf) on port 31085
27-Jul-2015 12:24:06 Only local connections are allowed.
27-Jul-2015 12:24:09 Tests run: 1, Failures: 0, Errors: 0, Skipped: 1, Time elapsed: 2.977 sec - in org.openmrs.reference.AdmitToInpatientTest
27-Jul-2015 12:24:09 Running org.openmrs.reference.AddPatientAppointmentTest
27-Jul-2015 12:24:09 Starting ChromeDriver 2.14.313457 (3d645c400edf2e2c500566c9aa096063e707c9cf) on port 18741
27-Jul-2015 12:24:09 Only local connections are allowed.
27-Jul-2015 12:24:58 Tests run: 1, Failures: 0, Errors: 1, Skipped: 0, Time elapsed: 48.636 sec <<< FAILURE! - in org.openmrs.reference.AddPatientAppointmentTest
27-Jul-2015 12:24:58 addPatientAppointmentTest(org.openmrs.reference.AddPatientAppointmentTest)  Time elapsed: 45.598 sec  <<< ERROR!
27-Jul-2015 12:24:58 org.openqa.selenium.TimeoutException: Timed out after 30 seconds waiting for visibility of element located by By.xpath: //div[@id='select-location']/select
27-Jul-2015 12:24:58 Build info: version: '2.37.0', revision: 'a7c61cbd68657e133ae96672cf995890bad2ee42', time: '2013-10-18 09:51:02'
27-Jul-2015 12:24:58 System info: host: 'gw107', ip: '149.165.228.105', os.name: 'Linux', os.arch: 'amd64', os.version: '3.13.0-45-generic', java.version: '1.7.0_79'
27-Jul-2015 12:24:58 Driver info: driver.version: unknown
27-Jul-2015 12:24:58         at org.openqa.selenium.support.ui.FluentWait.timeoutException(FluentWait.java:259)
27-Jul-2015 12:24:58         at org.openqa.selenium.support.ui.FluentWait.until(FluentWait.java:228)
27-Jul-2015 12:24:58         at org.openmrs.uitestframework.page.AbstractBasePage.waitForElement(AbstractBasePage.java:195)
27-Jul-2015 12:24:58         at org.openmrs.reference.page.AppointmentBlocksPage.selectLocationBlock(AppointmentBlocksPage.java:42)
27-Jul-2015 12:24:58         at org.openmrs.reference.AddPatientAppointmentTest.addPatientAppointmentTest(AddPatientAppointmentTest.java:41)
27-Jul-2015 12:24:58
27-Jul-2015 12:24:58 Running org.openmrs.reference.CheckModules
27-Jul-2015 12:24:58 Starting ChromeDriver 2.14.313457 (3d645c400edf2e2c500566c9aa096063e707c9cf) on port 8790
27-Jul-2015 12:24:58 Only local connections are allowed.
27-Jul-2015 12:25:07 Tests run: 1, Failures: 0, Errors: 0, Skipped: 0, Time elapsed: 9.511 sec - in org.openmrs.reference.CheckModules
27-Jul-2015 12:25:07 Running org.openmrs.reference.LoginTest
27-Jul-2015 12:25:08 Starting ChromeDriver 2.14.313457 (3d645c400edf2e2c500566c9aa096063e707c9cf) on port 32041
27-Jul-2015 12:25:08 Only local connections are allowed.
27-Jul-2015 12:25:19 Tests run: 5, Failures: 0, Errors: 0, Skipped: 0, Time elapsed: 11.194 sec - in org.openmrs.reference.LoginTest
27-Jul-2015 12:25:19 Running org.openmrs.reference.PasswordCannotMatchUsernameTest
27-Jul-2015 12:25:19 Starting ChromeDriver 2.14.313457 (3d645c400edf2e2c500566c9aa096063e707c9cf) on port 19628
27-Jul-2015 12:25:19 Only local connections are allowed.
27-Jul-2015 12:25:41 Tests run: 1, Failures: 1, Errors: 0, Skipped: 0, Time elapsed: 22.546 sec <<< FAILURE! - in org.openmrs.reference.PasswordCannotMatchUsernameTest
27-Jul-2015 12:25:41 passwordCannotMatchUsernameTest(org.openmrs.reference.PasswordCannotMatchUsernameTest)  Time elapsed: 19.628 sec  <<< FAILURE!
27-Jul-2015 12:25:41 java.lang.AssertionError: null
27-Jul-2015 12:25:41         at org.junit.Assert.fail(Assert.java:86)
27-Jul-2015 12:25:41         at org.junit.Assert.assertTrue(Assert.java:41)
27-Jul-2015 12:25:41         at org.junit.Assert.assertTrue(Assert.java:52)
27-Jul-2015 12:25:41         at org.openmrs.reference.PasswordCannotMatchUsernameTest.passwordCannotMatchUsernameTest(PasswordCannotMatchUsernameTest.java:48)
27-Jul-2015 12:25:41
27-Jul-2015 12:25:41 Running org.openmrs.reference.DeleteLocationTest
27-Jul-2015 12:25:41 Starting ChromeDriver 2.14.313457 (3d645c400edf2e2c500566c9aa096063e707c9cf) on port 4077
27-Jul-2015 12:25:41 Only local connections are allowed.
27-Jul-2015 12:25:55 Tests run: 1, Failures: 0, Errors: 0, Skipped: 0, Time elapsed: 13.519 sec - in org.openmrs.reference.DeleteLocationTest
27-Jul-2015 12:25:55 Running org.openmrs.reference.ProviderTest
27-Jul-2015 12:25:55 Starting ChromeDriver 2.14.313457 (3d645c400edf2e2c500566c9aa096063e707c9cf) on port 11438
27-Jul-2015 12:25:55 Only local connections are allowed.
27-Jul-2015 12:26:11 Tests run: 1, Failures: 0, Errors: 0, Skipped: 0, Time elapsed: 16.698 sec - in org.openmrs.reference.ProviderTest
27-Jul-2015 12:26:11 Running org.openmrs.reference.TransferToWardServiceTest
27-Jul-2015 12:26:11 Starting ChromeDriver 2.14.313457 (3d645c400edf2e2c500566c9aa096063e707c9cf) on port 30032
27-Jul-2015 12:26:11 Only local connections are allowed.
27-Jul-2015 12:26:14 Tests run: 1, Failures: 0, Errors: 0, Skipped: 1, Time elapsed: 2.802 sec - in org.openmrs.reference.TransferToWardServiceTest
27-Jul-2015 12:26:14 Running org.openmrs.reference.AutocompleteForNameTest
27-Jul-2015 12:26:14 Starting ChromeDriver 2.14.313457 (3d645c400edf2e2c500566c9aa096063e707c9cf) on port 3380
27-Jul-2015 12:26:14 Only local connections are allowed.
27-Jul-2015 12:27:01 Tests run: 1, Failures: 0, Errors: 0, Skipped: 0, Time elapsed: 46.862 sec - in org.openmrs.reference.AutocompleteForNameTest
27-Jul-2015 12:27:01 Running org.openmrs.reference.BookRequestAppointmentTest
27-Jul-2015 12:27:01 Starting ChromeDriver 2.14.313457 (3d645c400edf2e2c500566c9aa096063e707c9cf) on port 30873
27-Jul-2015 12:27:01 Only local connections are allowed.
27-Jul-2015 12:28:21 Tests run: 1, Failures: 0, Errors: 1, Skipped: 0, Time elapsed: 79.608 sec <<< FAILURE! - in org.openmrs.reference.BookRequestAppointmentTest
27-Jul-2015 12:28:21 bookRequestAppointmentTest(org.openmrs.reference.BookRequestAppointmentTest)  Time elapsed: 76.757 sec  <<< ERROR!
27-Jul-2015 12:28:21 org.openqa.selenium.TimeoutException: Timed out after 30 seconds waiting for visibility of element located by By.xpath: //div[@id='select-location']/select
27-Jul-2015 12:28:21 Build info: version: '2.37.0', revision: 'a7c61cbd68657e133ae96672cf995890bad2ee42', time: '2013-10-18 09:51:02'
27-Jul-2015 12:28:21 System info: host: 'gw107', ip: '149.165.228.105', os.name: 'Linux', os.arch: 'amd64', os.version: '3.13.0-45-generic', java.version: '1.7.0_79'
27-Jul-2015 12:28:21 Driver info: driver.version: unknown
27-Jul-2015 12:28:21         at org.openqa.selenium.support.ui.FluentWait.timeoutException(FluentWait.java:259)
27-Jul-2015 12:28:21         at org.openqa.selenium.support.ui.FluentWait.until(FluentWait.java:228)
27-Jul-2015 12:28:21         at org.openmrs.uitestframework.page.AbstractBasePage.waitForElement(AbstractBasePage.java:195)
27-Jul-2015 12:28:21         at org.openmrs.reference.page.AppointmentBlocksPage.selectLocationBlock(AppointmentBlocksPage.java:42)
27-Jul-2015 12:28:21         at org.openmrs.reference.BookRequestAppointmentTest.bookRequestAppointmentTest(BookRequestAppointmentTest.java:54)
27-Jul-2015 12:28:21
27-Jul-2015 12:28:21 Running org.openmrs.reference.ContactInfoTest
27-Jul-2015 12:28:21 Starting ChromeDriver 2.14.313457 (3d645c400edf2e2c500566c9aa096063e707c9cf) on port 13773
27-Jul-2015 12:28:21 Only local connections are allowed.
27-Jul-2015 12:28:24 Tests run: 1, Failures: 0, Errors: 0, Skipped: 1, Time elapsed: 2.809 sec - in org.openmrs.reference.ContactInfoTest
27-Jul-2015 12:28:24 Running org.openmrs.reference.ComeBackToApplicationAfterLogoutTest
27-Jul-2015 12:28:24 Starting ChromeDriver 2.14.313457 (3d645c400edf2e2c500566c9aa096063e707c9cf) on port 2070
27-Jul-2015 12:28:24 Only local connections are allowed.
27-Jul-2015 12:29:23 Tests run: 1, Failures: 1, Errors: 0, Skipped: 0, Time elapsed: 59.682 sec <<< FAILURE! - in org.openmrs.reference.ComeBackToApplicationAfterLogoutTest
27-Jul-2015 12:29:23 comeBackToApplicationAfterLogoutTest(org.openmrs.reference.ComeBackToApplicationAfterLogoutTest)  Time elapsed: 56.825 sec  <<< FAILURE!
27-Jul-2015 12:29:23 org.junit.ComparisonFailure: expected:</openmrs/[referenceapplication/home].page> but was:</openmrs/[coreapps/activeVisits].page>
27-Jul-2015 12:29:23         at org.junit.Assert.assertEquals(Assert.java:115)
27-Jul-2015 12:29:23         at org.junit.Assert.assertEquals(Assert.java:144)
27-Jul-2015 12:29:23         at org.openmrs.uitestframework.test.TestBase.assertPage(TestBase.java:326)
27-Jul-2015 12:29:23         at org.openmrs.reference.ComeBackToApplicationAfterLogoutTest.comeBackToApplicationAfterLogoutTest(ComeBackToApplicationAfterLogoutTest.java:32)
27-Jul-2015 12:29:23
27-Jul-2015 12:29:23 Running org.openmrs.reference.FindPatientRecordTest
27-Jul-2015 12:29:23 Starting ChromeDriver 2.14.313457 (3d645c400edf2e2c500566c9aa096063e707c9cf) on port 9771
27-Jul-2015 12:29:23 Only local connections are allowed.
27-Jul-2015 12:29:33 error during REST delete
27-Jul-2015 12:29:33 com.fasterxml.jackson.databind.JsonMappingException: No content to map due to end-of-input
27-Jul-2015 12:29:33 at [Source: java.io.StringReader@3bc02228; line: 1, column: 1]
27-Jul-2015 12:29:33         at com.fasterxml.jackson.databind.JsonMappingException.from(JsonMappingException.java:164)
27-Jul-2015 12:29:33         at com.fasterxml.jackson.databind.ObjectMapper._initForReading(ObjectMapper.java:2931)
27-Jul-2015 12:29:33         at com.fasterxml.jackson.databind.ObjectMapper._readMapAndClose(ObjectMapper.java:2873)
27-Jul-2015 12:29:33         at com.fasterxml.jackson.databind.ObjectMapper.readValue(ObjectMapper.java:2034)
27-Jul-2015 12:29:33         at org.openmrs.uitestframework.test.RestClient.delete(RestClient.java:64)
27-Jul-2015 12:29:33         at org.openmrs.uitestframework.test.RestClient.delete(RestClient.java:53)
27-Jul-2015 12:29:33         at org.openmrs.uitestframework.test.TestBase.deletePatient(TestBase.java:364)
27-Jul-2015 12:29:33         at org.openmrs.reference.FindPatientRecordTest.tearDown(FindPatientRecordTest.java:41)
27-Jul-2015 12:29:33         at sun.reflect.NativeMethodAccessorImpl.invoke0(Native Method)
27-Jul-2015 12:29:33         at sun.reflect.NativeMethodAccessorImpl.invoke(NativeMethodAccessorImpl.java:57)
27-Jul-2015 12:29:33         at sun.reflect.DelegatingMethodAccessorImpl.invoke(DelegatingMethodAccessorImpl.java:43)
27-Jul-2015 12:29:33         at java.lang.reflect.Method.invoke(Method.java:606)
27-Jul-2015 12:29:33         at org.junit.runners.model.FrameworkMethod$1.runReflectiveCall(FrameworkMethod.java:47)
27-Jul-2015 12:29:33         at org.junit.internal.runners.model.ReflectiveCallable.run(ReflectiveCallable.java:12)
27-Jul-2015 12:29:33         at org.junit.runners.model.FrameworkMethod.invokeExplosively(FrameworkMethod.java:44)
27-Jul-2015 12:29:33         at org.junit.internal.runners.statements.RunAfters.evaluate(RunAfters.java:33)
27-Jul-2015 12:29:33         at org.junit.rules.TestWatcher$1.evaluate(TestWatcher.java:55)
27-Jul-2015 12:29:33         at org.junit.rules.RunRules.evaluate(RunRules.java:20)
27-Jul-2015 12:29:33         at org.junit.runners.ParentRunner.runLeaf(ParentRunner.java:271)
27-Jul-2015 12:29:33         at org.junit.runners.BlockJUnit4ClassRunner.runChild(BlockJUnit4ClassRunner.java:70)
27-Jul-2015 12:29:33         at org.junit.runners.BlockJUnit4ClassRunner.runChild(BlockJUnit4ClassRunner.java:50)
27-Jul-2015 12:29:33         at org.junit.runners.ParentRunner$3.run(ParentRunner.java:238)
27-Jul-2015 12:29:33         at org.junit.runners.ParentRunner$1.schedule(ParentRunner.java:63)
27-Jul-2015 12:29:33         at org.junit.runners.ParentRunner.runChildren(ParentRunner.java:236)
27-Jul-2015 12:29:33         at org.junit.runners.ParentRunner.access$000(ParentRunner.java:53)
27-Jul-2015 12:29:33         at org.junit.runners.ParentRunner$2.evaluate(ParentRunner.java:229)
27-Jul-2015 12:29:33         at org.junit.internal.runners.statements.RunBefores.evaluate(RunBefores.java:26)
27-Jul-2015 12:29:33         at org.junit.internal.runners.statements.RunAfters.evaluate(RunAfters.java:27)
27-Jul-2015 12:29:33         at org.junit.rules.RunRules.evaluate(RunRules.java:20)
27-Jul-2015 12:29:33         at org.junit.runners.ParentRunner.run(ParentRunner.java:309)
27-Jul-2015 12:29:33         at org.apache.maven.surefire.junit4.JUnit4Provider.execute(JUnit4Provider.java:283)
27-Jul-2015 12:29:33         at org.apache.maven.surefire.junit4.JUnit4Provider.executeWithRerun(JUnit4Provider.java:173)
27-Jul-2015 12:29:33         at org.apache.maven.surefire.junit4.JUnit4Provider.executeTestSet(JUnit4Provider.java:153)
27-Jul-2015 12:29:33         at org.apache.maven.surefire.junit4.JUnit4Provider.invoke(JUnit4Provider.java:128)
27-Jul-2015 12:29:33         at org.apache.maven.surefire.booter.ForkedBooter.invokeProviderInSameClassLoader(ForkedBooter.java:203)
27-Jul-2015 12:29:33         at org.apache.maven.surefire.booter.ForkedBooter.runSuitesInProcess(ForkedBooter.java:155)
27-Jul-2015 12:29:33         at org.apache.maven.surefire.booter.ForkedBooter.main(ForkedBooter.java:103)
27-Jul-2015 12:29:34 Tests run: 1, Failures: 0, Errors: 0, Skipped: 0, Time elapsed: 10.952 sec - in org.openmrs.reference.FindPatientRecordTest
27-Jul-2015 12:29:34 Running org.openmrs.reference.VisitTypeAdministrationTest
27-Jul-2015 12:29:34 Starting ChromeDriver 2.14.313457 (3d645c400edf2e2c500566c9aa096063e707c9cf) on port 20958
27-Jul-2015 12:29:34 Only local connections are allowed.
27-Jul-2015 12:30:18 Tests run: 1, Failures: 0, Errors: 1, Skipped: 0, Time elapsed: 43.715 sec <<< FAILURE! - in org.openmrs.reference.VisitTypeAdministrationTest
27-Jul-2015 12:30:18 addEditRetireDeleteVisitTypeTest(org.openmrs.reference.VisitTypeAdministrationTest)  Time elapsed: 40.647 sec  <<< ERROR!
27-Jul-2015 12:30:18 org.openqa.selenium.TimeoutException: Timed out after 30 seconds waiting for presence of element located by: By.name: addName
27-Jul-2015 12:30:18 Build info: version: '2.37.0', revision: 'a7c61cbd68657e133ae96672cf995890bad2ee42', time: '2013-10-18 09:51:02'
27-Jul-2015 12:30:18 System info: host: 'gw107', ip: '149.165.228.105', os.name: 'Linux', os.arch: 'amd64', os.version: '3.13.0-45-generic', java.version: '1.7.0_79'
27-Jul-2015 12:30:18 Driver info: driver.version: unknown
27-Jul-2015 12:30:18         at sun.reflect.GeneratedConstructorAccessor20.newInstance(Unknown Source)
27-Jul-2015 12:30:18         at sun.reflect.DelegatingConstructorAccessorImpl.newInstance(DelegatingConstructorAccessorImpl.java:45)
27-Jul-2015 12:30:18         at java.lang.reflect.Constructor.newInstance(Constructor.java:526)
27-Jul-2015 12:30:18         at org.openqa.selenium.remote.ErrorHandler.createThrowable(ErrorHandler.java:193)
27-Jul-2015 12:30:18         at org.openqa.selenium.remote.ErrorHandler.throwIfResponseFailed(ErrorHandler.java:145)
27-Jul-2015 12:30:18         at org.openqa.selenium.remote.RemoteWebDriver.execute(RemoteWebDriver.java:554)
27-Jul-2015 12:30:18         at org.openqa.selenium.remote.RemoteWebDriver.findElement(RemoteWebDriver.java:307)
27-Jul-2015 12:30:18         at org.openqa.selenium.remote.RemoteWebDriver.findElementByName(RemoteWebDriver.java:380)
27-Jul-2015 12:30:18         at org.openqa.selenium.By$ByName.findElement(By.java:305)
27-Jul-2015 12:30:18         at org.openqa.selenium.remote.RemoteWebDriver.findElement(RemoteWebDriver.java:299)
27-Jul-2015 12:30:18         at org.openqa.selenium.support.ui.ExpectedConditions.findElement(ExpectedConditions.java:579)
27-Jul-2015 12:30:18         at org.openqa.selenium.support.ui.ExpectedConditions.access$000(ExpectedConditions.java:39)
27-Jul-2015 12:30:18         at org.openqa.selenium.support.ui.ExpectedConditions$3.apply(ExpectedConditions.java:106)
27-Jul-2015 12:30:18         at org.openqa.selenium.support.ui.ExpectedConditions$3.apply(ExpectedConditions.java:103)
27-Jul-2015 12:30:18         at org.openqa.selenium.support.ui.FluentWait.until(FluentWait.java:208)
27-Jul-2015 12:30:18         at org.openmrs.uitestframework.page.AbstractBasePage.findElement(AbstractBasePage.java:51)
27-Jul-2015 12:30:18         at org.openmrs.reference.page.AdminManagementPage.fillInName(AdminManagementPage.java:98)
27-Jul-2015 12:30:18         at org.openmrs.reference.page.VisitTypePage.createVisitType(VisitTypePage.java:27)
27-Jul-2015 12:30:18         at org.openmrs.reference.VisitTypeAdministrationTest.addEditRetireDeleteVisitTypeTest(VisitTypeAdministrationTest.java:48)
27-Jul-2015 12:30:18
27-Jul-2015 12:30:18 Running org.openmrs.reference.VisitNoteTest
27-Jul-2015 12:30:18 Starting ChromeDriver 2.14.313457 (3d645c400edf2e2c500566c9aa096063e707c9cf) on port 11979
27-Jul-2015 12:30:18 Only local connections are allowed.
27-Jul-2015 12:30:21 Tests run: 1, Failures: 0, Errors: 0, Skipped: 1, Time elapsed: 2.963 sec - in org.openmrs.reference.VisitNoteTest
27-Jul-2015 12:30:21 Running org.openmrs.reference.ServiceTest
27-Jul-2015 12:30:21 Starting ChromeDriver 2.14.313457 (3d645c400edf2e2c500566c9aa096063e707c9cf) on port 5245
27-Jul-2015 12:30:21 Only local connections are allowed.
27-Jul-2015 12:31:46 Tests run: 1, Failures: 0, Errors: 0, Skipped: 0, Time elapsed: 85.22 sec - in org.openmrs.reference.ServiceTest
27-Jul-2015 12:31:46 Running org.openmrs.reference.RecentlyPatientTest
27-Jul-2015 12:31:46 Starting ChromeDriver 2.14.313457 (3d645c400edf2e2c500566c9aa096063e707c9cf) on port 12932
27-Jul-2015 12:31:46 Only local connections are allowed.
27-Jul-2015 12:31:49 Tests run: 1, Failures: 0, Errors: 0, Skipped: 1, Time elapsed: 2.988 sec - in org.openmrs.reference.RecentlyPatientTest
27-Jul-2015 12:31:49 Running org.openmrs.reference.AddNewAllergyTest
27-Jul-2015 12:31:49 Starting ChromeDriver 2.14.313457 (3d645c400edf2e2c500566c9aa096063e707c9cf) on port 6695
27-Jul-2015 12:31:49 Only local connections are allowed.
27-Jul-2015 12:32:50 Tests run: 1, Failures: 0, Errors: 0, Skipped: 0, Time elapsed: 60.737 sec - in org.openmrs.reference.AddNewAllergyTest
27-Jul-2015 12:32:50 Running org.openmrs.reference.DeleteAppointmentBlockTest
27-Jul-2015 12:32:50 Starting ChromeDriver 2.14.313457 (3d645c400edf2e2c500566c9aa096063e707c9cf) on port 22553
27-Jul-2015 12:32:50 Only local connections are allowed.
27-Jul-2015 12:33:38 Tests run: 1, Failures: 0, Errors: 1, Skipped: 0, Time elapsed: 47.908 sec <<< FAILURE! - in org.openmrs.reference.DeleteAppointmentBlockTest
27-Jul-2015 12:33:38 deleteAppointmentBlockTest(org.openmrs.reference.DeleteAppointmentBlockTest)  Time elapsed: 45.003 sec  <<< ERROR!
27-Jul-2015 12:33:38 org.openqa.selenium.TimeoutException: Timed out after 30 seconds waiting for visibility of element located by By.xpath: //div[@id='select-location']/select
27-Jul-2015 12:33:38 Build info: version: '2.37.0', revision: 'a7c61cbd68657e133ae96672cf995890bad2ee42', time: '2013-10-18 09:51:02'
27-Jul-2015 12:33:38 System info: host: 'gw107', ip: '149.165.228.105', os.name: 'Linux', os.arch: 'amd64', os.version: '3.13.0-45-generic', java.version: '1.7.0_79'
27-Jul-2015 12:33:38 Driver info: driver.version: unknown
27-Jul-2015 12:33:38         at org.openqa.selenium.support.ui.FluentWait.timeoutException(FluentWait.java:259)
27-Jul-2015 12:33:38         at org.openqa.selenium.support.ui.FluentWait.until(FluentWait.java:228)
27-Jul-2015 12:33:38         at org.openmrs.uitestframework.page.AbstractBasePage.waitForElement(AbstractBasePage.java:195)
27-Jul-2015 12:33:38         at org.openmrs.reference.page.AppointmentBlocksPage.selectLocationBlock(AppointmentBlocksPage.java:42)
27-Jul-2015 12:33:38         at org.openmrs.reference.DeleteAppointmentBlockTest.deleteAppointmentBlockTest(DeleteAppointmentBlockTest.java:35)
27-Jul-2015 12:33:38
27-Jul-2015 12:33:38 Running org.openmrs.reference.AddUserTest
27-Jul-2015 12:33:38 Starting ChromeDriver 2.14.313457 (3d645c400edf2e2c500566c9aa096063e707c9cf) on port 23241
27-Jul-2015 12:33:38 Only local connections are allowed.
27-Jul-2015 12:34:20 Tests run: 1, Failures: 1, Errors: 0, Skipped: 0, Time elapsed: 42.096 sec <<< FAILURE! - in org.openmrs.reference.AddUserTest
27-Jul-2015 12:34:20 addUserTest(org.openmrs.reference.AddUserTest)  Time elapsed: 39.244 sec  <<< FAILURE!
27-Jul-2015 12:34:20 java.lang.AssertionError: null
27-Jul-2015 12:34:20         at org.junit.Assert.fail(Assert.java:86)
27-Jul-2015 12:34:20         at org.junit.Assert.assertTrue(Assert.java:41)
27-Jul-2015 12:34:20         at org.junit.Assert.assertTrue(Assert.java:52)
27-Jul-2015 12:34:20         at org.openmrs.reference.AddUserTest.addUserTest(AddUserTest.java:57)
27-Jul-2015 12:34:20
27-Jul-2015 12:34:20 Running org.openmrs.reference.FindPatientByFamilyNameTest
27-Jul-2015 12:34:20 Starting ChromeDriver 2.14.313457 (3d645c400edf2e2c500566c9aa096063e707c9cf) on port 15361
27-Jul-2015 12:34:20 Only local connections are allowed.
27-Jul-2015 12:34:28 Tests run: 1, Failures: 0, Errors: 0, Skipped: 0, Time elapsed: 7.993 sec - in org.openmrs.reference.FindPatientByFamilyNameTest
27-Jul-2015 12:34:28 Running org.openmrs.reference.CreateAppointmentBlockTest
27-Jul-2015 12:34:28 Starting ChromeDriver 2.14.313457 (3d645c400edf2e2c500566c9aa096063e707c9cf) on port 15004
27-Jul-2015 12:34:28 Only local connections are allowed.
27-Jul-2015 12:35:16 Tests run: 1, Failures: 0, Errors: 1, Skipped: 0, Time elapsed: 47.809 sec <<< FAILURE! - in org.openmrs.reference.CreateAppointmentBlockTest
27-Jul-2015 12:35:16 createAppointmentBlockTest(org.openmrs.reference.CreateAppointmentBlockTest)  Time elapsed: 44.659 sec  <<< ERROR!
27-Jul-2015 12:35:16 org.openqa.selenium.TimeoutException: Timed out after 30 seconds waiting for visibility of element located by By.xpath: //div[@id='select-location']/select
27-Jul-2015 12:35:16 Build info: version: '2.37.0', revision: 'a7c61cbd68657e133ae96672cf995890bad2ee42', time: '2013-10-18 09:51:02'
27-Jul-2015 12:35:16 System info: host: 'gw107', ip: '149.165.228.105', os.name: 'Linux', os.arch: 'amd64', os.version: '3.13.0-45-generic', java.version: '1.7.0_79'
27-Jul-2015 12:35:16 Driver info: driver.version: unknown
27-Jul-2015 12:35:16         at org.openqa.selenium.support.ui.FluentWait.timeoutException(FluentWait.java:259)
27-Jul-2015 12:35:16         at org.openqa.selenium.support.ui.FluentWait.until(FluentWait.java:228)
27-Jul-2015 12:35:16         at org.openmrs.uitestframework.page.AbstractBasePage.waitForElement(AbstractBasePage.java:195)
27-Jul-2015 12:35:16         at org.openmrs.reference.page.AppointmentBlocksPage.selectLocationBlock(AppointmentBlocksPage.java:42)
27-Jul-2015 12:35:16         at org.openmrs.reference.CreateAppointmentBlockTest.createAppointmentBlockTest(CreateAppointmentBlockTest.java:36)
27-Jul-2015 12:35:16
27-Jul-2015 12:35:16 Running org.openmrs.reference.NamePatientAccentedLetterTest
27-Jul-2015 12:35:16 Starting ChromeDriver 2.14.313457 (3d645c400edf2e2c500566c9aa096063e707c9cf) on port 30155
27-Jul-2015 12:35:16 Only local connections are allowed.
27-Jul-2015 12:35:26 Tests run: 1, Failures: 0, Errors: 0, Skipped: 0, Time elapsed: 10.088 sec - in org.openmrs.reference.NamePatientAccentedLetterTest
27-Jul-2015 12:35:26 Running org.openmrs.reference.RelationTypeTest
27-Jul-2015 12:35:26 Starting ChromeDriver 2.14.313457 (3d645c400edf2e2c500566c9aa096063e707c9cf) on port 3116
27-Jul-2015 12:35:26 Only local connections are allowed.
27-Jul-2015 12:35:37 Tests run: 1, Failures: 1, Errors: 0, Skipped: 0, Time elapsed: 11.452 sec <<< FAILURE! - in org.openmrs.reference.RelationTypeTest
27-Jul-2015 12:35:37 addEditRetireDeleteRelationTypeTest(org.openmrs.reference.RelationTypeTest)  Time elapsed: 8.654 sec  <<< FAILURE!
27-Jul-2015 12:35:37 java.lang.AssertionError: null
27-Jul-2015 12:35:37         at org.junit.Assert.fail(Assert.java:86)
27-Jul-2015 12:35:37         at org.junit.Assert.assertTrue(Assert.java:41)
27-Jul-2015 12:35:37         at org.junit.Assert.assertTrue(Assert.java:52)
27-Jul-2015 12:35:37         at org.openmrs.reference.RelationTypeTest.addEditRetireDeleteRelationTypeTest(RelationTypeTest.java:51)
27-Jul-2015 12:35:37
27-Jul-2015 12:35:37 Running org.openmrs.reference.MergePatientByNameTest
27-Jul-2015 12:35:37 Starting ChromeDriver 2.14.313457 (3d645c400edf2e2c500566c9aa096063e707c9cf) on port 29805
27-Jul-2015 12:35:37 Only local connections are allowed.
27-Jul-2015 12:36:18 Tests run: 1, Failures: 0, Errors: 1, Skipped: 0, Time elapsed: 41.058 sec <<< FAILURE! - in org.openmrs.reference.MergePatientByNameTest
27-Jul-2015 12:36:18 mergePatientByNameTest(org.openmrs.reference.MergePatientByNameTest)  Time elapsed: 38.192 sec  <<< ERROR!
27-Jul-2015 12:36:18 org.openqa.selenium.TimeoutException: Timed out after 30 seconds waiting for visibility of element located by By.className: patient-header
27-Jul-2015 12:36:18 Build info: version: '2.37.0', revision: 'a7c61cbd68657e133ae96672cf995890bad2ee42', time: '2013-10-18 09:51:02'
27-Jul-2015 12:36:18 System info: host: 'gw107', ip: '149.165.228.105', os.name: 'Linux', os.arch: 'amd64', os.version: '3.13.0-45-generic', java.version: '1.7.0_79'
27-Jul-2015 12:36:18 Driver info: driver.version: unknown
27-Jul-2015 12:36:18         at sun.reflect.GeneratedConstructorAccessor20.newInstance(Unknown Source)
27-Jul-2015 12:36:18         at sun.reflect.DelegatingConstructorAccessorImpl.newInstance(DelegatingConstructorAccessorImpl.java:45)
27-Jul-2015 12:36:18         at java.lang.reflect.Constructor.newInstance(Constructor.java:526)
27-Jul-2015 12:36:18         at org.openqa.selenium.remote.ErrorHandler.createThrowable(ErrorHandler.java:193)
27-Jul-2015 12:36:18         at org.openqa.selenium.remote.ErrorHandler.throwIfResponseFailed(ErrorHandler.java:145)
27-Jul-2015 12:36:18         at org.openqa.selenium.remote.RemoteWebDriver.execute(RemoteWebDriver.java:554)
27-Jul-2015 12:36:18         at org.openqa.selenium.remote.RemoteWebDriver.findElement(RemoteWebDriver.java:307)
27-Jul-2015 12:36:18         at org.openqa.selenium.remote.RemoteWebDriver.findElementByClassName(RemoteWebDriver.java:388)
27-Jul-2015 12:36:18         at org.openqa.selenium.By$ByClassName.findElement(By.java:393)
27-Jul-2015 12:36:18         at org.openqa.selenium.remote.RemoteWebDriver.findElement(RemoteWebDriver.java:299)
27-Jul-2015 12:36:18         at org.openqa.selenium.support.ui.ExpectedConditions.findElement(ExpectedConditions.java:579)
27-Jul-2015 12:36:18         at org.openqa.selenium.support.ui.ExpectedConditions.access$000(ExpectedConditions.java:39)
27-Jul-2015 12:36:18         at org.openqa.selenium.support.ui.ExpectedConditions$4.apply(ExpectedConditions.java:130)
27-Jul-2015 12:36:18         at org.openqa.selenium.support.ui.ExpectedConditions$4.apply(ExpectedConditions.java:126)
27-Jul-2015 12:36:18         at org.openqa.selenium.support.ui.FluentWait.until(FluentWait.java:208)
27-Jul-2015 12:36:18         at org.openmrs.uitestframework.page.AbstractBasePage.waitForElement(AbstractBasePage.java:195)
27-Jul-2015 12:36:18         at org.openmrs.reference.page.RegistrationPage.confirmPatient(RegistrationPage.java:243)
27-Jul-2015 12:36:18         at org.openmrs.reference.page.RegistrationPage.enterMegrePatient(RegistrationPage.java:299)
27-Jul-2015 12:36:18         at org.openmrs.reference.MergePatientByNameTest.mergePatientByNameTest(MergePatientByNameTest.java:54)
27-Jul-2015 12:36:18
27-Jul-2015 12:36:18 Running org.openmrs.reference.FindPatientByIdAndNameTest
27-Jul-2015 12:36:18 Starting ChromeDriver 2.14.313457 (3d645c400edf2e2c500566c9aa096063e707c9cf) on port 17681
27-Jul-2015 12:36:18 Only local connections are allowed.
27-Jul-2015 12:36:21 Tests run: 1, Failures: 0, Errors: 0, Skipped: 1, Time elapsed: 2.946 sec - in org.openmrs.reference.FindPatientByIdAndNameTest
27-Jul-2015 12:36:21 Running org.openmrs.reference.RegistrationFormQuestionTest
27-Jul-2015 12:36:21 Starting ChromeDriver 2.14.313457 (3d645c400edf2e2c500566c9aa096063e707c9cf) on port 15214
27-Jul-2015 12:36:21 Only local connections are allowed.
27-Jul-2015 12:36:24 Tests run: 1, Failures: 0, Errors: 0, Skipped: 1, Time elapsed: 2.922 sec - in org.openmrs.reference.RegistrationFormQuestionTest
27-Jul-2015 12:36:24 Running org.openmrs.reference.DeleteAllergyTest
27-Jul-2015 12:36:24 Starting ChromeDriver 2.14.313457 (3d645c400edf2e2c500566c9aa096063e707c9cf) on port 29690
27-Jul-2015 12:36:24 Only local connections are allowed.
27-Jul-2015 12:37:13 Tests run: 1, Failures: 0, Errors: 0, Skipped: 0, Time elapsed: 49.251 sec - in org.openmrs.reference.DeleteAllergyTest
27-Jul-2015 12:37:13 Running org.openmrs.reference.ExitFromInpatientTest
27-Jul-2015 12:37:13 Starting ChromeDriver 2.14.313457 (3d645c400edf2e2c500566c9aa096063e707c9cf) on port 7492
27-Jul-2015 12:37:13 Only local connections are allowed.
27-Jul-2015 12:37:16 Tests run: 1, Failures: 0, Errors: 0, Skipped: 1, Time elapsed: 2.894 sec - in org.openmrs.reference.ExitFromInpatientTest
27-Jul-2015 12:37:16 Running org.openmrs.reference.EditConceptTest
27-Jul-2015 12:37:16 Starting ChromeDriver 2.14.313457 (3d645c400edf2e2c500566c9aa096063e707c9cf) on port 2107
27-Jul-2015 12:37:16 Only local connections are allowed.
27-Jul-2015 12:38:00 Tests run: 1, Failures: 0, Errors: 1, Skipped: 0, Time elapsed: 43.856 sec <<< FAILURE! - in org.openmrs.reference.EditConceptTest
27-Jul-2015 12:38:00 editConceptTest(org.openmrs.reference.EditConceptTest)  Time elapsed: 40.748 sec  <<< ERROR!
27-Jul-2015 12:38:00 org.openqa.selenium.TimeoutException: Timed out after 30 seconds waiting for presence of element located by: By.linkText: Edit
27-Jul-2015 12:38:00 Build info: version: '2.37.0', revision: 'a7c61cbd68657e133ae96672cf995890bad2ee42', time: '2013-10-18 09:51:02'
27-Jul-2015 12:38:00 System info: host: 'gw107', ip: '149.165.228.105', os.name: 'Linux', os.arch: 'amd64', os.version: '3.13.0-45-generic', java.version: '1.7.0_79'
27-Jul-2015 12:38:00 Driver info: driver.version: unknown
27-Jul-2015 12:38:00         at sun.reflect.GeneratedConstructorAccessor20.newInstance(Unknown Source)
27-Jul-2015 12:38:00         at sun.reflect.DelegatingConstructorAccessorImpl.newInstance(DelegatingConstructorAccessorImpl.java:45)
27-Jul-2015 12:38:00         at java.lang.reflect.Constructor.newInstance(Constructor.java:526)
27-Jul-2015 12:38:00         at org.openqa.selenium.remote.ErrorHandler.createThrowable(ErrorHandler.java:193)
27-Jul-2015 12:38:00         at org.openqa.selenium.remote.ErrorHandler.throwIfResponseFailed(ErrorHandler.java:145)
27-Jul-2015 12:38:00         at org.openqa.selenium.remote.RemoteWebDriver.execute(RemoteWebDriver.java:554)
27-Jul-2015 12:38:00         at org.openqa.selenium.remote.RemoteWebDriver.findElement(RemoteWebDriver.java:307)
27-Jul-2015 12:38:00         at org.openqa.selenium.remote.RemoteWebDriver.findElementByLinkText(RemoteWebDriver.java:356)
27-Jul-2015 12:38:00         at org.openqa.selenium.By$ByLinkText.findElement(By.java:248)
27-Jul-2015 12:38:00         at org.openqa.selenium.remote.RemoteWebDriver.findElement(RemoteWebDriver.java:299)
27-Jul-2015 12:38:00         at org.openqa.selenium.support.ui.ExpectedConditions.findElement(ExpectedConditions.java:579)
27-Jul-2015 12:38:00         at org.openqa.selenium.support.ui.ExpectedConditions.access$000(ExpectedConditions.java:39)
27-Jul-2015 12:38:00         at org.openqa.selenium.support.ui.ExpectedConditions$3.apply(ExpectedConditions.java:106)
27-Jul-2015 12:38:00         at org.openqa.selenium.support.ui.ExpectedConditions$3.apply(ExpectedConditions.java:103)
27-Jul-2015 12:38:00         at org.openqa.selenium.support.ui.FluentWait.until(FluentWait.java:208)
27-Jul-2015 12:38:00         at org.openmrs.uitestframework.page.AbstractBasePage.findElement(AbstractBasePage.java:51)
27-Jul-2015 12:38:00         at org.openmrs.uitestframework.page.AbstractBasePage.clickOn(AbstractBasePage.java:97)
27-Jul-2015 12:38:00         at org.openmrs.reference.page.ConceptFormPage.editConcept(ConceptFormPage.java:52)
27-Jul-2015 12:38:00         at org.openmrs.reference.EditConceptTest.editConceptTest(EditConceptTest.java:36)
27-Jul-2015 12:38:00
27-Jul-2015 12:38:00 Running org.openmrs.reference.UnidentifiedPatientKeyboardTest
27-Jul-2015 12:38:00 Starting ChromeDriver 2.14.313457 (3d645c400edf2e2c500566c9aa096063e707c9cf) on port 10076
27-Jul-2015 12:38:00 Only local connections are allowed.
27-Jul-2015 12:38:03 Tests run: 1, Failures: 0, Errors: 0, Skipped: 1, Time elapsed: 3.009 sec - in org.openmrs.reference.UnidentifiedPatientKeyboardTest
27-Jul-2015 12:38:03 Running org.openmrs.reference.EditDemographicTest
27-Jul-2015 12:38:03 Starting ChromeDriver 2.14.313457 (3d645c400edf2e2c500566c9aa096063e707c9cf) on port 21926
27-Jul-2015 12:38:03 Only local connections are allowed.
27-Jul-2015 12:38:06 Tests run: 1, Failures: 0, Errors: 0, Skipped: 1, Time elapsed: 2.88 sec - in org.openmrs.reference.EditDemographicTest
27-Jul-2015 12:38:06 Running org.openmrs.reference.EndVisitTest
27-Jul-2015 12:38:06 Starting ChromeDriver 2.14.313457 (3d645c400edf2e2c500566c9aa096063e707c9cf) on port 14565
27-Jul-2015 12:38:06 Only local connections are allowed.
27-Jul-2015 12:38:09 Tests run: 1, Failures: 0, Errors: 0, Skipped: 1, Time elapsed: 2.937 sec - in org.openmrs.reference.EndVisitTest
27-Jul-2015 12:38:09 Running org.openmrs.reference.UsingBackButtonInMergePatientTest
27-Jul-2015 12:38:09 Starting ChromeDriver 2.14.313457 (3d645c400edf2e2c500566c9aa096063e707c9cf) on port 30863
27-Jul-2015 12:38:09 Only local connections are allowed.
27-Jul-2015 12:38:27 Tests run: 1, Failures: 0, Errors: 0, Skipped: 0, Time elapsed: 18.144 sec - in org.openmrs.reference.UsingBackButtonInMergePatientTest
27-Jul-2015 12:38:27 Running org.openmrs.reference.DuplicatePatientRegisterTest
27-Jul-2015 12:38:27 Starting ChromeDriver 2.14.313457 (3d645c400edf2e2c500566c9aa096063e707c9cf) on port 19815
27-Jul-2015 12:38:27 Only local connections are allowed.
27-Jul-2015 12:38:30 Tests run: 1, Failures: 0, Errors: 0, Skipped: 1, Time elapsed: 2.816 sec - in org.openmrs.reference.DuplicatePatientRegisterTest
27-Jul-2015 12:38:30 Running org.openmrs.reference.EditAppointmentBlockTest
27-Jul-2015 12:38:30 Starting ChromeDriver 2.14.313457 (3d645c400edf2e2c500566c9aa096063e707c9cf) on port 6282
27-Jul-2015 12:38:30 Only local connections are allowed.
27-Jul-2015 12:39:18 Tests run: 1, Failures: 0, Errors: 1, Skipped: 0, Time elapsed: 47.713 sec <<< FAILURE! - in org.openmrs.reference.EditAppointmentBlockTest
27-Jul-2015 12:39:18 editAppointmentBlockTest(org.openmrs.reference.EditAppointmentBlockTest)  Time elapsed: 44.874 sec  <<< ERROR!
27-Jul-2015 12:39:18 org.openqa.selenium.TimeoutException: Timed out after 30 seconds waiting for visibility of element located by By.xpath: //div[@id='select-location']/select
27-Jul-2015 12:39:18 Build info: version: '2.37.0', revision: 'a7c61cbd68657e133ae96672cf995890bad2ee42', time: '2013-10-18 09:51:02'
27-Jul-2015 12:39:18 System info: host: 'gw107', ip: '149.165.228.105', os.name: 'Linux', os.arch: 'amd64', os.version: '3.13.0-45-generic', java.version: '1.7.0_79'
27-Jul-2015 12:39:18 Driver info: driver.version: unknown
27-Jul-2015 12:39:18         at org.openqa.selenium.support.ui.FluentWait.timeoutException(FluentWait.java:259)
27-Jul-2015 12:39:18         at org.openqa.selenium.support.ui.FluentWait.until(FluentWait.java:228)
27-Jul-2015 12:39:18         at org.openmrs.uitestframework.page.AbstractBasePage.waitForElement(AbstractBasePage.java:195)
27-Jul-2015 12:39:18         at org.openmrs.reference.page.AppointmentBlocksPage.selectLocationBlock(AppointmentBlocksPage.java:42)
27-Jul-2015 12:39:18         at org.openmrs.reference.EditAppointmentBlockTest.editAppointmentBlockTest(EditAppointmentBlockTest.java:36)
27-Jul-2015 12:39:18
27-Jul-2015 12:39:18 Running org.openmrs.reference.EditFormTest
27-Jul-2015 12:39:18 Starting ChromeDriver 2.14.313457 (3d645c400edf2e2c500566c9aa096063e707c9cf) on port 26964
27-Jul-2015 12:39:18 Only local connections are allowed.
27-Jul-2015 12:39:21 Tests run: 1, Failures: 0, Errors: 0, Skipped: 1, Time elapsed: 2.919 sec - in org.openmrs.reference.EditFormTest
27-Jul-2015 12:39:21 Running org.openmrs.reference.DeleteRequestAppointmentTest
27-Jul-2015 12:39:21 Starting ChromeDriver 2.14.313457 (3d645c400edf2e2c500566c9aa096063e707c9cf) on port 4198
27-Jul-2015 12:39:21 Only local connections are allowed.
27-Jul-2015 12:40:36 Tests run: 1, Failures: 0, Errors: 1, Skipped: 0, Time elapsed: 75.085 sec <<< FAILURE! - in org.openmrs.reference.DeleteRequestAppointmentTest
27-Jul-2015 12:40:36 deleteRequestAppointmentTest(org.openmrs.reference.DeleteRequestAppointmentTest)  Time elapsed: 72.087 sec  <<< ERROR!
27-Jul-2015 12:40:36 org.openqa.selenium.TimeoutException: Timed out after 30 seconds waiting for visibility of element located by By.xpath: //div[@id='select-location']/select
27-Jul-2015 12:40:36 Build info: version: '2.37.0', revision: 'a7c61cbd68657e133ae96672cf995890bad2ee42', time: '2013-10-18 09:51:02'
27-Jul-2015 12:40:36 System info: host: 'gw107', ip: '149.165.228.105', os.name: 'Linux', os.arch: 'amd64', os.version: '3.13.0-45-generic', java.version: '1.7.0_79'
27-Jul-2015 12:40:36 Driver info: driver.version: unknown
27-Jul-2015 12:40:36         at org.openqa.selenium.support.ui.FluentWait.timeoutException(FluentWait.java:259)
27-Jul-2015 12:40:36         at org.openqa.selenium.support.ui.FluentWait.until(FluentWait.java:228)
27-Jul-2015 12:40:36         at org.openmrs.uitestframework.page.AbstractBasePage.waitForElement(AbstractBasePage.java:195)
27-Jul-2015 12:40:36         at org.openmrs.reference.page.AppointmentBlocksPage.selectLocationBlock(AppointmentBlocksPage.java:42)
27-Jul-2015 12:40:36         at org.openmrs.reference.DeleteRequestAppointmentTest.deleteRequestAppointmentTest(DeleteRequestAppointmentTest.java:56)
27-Jul-2015 12:40:36
27-Jul-2015 12:40:36 Running org.openmrs.reference.ManageProviderSchedulesTest
27-Jul-2015 12:40:36 Starting ChromeDriver 2.14.313457 (3d645c400edf2e2c500566c9aa096063e707c9cf) on port 10401
27-Jul-2015 12:40:36 Only local connections are allowed.
27-Jul-2015 12:40:47 Tests run: 1, Failures: 0, Errors: 0, Skipped: 0, Time elapsed: 11.776 sec - in org.openmrs.reference.ManageProviderSchedulesTest
27-Jul-2015 12:40:47 Running org.openmrs.reference.AddConceptDrugTest
27-Jul-2015 12:40:48 Starting ChromeDriver 2.14.313457 (3d645c400edf2e2c500566c9aa096063e707c9cf) on port 29252
27-Jul-2015 12:40:48 Only local connections are allowed.
27-Jul-2015 12:41:27 Tests run: 1, Failures: 0, Errors: 1, Skipped: 0, Time elapsed: 39.549 sec <<< FAILURE! - in org.openmrs.reference.AddConceptDrugTest
27-Jul-2015 12:41:27 addConceptDrugTest(org.openmrs.reference.AddConceptDrugTest)  Time elapsed: 36.49 sec  <<< ERROR!
27-Jul-2015 12:41:27 org.openqa.selenium.TimeoutException: Timed out after 30 seconds waiting for presence of element located by: By.linkText: Edit
27-Jul-2015 12:41:27 Build info: version: '2.37.0', revision: 'a7c61cbd68657e133ae96672cf995890bad2ee42', time: '2013-10-18 09:51:02'
27-Jul-2015 12:41:27 System info: host: 'gw107', ip: '149.165.228.105', os.name: 'Linux', os.arch: 'amd64', os.version: '3.13.0-45-generic', java.version: '1.7.0_79'
27-Jul-2015 12:41:27 Driver info: driver.version: unknown
27-Jul-2015 12:41:27         at sun.reflect.GeneratedConstructorAccessor20.newInstance(Unknown Source)
27-Jul-2015 12:41:27         at sun.reflect.DelegatingConstructorAccessorImpl.newInstance(DelegatingConstructorAccessorImpl.java:45)
27-Jul-2015 12:41:27         at java.lang.reflect.Constructor.newInstance(Constructor.java:526)
27-Jul-2015 12:41:27         at org.openqa.selenium.remote.ErrorHandler.createThrowable(ErrorHandler.java:193)
27-Jul-2015 12:41:27         at org.openqa.selenium.remote.ErrorHandler.throwIfResponseFailed(ErrorHandler.java:145)
27-Jul-2015 12:41:27         at org.openqa.selenium.remote.RemoteWebDriver.execute(RemoteWebDriver.java:554)
27-Jul-2015 12:41:27         at org.openqa.selenium.remote.RemoteWebDriver.findElement(RemoteWebDriver.java:307)
27-Jul-2015 12:41:27         at org.openqa.selenium.remote.RemoteWebDriver.findElementByLinkText(RemoteWebDriver.java:356)
27-Jul-2015 12:41:27         at org.openqa.selenium.By$ByLinkText.findElement(By.java:248)
27-Jul-2015 12:41:27         at org.openqa.selenium.remote.RemoteWebDriver.findElement(RemoteWebDriver.java:299)
27-Jul-2015 12:41:27         at org.openqa.selenium.support.ui.ExpectedConditions.findElement(ExpectedConditions.java:579)
27-Jul-2015 12:41:27         at org.openqa.selenium.support.ui.ExpectedConditions.access$000(ExpectedConditions.java:39)
27-Jul-2015 12:41:27         at org.openqa.selenium.support.ui.ExpectedConditions$3.apply(ExpectedConditions.java:106)
27-Jul-2015 12:41:27         at org.openqa.selenium.support.ui.ExpectedConditions$3.apply(ExpectedConditions.java:103)
27-Jul-2015 12:41:27         at org.openqa.selenium.support.ui.FluentWait.until(FluentWait.java:208)
27-Jul-2015 12:41:27         at org.openmrs.uitestframework.page.AbstractBasePage.findElement(AbstractBasePage.java:51)
27-Jul-2015 12:41:27         at org.openmrs.uitestframework.page.AbstractBasePage.clickOn(AbstractBasePage.java:97)
27-Jul-2015 12:41:27         at org.openmrs.reference.page.ConceptFormPage.editConcept(ConceptFormPage.java:52)
27-Jul-2015 12:41:27         at org.openmrs.reference.AddConceptDrugTest.addConceptDrugTest(AddConceptDrugTest.java:36)
27-Jul-2015 12:41:27
27-Jul-2015 12:41:27 Running org.openmrs.reference.ActiveVisitsSearchPatientTest
27-Jul-2015 12:41:27 Starting ChromeDriver 2.14.313457 (3d645c400edf2e2c500566c9aa096063e707c9cf) on port 25051
27-Jul-2015 12:41:27 Only local connections are allowed.
27-Jul-2015 12:41:52 Tests run: 1, Failures: 0, Errors: 0, Skipped: 0, Time elapsed: 25.121 sec - in org.openmrs.reference.ActiveVisitsSearchPatientTest
27-Jul-2015 12:41:52 Running org.openmrs.reference.EditAllergyTest
27-Jul-2015 12:41:52 Starting ChromeDriver 2.14.313457 (3d645c400edf2e2c500566c9aa096063e707c9cf) on port 20301
27-Jul-2015 12:41:52 Only local connections are allowed.
27-Jul-2015 12:42:52 Tests run: 1, Failures: 0, Errors: 0, Skipped: 0, Time elapsed: 60.354 sec - in org.openmrs.reference.EditAllergyTest
27-Jul-2015 12:42:52 Running org.openmrs.reference.CaptureVitalsTest
27-Jul-2015 12:42:53 Starting ChromeDriver 2.14.313457 (3d645c400edf2e2c500566c9aa096063e707c9cf) on port 28591
27-Jul-2015 12:42:53 Only local connections are allowed.
27-Jul-2015 12:42:55 Tests run: 1, Failures: 0, Errors: 0, Skipped: 1, Time elapsed: 2.897 sec - in org.openmrs.reference.CaptureVitalsTest
27-Jul-2015 12:42:55 Running org.openmrs.reference.RetireLocationTest
27-Jul-2015 12:42:55 Starting ChromeDriver 2.14.313457 (3d645c400edf2e2c500566c9aa096063e707c9cf) on port 23884
27-Jul-2015 12:42:55 Only local connections are allowed.
27-Jul-2015 12:43:35 Tests run: 1, Failures: 0, Errors: 0, Skipped: 0, Time elapsed: 39.796 sec - in org.openmrs.reference.RetireLocationTest
27-Jul-2015 12:43:35 Running org.openmrs.reference.PasswordMinimumLengthTest
27-Jul-2015 12:43:35 Starting ChromeDriver 2.14.313457 (3d645c400edf2e2c500566c9aa096063e707c9cf) on port 27817
27-Jul-2015 12:43:35 Only local connections are allowed.
27-Jul-2015 12:44:22 Tests run: 1, Failures: 0, Errors: 1, Skipped: 0, Time elapsed: 46.459 sec <<< FAILURE! - in org.openmrs.reference.PasswordMinimumLengthTest
27-Jul-2015 12:44:22 passwordMinimumLengthTest(org.openmrs.reference.PasswordMinimumLengthTest)  Time elapsed: 43.627 sec  <<< ERROR!
27-Jul-2015 12:44:22 org.openqa.selenium.TimeoutException: Timed out after 30 seconds waiting for presence of element located by: By.name: name
27-Jul-2015 12:44:22 Build info: version: '2.37.0', revision: 'a7c61cbd68657e133ae96672cf995890bad2ee42', time: '2013-10-18 09:51:02'
27-Jul-2015 12:44:22 System info: host: 'gw107', ip: '149.165.228.105', os.name: 'Linux', os.arch: 'amd64', os.version: '3.13.0-45-generic', java.version: '1.7.0_79'
27-Jul-2015 12:44:22 Driver info: driver.version: unknown
27-Jul-2015 12:44:22         at sun.reflect.GeneratedConstructorAccessor20.newInstance(Unknown Source)
27-Jul-2015 12:44:22         at sun.reflect.DelegatingConstructorAccessorImpl.newInstance(DelegatingConstructorAccessorImpl.java:45)
27-Jul-2015 12:44:22         at java.lang.reflect.Constructor.newInstance(Constructor.java:526)
27-Jul-2015 12:44:22         at org.openqa.selenium.remote.ErrorHandler.createThrowable(ErrorHandler.java:193)
27-Jul-2015 12:44:22         at org.openqa.selenium.remote.ErrorHandler.throwIfResponseFailed(ErrorHandler.java:145)
27-Jul-2015 12:44:22         at org.openqa.selenium.remote.RemoteWebDriver.execute(RemoteWebDriver.java:554)
27-Jul-2015 12:44:22         at org.openqa.selenium.remote.RemoteWebDriver.findElement(RemoteWebDriver.java:307)
27-Jul-2015 12:44:22         at org.openqa.selenium.remote.RemoteWebDriver.findElementByName(RemoteWebDriver.java:380)
27-Jul-2015 12:44:22         at org.openqa.selenium.By$ByName.findElement(By.java:305)
27-Jul-2015 12:44:22         at org.openqa.selenium.remote.RemoteWebDriver.findElement(RemoteWebDriver.java:299)
27-Jul-2015 12:44:22         at org.openqa.selenium.support.ui.ExpectedConditions.findElement(ExpectedConditions.java:579)
27-Jul-2015 12:44:22         at org.openqa.selenium.support.ui.ExpectedConditions.access$000(ExpectedConditions.java:39)
27-Jul-2015 12:44:22         at org.openqa.selenium.support.ui.ExpectedConditions$3.apply(ExpectedConditions.java:106)
27-Jul-2015 12:44:22         at org.openqa.selenium.support.ui.ExpectedConditions$3.apply(ExpectedConditions.java:103)
27-Jul-2015 12:44:22         at org.openqa.selenium.support.ui.FluentWait.until(FluentWait.java:208)
27-Jul-2015 12:44:22         at org.openmrs.uitestframework.page.AbstractBasePage.findElement(AbstractBasePage.java:51)
27-Jul-2015 12:44:22         at org.openmrs.uitestframework.page.AbstractBasePage.setText(AbstractBasePage.java:67)
27-Jul-2015 12:44:22         at org.openmrs.reference.page.ManageUserPage.findUser(ManageUserPage.java:111)
27-Jul-2015 12:44:22         at org.openmrs.reference.PasswordMinimumLengthTest.passwordMinimumLengthTest(PasswordMinimumLengthTest.java:51)
27-Jul-2015 12:44:22
27-Jul-2015 12:44:22 Running org.openmrs.reference.DeleteFormTest
27-Jul-2015 12:44:22 Starting ChromeDriver 2.14.313457 (3d645c400edf2e2c500566c9aa096063e707c9cf) on port 21908
27-Jul-2015 12:44:22 Only local connections are allowed.
27-Jul-2015 12:44:25 Tests run: 1, Failures: 0, Errors: 0, Skipped: 1, Time elapsed: 2.964 sec - in org.openmrs.reference.DeleteFormTest
27-Jul-2015 12:44:25 Running org.openmrs.reference.AddFormTest
27-Jul-2015 12:44:25 Starting ChromeDriver 2.14.313457 (3d645c400edf2e2c500566c9aa096063e707c9cf) on port 25241
27-Jul-2015 12:44:25 Only local connections are allowed.
27-Jul-2015 12:44:28 Tests run: 1, Failures: 0, Errors: 0, Skipped: 1, Time elapsed: 3.046 sec - in org.openmrs.reference.AddFormTest
27-Jul-2015 12:44:28 Running org.openmrs.reference.AddLocationTest
27-Jul-2015 12:44:28 Starting ChromeDriver 2.14.313457 (3d645c400edf2e2c500566c9aa096063e707c9cf) on port 21102
27-Jul-2015 12:44:28 Only local connections are allowed.
27-Jul-2015 12:45:07 Tests run: 1, Failures: 0, Errors: 0, Skipped: 0, Time elapsed: 39.648 sec - in org.openmrs.reference.AddLocationTest
27-Jul-2015 12:45:07 Running org.openmrs.reference.PasswordRequiresNonDigitTest
27-Jul-2015 12:45:07 Starting ChromeDriver 2.14.313457 (3d645c400edf2e2c500566c9aa096063e707c9cf) on port 9234
27-Jul-2015 12:45:07 Only local connections are allowed.
27-Jul-2015 12:45:53 Tests run: 1, Failures: 0, Errors: 1, Skipped: 0, Time elapsed: 45.428 sec <<< FAILURE! - in org.openmrs.reference.PasswordRequiresNonDigitTest
27-Jul-2015 12:45:53 passwordRequiresNonDigitTest(org.openmrs.reference.PasswordRequiresNonDigitTest)  Time elapsed: 42.409 sec  <<< ERROR!
27-Jul-2015 12:45:53 org.openqa.selenium.TimeoutException: Timed out after 30 seconds waiting for presence of element located by: By.name: name
27-Jul-2015 12:45:53 Build info: version: '2.37.0', revision: 'a7c61cbd68657e133ae96672cf995890bad2ee42', time: '2013-10-18 09:51:02'
27-Jul-2015 12:45:53 System info: host: 'gw107', ip: '149.165.228.105', os.name: 'Linux', os.arch: 'amd64', os.version: '3.13.0-45-generic', java.version: '1.7.0_79'
27-Jul-2015 12:45:53 Driver info: driver.version: unknown
27-Jul-2015 12:45:53         at sun.reflect.GeneratedConstructorAccessor20.newInstance(Unknown Source)
27-Jul-2015 12:45:53         at sun.reflect.DelegatingConstructorAccessorImpl.newInstance(DelegatingConstructorAccessorImpl.java:45)
27-Jul-2015 12:45:53         at java.lang.reflect.Constructor.newInstance(Constructor.java:526)
27-Jul-2015 12:45:53         at org.openqa.selenium.remote.ErrorHandler.createThrowable(ErrorHandler.java:193)
27-Jul-2015 12:45:53         at org.openqa.selenium.remote.ErrorHandler.throwIfResponseFailed(ErrorHandler.java:145)
27-Jul-2015 12:45:53         at org.openqa.selenium.remote.RemoteWebDriver.execute(RemoteWebDriver.java:554)
27-Jul-2015 12:45:53         at org.openqa.selenium.remote.RemoteWebDriver.findElement(RemoteWebDriver.java:307)
27-Jul-2015 12:45:53         at org.openqa.selenium.remote.RemoteWebDriver.findElementByName(RemoteWebDriver.java:380)
27-Jul-2015 12:45:53         at org.openqa.selenium.By$ByName.findElement(By.java:305)
27-Jul-2015 12:45:53         at org.openqa.selenium.remote.RemoteWebDriver.findElement(RemoteWebDriver.java:299)
27-Jul-2015 12:45:53         at org.openqa.selenium.support.ui.ExpectedConditions.findElement(ExpectedConditions.java:579)
27-Jul-2015 12:45:53         at org.openqa.selenium.support.ui.ExpectedConditions.access$000(ExpectedConditions.java:39)
27-Jul-2015 12:45:53         at org.openqa.selenium.support.ui.ExpectedConditions$3.apply(ExpectedConditions.java:106)
27-Jul-2015 12:45:53         at org.openqa.selenium.support.ui.ExpectedConditions$3.apply(ExpectedConditions.java:103)
27-Jul-2015 12:45:53         at org.openqa.selenium.support.ui.FluentWait.until(FluentWait.java:208)
27-Jul-2015 12:45:53         at org.openmrs.uitestframework.page.AbstractBasePage.findElement(AbstractBasePage.java:51)
27-Jul-2015 12:45:53         at org.openmrs.uitestframework.page.AbstractBasePage.setText(AbstractBasePage.java:67)
27-Jul-2015 12:45:53         at org.openmrs.reference.page.ManageUserPage.findUser(ManageUserPage.java:111)
27-Jul-2015 12:45:53         at org.openmrs.reference.PasswordRequiresNonDigitTest.passwordRequiresNonDigitTest(PasswordRequiresNonDigitTest.java:49)
27-Jul-2015 12:45:53
27-Jul-2015 12:45:53 Running org.openmrs.reference.AddPastVisitTest
27-Jul-2015 12:45:53 Starting ChromeDriver 2.14.313457 (3d645c400edf2e2c500566c9aa096063e707c9cf) on port 26652
27-Jul-2015 12:45:53 Only local connections are allowed.
27-Jul-2015 12:47:04 Tests run: 1, Failures: 0, Errors: 0, Skipped: 0, Time elapsed: 71.725 sec - in org.openmrs.reference.AddPastVisitTest
27-Jul-2015 12:47:04 Running org.openmrs.reference.PasswordUpperAndLowerCaseTest
27-Jul-2015 12:47:05 Starting ChromeDriver 2.14.313457 (3d645c400edf2e2c500566c9aa096063e707c9cf) on port 26275
27-Jul-2015 12:47:05 Only local connections are allowed.
27-Jul-2015 13:34:05
Request to stop 'REFAPP-OMODDISTRO-INTTESTS-3641' received from tmueller
27-Jul-2015 13:34:06 Failing task since return code of [/usr/share/apache-maven-3.2.3/bin/mvn --batch-mode -Djava.io.tmpdir=/home/bamboo-agent-1/bamboo-agent/.agent_tmp/REFAPP-OMODDISTRO-INTTESTS clean integration-test -P ci-headless -Ddatabase.username=root -Ddatabase.password=******** -Djdbc.connectionurl=jdbc:mysql://devtest01.openmrs.org:3306/openmrs -Dwebdriver=chrome] was 143 while expected 0
27-Jul-2015 13:34:06 Parsing test results under /home/bamboo-agent-1/bamboo-agent/xml-data/build-dir/REFAPP-OMODDISTRO-INTTESTS...
27-Jul-2015 13:34:06 Finished task 'Run UI tests' with result: Failed
27-Jul-2015 13:34:06 Starting task 'Collect Tomcat Logs' of type 'com.atlassian.bamboo.plugins.scripttask:task.builder.command'
27-Jul-2015 13:34:06
Beginning to execute external process for build 'Reference Application - Distribution - Run UI Tests #3641 (REFAPP-OMODDISTRO-INTTESTS-3641)'
... running command line:
/bin/bash tomcatLogCollector.sh getTomcatLog
... in: /home/bamboo-agent-1/bamboo-agent/xml-data/build-dir/REFAPP-OMODDISTRO-INTTESTS/utility-scripts
... using extra environment variables:
bamboo_planRepository_3_repositoryUrl=https://github.com/openmrs/openmrs-contrib-bamboo.git
bamboo_capability_system_jdk_JDK_1_8=/usr/lib/jvm/java-8-openjdk-amd64
bamboo_capability_system_jdk_JDK_1_7=/usr/lib/jvm/java-7-openjdk-amd64
bamboo_repository_40632324_name=Release scripts
bamboo_repository_40632324_git_branch=master
bamboo_planKey=REFAPP-OMODDISTRO
bamboo_capability_system_jdk_JDK_1_7_0_79=/usr/lib/jvm/java-7-openjdk-amd64
bamboo_refapp_distro_dev_branch=master
bamboo_repository_git_repositoryUrl=git://github.com/openmrs/openmrs-distro-referenceapplication.git
bamboo_repository_2752530_git_branch=master
bamboo_capability_system_jdk_JDK_1_7_0_75=/usr/lib/jvm/java-7-openjdk-amd64
bamboo_capability_system_jdk_openjdk_6_jdk=/usr/lib/jvm/java-6-openjdk-amd64
bamboo_planRepository_3_name=Release scripts
bamboo_shortJobKey=INTTESTS
bamboo_repository_40632324_git_username=cintiadr
bamboo_planRepository_1_branch=master
bamboo_repository_revision_number=869b889e1ffd1d6e301ca719bd0361717bb9af23
bamboo_capability_system_builder_mvn3_Maven_3=/usr/share/apache-maven-3.2.3
bamboo_planName=Reference Application - Distribution
bamboo_buildResultsUrl=https://ci.openmrs.org/browse/REFAPP-OMODDISTRO-INTTESTS-3641
bamboo_buildResultKey=REFAPP-OMODDISTRO-INTTESTS-3641
bamboo_repository_19857409_git_repositoryUrl=https://github.com/openmrs/openmrs-standalone
bamboo_repository_previous_revision_number=0d5ac7ef808c4d003573c4b54ca6ae395c9d4501
bamboo_buildKey=REFAPP-OMODDISTRO-INTTESTS
bamboo_working_directory=/home/bamboo-agent-1/bamboo-agent/xml-data/build-dir/REFAPP-OMODDISTRO-INTTESTS
bamboo_repository_19857409_branch_name=openmrs-emr
bamboo_planRepository_2_previousRevision=2cc1eedc8952f87a71cc34e7c976f30d82d62c32
bamboo_planRepository_3_branch=master
bamboo_repository_name=Release scripts
bamboo_repository_2752530_revision_number=869b889e1ffd1d6e301ca719bd0361717bb9af23
bamboo_repository_19857409_revision_number=2cc1eedc8952f87a71cc34e7c976f30d82d62c32
bamboo_repository_git_branch=master
bamboo_ManualBuildTriggerReason_userName=raff
bamboo_planRepository_1_type=git
bamboo_checkVersions=versions:update-properties -Pupdate-to-latest
bamboo_repository_40632324_branch_name=master
bamboo_mavenBuildGoals=clean install
bamboo_capability_system_jdk_openjdk_7_jdk=/usr/lib/jvm/java-7-openjdk-amd64
bamboo_build_commandline_com_atlassian_bamboo_plugins_scripttask_task_builder_script_7=/bin/sh /home/bamboo-agent-1/bamboo-agent/.agent_tmp/REFAPP-OMODDISTRO-INTTESTS-3641-ScriptBuildTask-5118841785149439031.sh
bamboo_planRepository_2_branchName=openmrs-emr
bamboo_repository_2752530_name=Distribution
bamboo_repository_19857409_git_branch=openmrs-emr
bamboo_capability_system_jdk_JDK=/usr/lib/jvm/java-7-openjdk-amd64
bamboo_repository_40632324_previous_revision_number=fd5310f196074c1101fc7f1e2349005e2f083d72
bamboo_capability_system_builder_grailsBuilder_Grails_2=/opt/grails
bamboo_repository_branch_name=master
bamboo_agentId=50495494
bamboo_planRepository_3_username=cintiadr
bamboo_build_commandline_com_atlassian_bamboo_plugins_scripttask_task_builder_command_8=/bin/bash tomcatLogCollector.sh cleanTomcatLog
bamboo_repository_19857409_git_username=
bamboo_build_commandline_com_atlassian_bamboo_plugins_scripttask_task_builder_command_4=/bin/bash appStartupCheck.sh devtest01.openmrs.org
bamboo_maven_release_version=2.3
bamboo_planRepository_2_name=Git openmrs-standalone
bamboo_planRepository_1_username=
bamboo_buildNumber=3641
bamboo_capability_system_builder_ant_Ant=/usr/share/ant
bamboo_buildTimeStamp=2015-07-27T12:19:06.491Z
bamboo_planRepository_type=git
bamboo_repository_19857409_name=Git openmrs-standalone
bamboo_shortPlanName=Distribution
bamboo_repository_40632324_revision_number=fd5310f196074c1101fc7f1e2349005e2f083d72
bamboo_repository_2752530_git_repositoryUrl=git://github.com/openmrs/openmrs-distro-referenceapplication.git
bamboo_refapp_distro_scm=git@github.com:openmrs/openmrs-distro-referenceapplication.git
bamboo_preparing_refapp_distro_release=true
bamboo_planRepository_1_branchName=master
bamboo_planRepository_3_revision=fd5310f196074c1101fc7f1e2349005e2f083d72
bamboo_shortPlanKey=OMODDISTRO
bamboo_build_working_directory=/home/bamboo-agent-1/bamboo-agent/xml-data/build-dir/REFAPP-OMODDISTRO-INTTESTS
bamboo_planRepository_2_repositoryUrl=https://github.com/openmrs/openmrs-standalone
bamboo_planRepository_3_previousRevision=fd5310f196074c1101fc7f1e2349005e2f083d72
bamboo_repository_19857409_previous_revision_number=2cc1eedc8952f87a71cc34e7c976f30d82d62c32
bamboo_planRepository_revision=869b889e1ffd1d6e301ca719bd0361717bb9af23
bamboo_capability_system_builder_grailsBuilder_Grails_2_3_7=/opt/grails
bamboo_repository_git_username=
bamboo_planRepository_3_type=git
bamboo_capability_system_git_executable=/usr/bin/git
bamboo_maven_development_version=
bamboo_capability_system_jdk_openjdk_8_jdk=/usr/lib/jvm/java-8-openjdk-amd64
bamboo_capability_system_builder_node_Node_js=/usr/bin/nodejs
bamboo_agentWorkingDirectory=/home/bamboo-agent-1/bamboo-agent/xml-data/build-dir
bamboo_buildPlanName=Reference Application - Distribution - Run UI Tests
bamboo_repository_40632324_git_repositoryUrl=https://github.com/openmrs/openmrs-contrib-bamboo.git
bamboo_planRepository_2_revision=2cc1eedc8952f87a71cc34e7c976f30d82d62c32
bamboo_jdbc_password=********
bamboo_resultsUrl=https://ci.openmrs.org/browse/REFAPP-OMODDISTRO-INTTESTS-3641
bamboo_planRepository_3_branchName=master
bamboo_planRepository_1_revision=869b889e1ffd1d6e301ca719bd0361717bb9af23
bamboo_planRepository_2_branch=openmrs-emr
bamboo_planRepository_1_previousRevision=0d5ac7ef808c4d003573c4b54ca6ae395c9d4501
bamboo_capability_system_builder_command_Bash=/bin/bash
bamboo_planRepository_1_name=Distribution
bamboo_planRepository_branch=master
bamboo_openMRSVersion=1.11.2
bamboo_planRepository_username=
bamboo_planRepository_branchName=master
bamboo_capability_system_builder_mvn2_Maven_2=/usr/share/maven2
bamboo_shortJobName=Run UI Tests
bamboo_repository_2752530_branch_name=master
bamboo_planRepository_previousRevision=0d5ac7ef808c4d003573c4b54ca6ae395c9d4501
bamboo_refapp_bamboo_build_number=
bamboo_planRepository_1_repositoryUrl=git://github.com/openmrs/openmrs-distro-referenceapplication.git
bamboo_planRepository_repositoryUrl=git://github.com/openmrs/openmrs-distro-referenceapplication.git
bamboo_planRepository_2_type=git
bamboo_build_commandline_com_atlassian_bamboo_plugins_maven_task_builder_mvn3_10=/usr/share/apache-maven-3.2.3/bin/mvn --batch-mode -Djava.io.tmpdir=/home/bamboo-agent-1/bamboo-agent/.agent_tmp/REFAPP-OMODDISTRO-INTTESTS clean integration-test -P ci-headless -Ddatabase.username=root -Ddatabase.password=******** -Djdbc.connectionurl=jdbc:mysql://devtest01.openmrs.org:3306/openmrs -Dwebdriver=chrome
bamboo_dependenciesDisabled=false
bamboo_test_db_bamboo_admin_password=********
bamboo_planRepository_name=Distribution
bamboo_planRepository_2_username=
bamboo_repository_2752530_previous_revision_number=0d5ac7ef808c4d003573c4b54ca6ae395c9d4501
bamboo_repository_2752530_git_username=
27-Jul-2015 13:34:08 Finished task 'Collect Tomcat Logs' with result: Success
27-Jul-2015 13:34:08 Running post build plugin 'Artifact Copier'
27-Jul-2015 13:34:08 Publishing an artifact: ScreenShots
27-Jul-2015 13:34:08 Finished publishing of artifact Shared artifact: [ScreenShots], pattern: [*.png] anchored at: [ui-tests/target/screenshots] in 0s
27-Jul-2015 13:34:08 Publishing an artifact: Chrome Driver Log File
27-Jul-2015 13:34:08 Finished publishing of artifact Shared artifact: [Chrome Driver Log File], pattern: [chromedriver-**.log] anchored at: [ui-tests/target/chromedriverlogs] in 0s
27-Jul-2015 13:34:08 Publishing an artifact: Tomcat Log
27-Jul-2015 13:34:08 Finished publishing of artifact Shared artifact: [Tomcat Log], pattern: [catalina.out] anchored at: [utility-scripts] in 0s
27-Jul-2015 13:34:08 Running post build plugin 'npm Cache Cleanup'
27-Jul-2015 13:34:08 Running post build plugin 'NCover Results Collector'
27-Jul-2015 13:34:08 Running post build plugin 'Clover Results Collector'
27-Jul-2015 13:34:08 Finalising the build...
27-Jul-2015 13:34:08 Stopping timer.
27-Jul-2015 13:34:08 Build REFAPP-OMODDISTRO-INTTESTS-3641 completed.
27-Jul-2015 13:34:08 Running on server: post build plugin 'Clover Delta Calculator'
27-Jul-2015 13:34:08 Running on server: post build plugin 'Build Hanging Detection Configuration'
27-Jul-2015 13:34:08 Running on server: post build plugin 'NCover Results Collector'
27-Jul-2015 13:34:08 Running on server: post build plugin 'Sonar Build Log Password Obfuscator'
27-Jul-2015 13:34:08 Running on server: post build plugin 'Maven Dependencies Postprocessor'
27-Jul-2015 13:34:08 All post build plugins have finished
27-Jul-2015 13:34:08 Generating build results summary...
27-Jul-2015 13:34:09 Saving build results to disk...
27-Jul-2015 13:34:09 Indexing build results...
27-Jul-2015 13:34:09 Finished building REFAPP-OMODDISTRO-INTTESTS-3641.