Deploys Reference Application SNAPSHOT to maven

Build: #3859 failed

Job: Run UI tests on Travis failed

Stages & jobs

  1. Create Reference Application packages

  2. Deploy to Automated Functional Test Server

  3. Run UI Tests

  4. Deploy to Manual Test Server

  5. Release

    Requires a user to start manually
  6. Create Standalone

Job result summary

Completed
Duration
216 minutes
Revision
22633d13255d6f608407e69e30c8d89f7f322622 22633d13255d6f608407e69e30c8d89f7f322622
Total tests
69
Fixed in
#3862 (Rebuilt by Wyclif Luyima)

Tests

  • 69 tests in total
  • 3 tests failed
  • 3 failures are new
  • 28 tests were quarantined / skipped
  • 27 minutes taken in total.
New test failures 3
Status Test Duration
Collapse Failed DeleteAllergyTest org.openmrs.reference.DeleteAllergyTest History
< 1 sec
org.openqa.selenium.remote.UnreachableBrowserException: Could not start a new session. Possible causes are invalid address of the remote server or browser start-up failure.
Build info: version: '2.37.0', revision: 'a7c61cbd68657e133ae96672cf995890bad2ee42', time: '2013-10-18 09:51:02'
System info: host: 'gw108', ip: '149.165.228.106', os.name: 'Linux', os.arch: 'amd64', os.version: '3.13.0-49-generic', java.version: '1.7.0_79'
Driver info: driver.version: ChromeDriver
	at org.openqa.selenium.remote.RemoteWebDriver.execute(RemoteWebDriver.java:548)
	at org.openqa.selenium.remote.RemoteWebDriver.startSession(RemoteWebDriver.java:216)
	at org.openqa.selenium.remote.RemoteWebDriver.<init>(RemoteWebDriver.java:111)
	at org.openqa.selenium.remote.RemoteWebDriver.<init>(RemoteWebDriver.java:115)
(100 more lines...)
Collapse Failed NamePatientAccentedLetterTest namePatientAccentedLetterTest History
39 secs
org.openqa.selenium.TimeoutException: Timed out after 30 seconds waiting for visibility of element located by By.className: toast-item-wrapper
Build info: version: '2.37.0', revision: 'a7c61cbd68657e133ae96672cf995890bad2ee42', time: '2013-10-18 09:51:02'
System info: host: 'gw108', ip: '149.165.228.106', os.name: 'Linux', os.arch: 'amd64', os.version: '3.13.0-49-generic', java.version: '1.7.0_79'
Driver info: driver.version: unknown
	at sun.reflect.GeneratedConstructorAccessor20.newInstance(Unknown Source)
	at sun.reflect.DelegatingConstructorAccessorImpl.newInstance(DelegatingConstructorAccessorImpl.java:45)
	at java.lang.reflect.Constructor.newInstance(Constructor.java:526)
	at org.openqa.selenium.remote.ErrorHandler.createThrowable(ErrorHandler.java:193)
(14 more lines...)
Collapse Failed StartVisitTest startVisitTest History
37 secs
java.lang.AssertionError: null
	at org.junit.Assert.fail(Assert.java:86)
	at org.junit.Assert.assertTrue(Assert.java:41)
	at org.junit.Assert.assertTrue(Assert.java:52)
	at org.openmrs.reference.StartVisitTest.startVisitTest(StartVisitTest.java:36)