Deploys Reference Application SNAPSHOT to maven

Build: #4942 failed

Job: Run UI tests on Travis failed

Stages & jobs

  1. Create Reference Application packages

  2. Deploy to Automated Functional Test Server

  3. Run UI Tests

  4. Deploy to Manual Test Server

  5. Release

    Requires a user to start manually
  6. Create Standalone

Job result summary

Completed
Duration
5 minutes
Revision
ffa55dc88581ab47a97caaa808cb7161d371e9b0 ffa55dc88581ab47a97caaa808cb7161d371e9b0
Total tests
10
Failing since
#4941 (Child of UITF-UITF-101)
Fixed in
#4943 (Code changes detected)

Tests

  • 10 tests in total
  • 3 tests failed
  • 1 failure is new
  • 2 tests were quarantined / skipped
  • 10 minutes taken in total.
New test failures 1
Status Test Duration
Collapse Failed CaptureVitalsTest captureVital History
1 min
org.openqa.selenium.TimeoutException: Timed out after 15 seconds waiting for org.openmrs.uitestframework.page.Page$1@5ce6a8d6
Build info: version: '2.52.0', revision: '4c2593cfc3689a7fcd7be52549167e5ccc93ad28', time: '2016-02-11 11:22:43'
System info: host: 'gw107', ip: '149.165.228.105', os.name: 'Linux', os.arch: 'amd64', os.version: '3.13.0-91-generic', java.version: '1.8.0_91'
Driver info: org.openqa.selenium.remote.RemoteWebDriver
Capabilities [{applicationCacheEnabled=true, rotatable=false, hasMetadata=true, databaseEnabled=true, handlesAlerts=true, version=42.0, platform=LINUX, nativeEvents=false, acceptSslCerts=true, webdriver.remote.sessionid=bf3230fd0f984cc08288543cba4cac1f, locationContextEnabled=true, webStorageEnabled=true, takesScreenshot=true, browserName=firefox, javascriptEnabled=true, cssSelectorsEnabled=true}]
Session ID: bf3230fd0f984cc08288543cba4cac1f
	at org.openqa.selenium.support.ui.WebDriverWait.timeoutException(WebDriverWait.java:80)
	at org.openqa.selenium.support.ui.FluentWait.until(FluentWait.java:261)
(4 more lines...)
Existing test failures 2
Status Test Failing since Duration
org.openqa.selenium.TimeoutException: Timed out after 30 seconds waiting for visibility of element located by By.className: toast-item-wrapper
Build info: version: '2.52.0', revision: '4c2593cfc3689a7fcd7be52549167e5ccc93ad28', time: '2016-02-11 11:22:43'
System info: host: 'gw107', ip: '149.165.228.105', os.name: 'Linux', os.arch: 'amd64', os.version: '3.13.0-91-generic', java.version: '1.8.0_91'
Driver info: org.openqa.selenium.remote.RemoteWebDriver
Capabilities [{applicationCacheEnabled=true, rotatable=false, hasMetadata=true, databaseEnabled=true, handlesAlerts=true, version=42.0, platform=LINUX, nativeEvents=false, acceptSslCerts=true, webdriver.remote.sessionid=b4468be55bf64f2cb5cbacdee666435b, locationContextEnabled=true, webStorageEnabled=true, takesScreenshot=true, browserName=firefox, javascriptEnabled=true, cssSelectorsEnabled=true}]
Session ID: b4468be55bf64f2cb5cbacdee666435b
	at sun.reflect.NativeConstructorAccessorImpl.newInstance0(Native Method)
	at sun.reflect.NativeConstructorAccessorImpl.newInstance(NativeConstructorAccessorImpl.java:62)
(27 more lines...)
org.openqa.selenium.TimeoutException: Timed out after 15 seconds waiting for visibility of element located by By.className: odd
Build info: version: '2.52.0', revision: '4c2593cfc3689a7fcd7be52549167e5ccc93ad28', time: '2016-02-11 11:22:43'
System info: host: 'gw107', ip: '149.165.228.105', os.name: 'Linux', os.arch: 'amd64', os.version: '3.13.0-91-generic', java.version: '1.8.0_91'
Driver info: org.openqa.selenium.remote.RemoteWebDriver
Capabilities [{applicationCacheEnabled=true, rotatable=false, hasMetadata=true, databaseEnabled=true, handlesAlerts=true, version=42.0, platform=LINUX, nativeEvents=false, acceptSslCerts=true, webdriver.remote.sessionid=945c6149d53145eeb5579039d1c377d9, locationContextEnabled=true, webStorageEnabled=true, takesScreenshot=true, browserName=firefox, javascriptEnabled=true, cssSelectorsEnabled=true}]
Session ID: 945c6149d53145eeb5579039d1c377d9
	at sun.reflect.NativeConstructorAccessorImpl.newInstance0(Native Method)
	at sun.reflect.NativeConstructorAccessorImpl.newInstance(NativeConstructorAccessorImpl.java:62)
(28 more lines...)