Testing Refapp 2.12.0 on Platform 2.5.0-beta

Build: #28 failed Manual run from the stage: Release by tendo kiiza Martyn

Stages & jobs

  1. Deploy Reference Application

  2. Deploy docker image

  3. Deploy to uat-refapp

  4. Deploy to qa-refapp

  5. Validate

  6. Release

    Requires a user to start manually
  7. Set variables

  8. Release others

Logs

The following logs have been generated by the jobs in this plan.
  • Expand all
  • Collapse all
Job Logs
Collapse Release to maven Release Download or View
10-Nov-2021 08:12:46 [INFO] ------------------------------------------------------------------------
10-Nov-2021 08:12:46 [INFO] BUILD FAILURE
10-Nov-2021 08:12:46 [INFO] ------------------------------------------------------------------------
10-Nov-2021 08:12:46 [INFO] Total time: 1.408 s
10-Nov-2021 08:12:46 [INFO] Finished at: 2021-11-10T08:12:46+00:00
10-Nov-2021 08:12:46 [INFO] Final Memory: 14M/176M
10-Nov-2021 08:12:46 [INFO] ------------------------------------------------------------------------
10-Nov-2021 08:12:46 [ERROR] Failed to execute goal org.apache.maven.plugins:maven-release-plugin:2.5.1:rollback (default-cli) on project referenceapplication: An error is occurred in the checkin process: Exception while executing SCM command. Detecting the current branch failed: fatal: ref HEAD is not a symbolic ref -> [Help 1]
10-Nov-2021 08:12:46 [ERROR]
10-Nov-2021 08:12:46 [ERROR] To see the full stack trace of the errors, re-run Maven with the -e switch.
10-Nov-2021 08:12:46 [ERROR] Re-run Maven using the -X switch to enable full debug logging.
10-Nov-2021 08:12:46 [ERROR]
10-Nov-2021 08:12:46 [ERROR] For more information about the errors and possible solutions, please read the following articles:
10-Nov-2021 08:12:46 [ERROR] [Help 1] http://cwiki.apache.org/confluence/display/MAVEN/MojoExecutionException
10-Nov-2021 08:12:46 [ERROR] mvn release:prepare failed, scroll up the logs to see the error. release:rollback was attempted. Delete the tag from the repository (if it exists), check if the SCM tag is a ssh and not http and try again.
10-Nov-2021 08:12:46 Unable to publish artifact [referenceapplication-addons]: the source directory /home/bamboo-agent/bamboo-agent/xml-data/build-dir/REFAPP-R2-RTM/target/checkout/package/target does not exist.
10-Nov-2021 08:12:46 The artifact is required for down stream Stages and Jobs, build will now fail.
10-Nov-2021 08:12:46 Unable to publish artifact [ referenceapplication-war]: the source directory /home/bamboo-agent/bamboo-agent/xml-data/build-dir/REFAPP-R2-RTM/target/checkout/package/target/bundled-distro/web does not exist.
10-Nov-2021 08:12:46 The artifact is required for down stream Stages and Jobs, build will now fail.
10-Nov-2021 08:12:46 Unable to publish artifact [ referenceapplication-properties]: the source directory /home/bamboo-agent/bamboo-agent/xml-data/build-dir/REFAPP-R2-RTM/target/checkout/package/target/distro/web does not exist.
10-Nov-2021 08:12:46 The artifact is required for down stream Stages and Jobs, build will now fail.
10-Nov-2021 08:12:46 Unable to publish artifact [referenceapplication-docker]: the source directory /home/bamboo-agent/bamboo-agent/xml-data/build-dir/REFAPP-R2-RTM/target/checkout/package/target/bundled-distro/web does not exist.
10-Nov-2021 08:12:46 The artifact is required for down stream Stages and Jobs, build will now fail.
10-Nov-2021 08:12:46 Unable to publish artifact [referenceapplication-readme]: the source directory /home/bamboo-agent/bamboo-agent/xml-data/build-dir/REFAPP-R2-RTM/target/checkout/package/target/classes does not exist.
10-Nov-2021 08:12:46 The artifact is required for down stream Stages and Jobs, build will now fail.