UI tests for the reference application

Build: #218 failed Rebuilt by Sharif Magembe

Logs

The following logs have been generated by the jobs in this plan.
  • Expand all
  • Collapse all
Job Logs
Collapse Run QA UI Tests Ref App UI Testing Download or View
07-Jun-2021 16:24:48 [INFO] Reactor Summary:
07-Jun-2021 16:24:48 [INFO]
07-Jun-2021 16:24:48 [INFO] Reference Application Distribution ................. SUCCESS [  0.401 s]
07-Jun-2021 16:24:48 [INFO] Reference Application Distribution Package ......... SUCCESS [ 57.666 s]
07-Jun-2021 16:24:48 [INFO] Reference Application Distribution UI Tests ........ FAILURE [06:03 min]
07-Jun-2021 16:24:48 [INFO] ------------------------------------------------------------------------
07-Jun-2021 16:24:48 [INFO] BUILD FAILURE
07-Jun-2021 16:24:48 [INFO] ------------------------------------------------------------------------
07-Jun-2021 16:24:48 [INFO] Total time: 07:02 min
07-Jun-2021 16:24:48 [INFO] Finished at: 2021-06-07T16:24:48+00:00
07-Jun-2021 16:24:48 [INFO] Final Memory: 63M/390M
07-Jun-2021 16:24:48 [INFO] ------------------------------------------------------------------------
07-Jun-2021 16:24:48 [ERROR] Failed to execute goal org.apache.maven.plugins:maven-surefire-plugin:2.12:test (default-test) on project referenceapplication-ui-tests: There are test failures.
07-Jun-2021 16:24:48 [ERROR]
07-Jun-2021 16:24:48 [ERROR] Please refer to /home/bamboo-agent/bamboo-agent/xml-data/build-dir/REFAPP-UI-FRAMEWORK/ui-tests/target/surefire-reports for the individual test results.
07-Jun-2021 16:24:48 [ERROR] -> [Help 1]
07-Jun-2021 16:24:48 [ERROR]
07-Jun-2021 16:24:48 [ERROR] To see the full stack trace of the errors, re-run Maven with the -e switch.
07-Jun-2021 16:24:48 [ERROR] Re-run Maven using the -X switch to enable full debug logging.
07-Jun-2021 16:24:48 [ERROR]
07-Jun-2021 16:24:48 [ERROR] For more information about the errors and possible solutions, please read the following articles:
07-Jun-2021 16:24:48 [ERROR] [Help 1] http://cwiki.apache.org/confluence/display/MAVEN/MojoFailureException
07-Jun-2021 16:24:48 [ERROR]
07-Jun-2021 16:24:48 [ERROR] After correcting the problems, you can resume the build with the command
07-Jun-2021 16:24:48 [ERROR]   mvn <goals> -rf :referenceapplication-ui-tests