UI tests for the reference application

Build: #223 failed Manual run by Kaweesi Joseph

Build result summary

Details

Completed
Duration
10 minutes
Labels
None
Agent
yak.openmrs.org
Revisions
Distribution
3bc98d502dd93eab88b1fd2a9ef9d5ba8fa07009 3bc98d502dd93eab88b1fd2a9ef9d5ba8fa07009
UI Test Framework
2a3b2abb76c028425ecb8f0c13a962db25bca3b0 2a3b2abb76c028425ecb8f0c13a962db25bca3b0
Total tests
49
Failing since
#218 (Rebuilt by Sharif Magembe)
Fixed in
#224 (Rebuilt by Kaweesi Joseph)

Responsible

This build has been failing since #218
No one has taken responsibility

Tests

New test failures 1
Status Test View job Duration
Collapse Failed AdmitExitInpatientTest admitExitInpatientTest History
Run QA UI Tests 2 mins
org.openqa.selenium.remote.UnreachableBrowserException: Error communicating with the remote browser. It may have died. Build info: version: '4.0.0-alpha-6', revision: '5f43a29cfc' System info: host: 'yak', ip: '127.0.0.1', os.name: 'Linux', os.arch: 'amd64', os.version: '4.4.0-210-generic', java.version: '1.8.0_292' Driver info: driver.version: RemoteWebDriver Capabilities {acceptInsecureCerts: false, browserName: chrome, browserVersion: 90.0.4430.72, chrome: {chromedriverVersion: 90.0.4430.24 (4c6d850f087da..., userDataDir: /tmp/.com.google.Chrome.dnmuFI}, goog:chromeOptions: {debuggerAddress: localhost:44686}, javascriptEnabled: true, networkConnectionEnabled: false, pageLoadStrategy: normal, platform: LINUX, platformName: LINUX, proxy: Proxy(), setWindowRect: true, strictFileInteractability: false, timeouts: {implicit: 0, pageLoad: 300000, script: 30000}, unhandledPromptBehavior: dismiss and notify, webauthn:extension:largeBlob: true, webauthn:virtualAuthenticators: true} Session ID: 0c102c049f65640d51cf86c4216e8848
org.openqa.selenium.remote.UnreachableBrowserException: Error communicating with the remote browser. It may have died.
Build info: version: '4.0.0-alpha-6', revision: '5f43a29cfc'
System info: host: 'yak', ip: '127.0.0.1', os.name: 'Linux', os.arch: 'amd64', os.version: '4.4.0-210-generic', java.version: '1.8.0_292'
Driver info: driver.version: RemoteWebDriver
Capabilities {acceptInsecureCerts: false, browserName: chrome, browserVersion: 90.0.4430.72, chrome: {chromedriverVersion: 90.0.4430.24 (4c6d850f087da..., userDataDir: /tmp/.com.google.Chrome.dnmuFI}, goog:chromeOptions: {debuggerAddress: localhost:44686}, javascriptEnabled: true, networkConnectionEnabled: false, pageLoadStrategy: normal, platform: LINUX, platformName: LINUX, proxy: Proxy(), setWindowRect: true, strictFileInteractability: false, timeouts: {implicit: 0, pageLoad: 300000, script: 30000}, unhandledPromptBehavior: dismiss and notify, webauthn:extension:largeBlob: true, webauthn:virtualAuthenticators: true}
Session ID: 0c102c049f65640d51cf86c4216e8848
	at org.openqa.selenium.remote.RemoteWebDriver.execute(RemoteWebDriver.java:603)
(35 more lines...)
Existing test failures 1
Status Test Failing since View job Duration
org.openqa.selenium.TimeoutException: Expected condition failed: waiting for visibility of element located by By.className: logout (tried for 120 second(s) with 500 milliseconds interval) Build info: version: '4.0.0-alpha-6', revision: '5f43a29cfc' System info: host: 'yak', ip: '127.0.0.1', os.name: 'Linux', os.arch: 'amd64', os.version: '4.4.0-210-generic', java.version: '1.8.0_292' Driver info: org.openqa.selenium.chrome.ChromeDriver Capabilities {acceptInsecureCerts: false, browserName: chrome, browserVersion: 90.0.4430.72, chrome: {chromedriverVersion: 90.0.4430.24 (4c6d850f087da..., userDataDir: /tmp/.com.google.Chrome.yR4Atx}, goog:chromeOptions: {debuggerAddress: localhost:39662}, javascriptEnabled: true, networkConnectionEnabled: false, pageLoadStrategy: normal, platform: LINUX, platformName: LINUX, proxy: Proxy(), setWindowRect: true, strictFileInteractability: false, timeouts: {implicit: 0, pageLoad: 300000, script: 30000}, unhandledPromptBehavior: dismiss and notify, webauthn:extension:largeBlob: true, webauthn:virtualAuthenticators: true} Session ID: baf6686825231f5d0f405c3a6a91b5f7
org.openqa.selenium.TimeoutException: Expected condition failed: waiting for visibility of element located by By.className: logout (tried for 120 second(s) with 500 milliseconds interval)
Build info: version: '4.0.0-alpha-6', revision: '5f43a29cfc'
System info: host: 'yak', ip: '127.0.0.1', os.name: 'Linux', os.arch: 'amd64', os.version: '4.4.0-210-generic', java.version: '1.8.0_292'
Driver info: org.openqa.selenium.chrome.ChromeDriver
Capabilities {acceptInsecureCerts: false, browserName: chrome, browserVersion: 90.0.4430.72, chrome: {chromedriverVersion: 90.0.4430.24 (4c6d850f087da..., userDataDir: /tmp/.com.google.Chrome.yR4Atx}, goog:chromeOptions: {debuggerAddress: localhost:39662}, javascriptEnabled: true, networkConnectionEnabled: false, pageLoadStrategy: normal, platform: LINUX, platformName: LINUX, proxy: Proxy(), setWindowRect: true, strictFileInteractability: false, timeouts: {implicit: 0, pageLoad: 300000, script: 30000}, unhandledPromptBehavior: dismiss and notify, webauthn:extension:largeBlob: true, webauthn:virtualAuthenticators: true}
Session ID: baf6686825231f5d0f405c3a6a91b5f7
	at org.openqa.selenium.support.ui.WebDriverWait.timeoutException(WebDriverWait.java:138)
(3 more lines...)
Fixed tests 1
Status Test Failing since View job Duration
Successful DeleteRequestAppointmentTest deleteRequestAppointmentTest History
Failing since build #222 (Changes by HerbertYiga <herbertyiga24@gmail.com>) Run QA UI Tests 15 secs