UI tests for the reference application

Build: #233 failed Scheduled

Build result summary

Details

Completed
Duration
12 minutes
Labels
None
Agent
yue.openmrs.org
Revisions
Distribution
014d79e1cf4038deea799e6139dbd29c8e857b33 014d79e1cf4038deea799e6139dbd29c8e857b33
UI Test Framework
c6b058290b27cada9379f09d9075f63735d2f321 c6b058290b27cada9379f09d9075f63735d2f321
Total tests
49
Fixed in
#237 (Scheduled)

Tests

Responsible

No one has taken responsibility for this failure

Tests

New test failures 32
Status Test View job Duration
Collapse Failed AddDeleteLocationTest addLocationTest History
Run QA UI Tests < 1 sec
java.lang.AssertionError: Test killed due to server failure
	at org.junit.Assert.fail(Assert.java:89)
	at org.openmrs.uitestframework.test.TestBase.startWebDriver(TestBase.java:127)
	at sun.reflect.GeneratedMethodAccessor3.invoke(Unknown Source)
	at sun.reflect.DelegatingMethodAccessorImpl.invoke(DelegatingMethodAccessorImpl.java:43)
	at java.lang.reflect.Method.invoke(Method.java:498)
	at org.junit.runners.model.FrameworkMethod$1.runReflectiveCall(FrameworkMethod.java:59)
	at org.junit.internal.runners.model.ReflectiveCallable.run(ReflectiveCallable.java:12)
(30 more lines...)
Collapse Failed AddDeleteServiceTest addDeleteServiceTest History
Run QA UI Tests < 1 sec
java.lang.AssertionError: Test killed due to server failure
	at org.junit.Assert.fail(Assert.java:89)
	at org.openmrs.uitestframework.test.TestBase.startWebDriver(TestBase.java:127)
	at sun.reflect.GeneratedMethodAccessor3.invoke(Unknown Source)
	at sun.reflect.DelegatingMethodAccessorImpl.invoke(DelegatingMethodAccessorImpl.java:43)
	at java.lang.reflect.Method.invoke(Method.java:498)
	at org.junit.runners.model.FrameworkMethod$1.runReflectiveCall(FrameworkMethod.java:59)
	at org.junit.internal.runners.model.ReflectiveCallable.run(ReflectiveCallable.java:12)
(30 more lines...)
Collapse Failed AddDiagnosisToVisitNoteTest addDiagnosisToVisitNoteTest History
Run QA UI Tests < 1 sec
java.lang.AssertionError: Test killed due to server failure
	at org.junit.Assert.fail(Assert.java:89)
	at org.openmrs.uitestframework.test.TestBase.startWebDriver(TestBase.java:127)
	at sun.reflect.GeneratedMethodAccessor3.invoke(Unknown Source)
	at sun.reflect.DelegatingMethodAccessorImpl.invoke(DelegatingMethodAccessorImpl.java:43)
	at java.lang.reflect.Method.invoke(Method.java:498)
	at org.junit.runners.model.FrameworkMethod$1.runReflectiveCall(FrameworkMethod.java:59)
	at org.junit.internal.runners.model.ReflectiveCallable.run(ReflectiveCallable.java:12)
(30 more lines...)
Collapse Failed AddNewAllergyTest addNewAllergyTest History
Run QA UI Tests < 1 sec
java.lang.AssertionError: Test killed due to server failure
	at org.junit.Assert.fail(Assert.java:89)
	at org.openmrs.uitestframework.test.TestBase.startWebDriver(TestBase.java:127)
	at sun.reflect.GeneratedMethodAccessor3.invoke(Unknown Source)
	at sun.reflect.DelegatingMethodAccessorImpl.invoke(DelegatingMethodAccessorImpl.java:43)
	at java.lang.reflect.Method.invoke(Method.java:498)
	at org.junit.runners.model.FrameworkMethod$1.runReflectiveCall(FrameworkMethod.java:59)
	at org.junit.internal.runners.model.ReflectiveCallable.run(ReflectiveCallable.java:12)
(30 more lines...)
Collapse Failed AddPastVisitTest addPastVisitTest History
Run QA UI Tests < 1 sec
java.lang.AssertionError: Test killed due to server failure
	at org.junit.Assert.fail(Assert.java:89)
	at org.openmrs.uitestframework.test.TestBase.startWebDriver(TestBase.java:127)
	at sun.reflect.NativeMethodAccessorImpl.invoke0(Native Method)
	at sun.reflect.NativeMethodAccessorImpl.invoke(NativeMethodAccessorImpl.java:62)
	at sun.reflect.DelegatingMethodAccessorImpl.invoke(DelegatingMethodAccessorImpl.java:43)
	at java.lang.reflect.Method.invoke(Method.java:498)
	at org.junit.runners.model.FrameworkMethod$1.runReflectiveCall(FrameworkMethod.java:59)
(31 more lines...)
Collapse Failed AddProviderTest addProviderTest History
Run QA UI Tests < 1 sec
java.lang.AssertionError: Test killed due to server failure
	at org.junit.Assert.fail(Assert.java:89)
	at org.openmrs.uitestframework.test.TestBase.startWebDriver(TestBase.java:127)
	at sun.reflect.NativeMethodAccessorImpl.invoke0(Native Method)
	at sun.reflect.NativeMethodAccessorImpl.invoke(NativeMethodAccessorImpl.java:62)
	at sun.reflect.DelegatingMethodAccessorImpl.invoke(DelegatingMethodAccessorImpl.java:43)
	at java.lang.reflect.Method.invoke(Method.java:498)
	at org.junit.runners.model.FrameworkMethod$1.runReflectiveCall(FrameworkMethod.java:59)
(31 more lines...)
Collapse Failed AddVisitTypeTest addVisitTypeTest History
Run QA UI Tests < 1 sec
java.lang.AssertionError: Test killed due to server failure
	at org.junit.Assert.fail(Assert.java:89)
	at org.openmrs.uitestframework.test.TestBase.startWebDriver(TestBase.java:127)
	at sun.reflect.NativeMethodAccessorImpl.invoke0(Native Method)
	at sun.reflect.NativeMethodAccessorImpl.invoke(NativeMethodAccessorImpl.java:62)
	at sun.reflect.DelegatingMethodAccessorImpl.invoke(DelegatingMethodAccessorImpl.java:43)
	at java.lang.reflect.Method.invoke(Method.java:498)
	at org.junit.runners.model.FrameworkMethod$1.runReflectiveCall(FrameworkMethod.java:59)
(31 more lines...)
Collapse Failed AdmitExitInpatientTest admitExitInpatientTest History
Run QA UI Tests < 1 sec
java.lang.AssertionError: Test killed due to server failure
	at org.junit.Assert.fail(Assert.java:89)
	at org.openmrs.uitestframework.test.TestBase.startWebDriver(TestBase.java:127)
	at sun.reflect.NativeMethodAccessorImpl.invoke0(Native Method)
	at sun.reflect.NativeMethodAccessorImpl.invoke(NativeMethodAccessorImpl.java:62)
	at sun.reflect.DelegatingMethodAccessorImpl.invoke(DelegatingMethodAccessorImpl.java:43)
	at java.lang.reflect.Method.invoke(Method.java:498)
	at org.junit.runners.model.FrameworkMethod$1.runReflectiveCall(FrameworkMethod.java:59)
(31 more lines...)
Collapse Failed CaptureVitalsTest captureVitalsTest History
Run QA UI Tests < 1 sec
java.lang.AssertionError: Test killed due to server failure
	at org.junit.Assert.fail(Assert.java:89)
	at org.openmrs.uitestframework.test.TestBase.startWebDriver(TestBase.java:127)
	at sun.reflect.GeneratedMethodAccessor3.invoke(Unknown Source)
	at sun.reflect.DelegatingMethodAccessorImpl.invoke(DelegatingMethodAccessorImpl.java:43)
	at java.lang.reflect.Method.invoke(Method.java:498)
	at org.junit.runners.model.FrameworkMethod$1.runReflectiveCall(FrameworkMethod.java:59)
	at org.junit.internal.runners.model.ReflectiveCallable.run(ReflectiveCallable.java:12)
(30 more lines...)
Collapse Failed ComeBackToApplicationAfterLogoutTest comeBackToApplicationAfterLogoutTest History
Run QA UI Tests < 1 sec
java.lang.AssertionError: Test killed due to server failure
	at org.junit.Assert.fail(Assert.java:89)
	at org.openmrs.uitestframework.test.TestBase.startWebDriver(TestBase.java:127)
	at sun.reflect.NativeMethodAccessorImpl.invoke0(Native Method)
	at sun.reflect.NativeMethodAccessorImpl.invoke(NativeMethodAccessorImpl.java:62)
	at sun.reflect.DelegatingMethodAccessorImpl.invoke(DelegatingMethodAccessorImpl.java:43)
	at java.lang.reflect.Method.invoke(Method.java:498)
	at org.junit.runners.model.FrameworkMethod$1.runReflectiveCall(FrameworkMethod.java:59)
(31 more lines...)
Collapse Failed CreatePersonTest createPersonTest History
Run QA UI Tests < 1 sec
java.lang.AssertionError: Test killed due to server failure
	at org.junit.Assert.fail(Assert.java:89)
	at org.openmrs.uitestframework.test.TestBase.startWebDriver(TestBase.java:127)
	at sun.reflect.NativeMethodAccessorImpl.invoke0(Native Method)
	at sun.reflect.NativeMethodAccessorImpl.invoke(NativeMethodAccessorImpl.java:62)
	at sun.reflect.DelegatingMethodAccessorImpl.invoke(DelegatingMethodAccessorImpl.java:43)
	at java.lang.reflect.Method.invoke(Method.java:498)
	at org.junit.runners.model.FrameworkMethod$1.runReflectiveCall(FrameworkMethod.java:59)
(31 more lines...)
Collapse Failed DeleteAllergyTest deleteAllergyTest History
Run QA UI Tests 10 mins
java.lang.AssertionError: Test killed due to server failure
	at org.junit.Assert.fail(Assert.java:89)
	at org.openmrs.uitestframework.test.TestBase.failTest(TestBase.java:216)
	at org.openmrs.uitestframework.test.TestBase.launchBrowser(TestBase.java:203)
	at org.openmrs.uitestframework.test.TestBase.startWebDriver(TestBase.java:130)
	at sun.reflect.NativeMethodAccessorImpl.invoke0(Native Method)
	at sun.reflect.NativeMethodAccessorImpl.invoke(NativeMethodAccessorImpl.java:62)
	at sun.reflect.DelegatingMethodAccessorImpl.invoke(DelegatingMethodAccessorImpl.java:43)
(33 more lines...)
Collapse Failed DeletePersonTest deletePersonTest History
Run QA UI Tests < 1 sec
java.lang.AssertionError: Test killed due to server failure
	at org.junit.Assert.fail(Assert.java:89)
	at org.openmrs.uitestframework.test.TestBase.startWebDriver(TestBase.java:127)
	at sun.reflect.GeneratedMethodAccessor3.invoke(Unknown Source)
	at sun.reflect.DelegatingMethodAccessorImpl.invoke(DelegatingMethodAccessorImpl.java:43)
	at java.lang.reflect.Method.invoke(Method.java:498)
	at org.junit.runners.model.FrameworkMethod$1.runReflectiveCall(FrameworkMethod.java:59)
	at org.junit.internal.runners.model.ReflectiveCallable.run(ReflectiveCallable.java:12)
(30 more lines...)
Collapse Failed DeleteProviderTest deleteProviderTest History
Run QA UI Tests < 1 sec
java.lang.AssertionError: Test killed due to server failure
	at org.junit.Assert.fail(Assert.java:89)
	at org.openmrs.uitestframework.test.TestBase.startWebDriver(TestBase.java:127)
	at sun.reflect.GeneratedMethodAccessor3.invoke(Unknown Source)
	at sun.reflect.DelegatingMethodAccessorImpl.invoke(DelegatingMethodAccessorImpl.java:43)
	at java.lang.reflect.Method.invoke(Method.java:498)
	at org.junit.runners.model.FrameworkMethod$1.runReflectiveCall(FrameworkMethod.java:59)
	at org.junit.internal.runners.model.ReflectiveCallable.run(ReflectiveCallable.java:12)
(30 more lines...)
Collapse Failed DeleteRequestAppointmentTest deleteRequestAppointmentTest History
Run QA UI Tests < 1 sec
java.lang.AssertionError: Test killed due to server failure
	at org.junit.Assert.fail(Assert.java:89)
	at org.openmrs.uitestframework.test.TestBase.startWebDriver(TestBase.java:127)
	at sun.reflect.NativeMethodAccessorImpl.invoke0(Native Method)
	at sun.reflect.NativeMethodAccessorImpl.invoke(NativeMethodAccessorImpl.java:62)
	at sun.reflect.DelegatingMethodAccessorImpl.invoke(DelegatingMethodAccessorImpl.java:43)
	at java.lang.reflect.Method.invoke(Method.java:498)
	at org.junit.runners.model.FrameworkMethod$1.runReflectiveCall(FrameworkMethod.java:59)
(31 more lines...)
Collapse Failed DeleteVisitTypeTest deleteVisitTypeTest History
Run QA UI Tests < 1 sec
java.lang.AssertionError: Test killed due to server failure
	at org.junit.Assert.fail(Assert.java:89)
	at org.openmrs.uitestframework.test.TestBase.startWebDriver(TestBase.java:127)
	at sun.reflect.NativeMethodAccessorImpl.invoke0(Native Method)
	at sun.reflect.NativeMethodAccessorImpl.invoke(NativeMethodAccessorImpl.java:62)
	at sun.reflect.DelegatingMethodAccessorImpl.invoke(DelegatingMethodAccessorImpl.java:43)
	at java.lang.reflect.Method.invoke(Method.java:498)
	at org.junit.runners.model.FrameworkMethod$1.runReflectiveCall(FrameworkMethod.java:59)
(31 more lines...)
Collapse Failed EditAllergyTest editAllergyTest History
Run QA UI Tests < 1 sec
java.lang.AssertionError: Test killed due to server failure
	at org.junit.Assert.fail(Assert.java:89)
	at org.openmrs.uitestframework.test.TestBase.startWebDriver(TestBase.java:127)
	at sun.reflect.NativeMethodAccessorImpl.invoke0(Native Method)
	at sun.reflect.NativeMethodAccessorImpl.invoke(NativeMethodAccessorImpl.java:62)
	at sun.reflect.DelegatingMethodAccessorImpl.invoke(DelegatingMethodAccessorImpl.java:43)
	at java.lang.reflect.Method.invoke(Method.java:498)
	at org.junit.runners.model.FrameworkMethod$1.runReflectiveCall(FrameworkMethod.java:59)
(31 more lines...)
Collapse Failed EditDemographicTest editDemographicTest History
Run QA UI Tests < 1 sec
java.lang.AssertionError: Test killed due to server failure
	at org.junit.Assert.fail(Assert.java:89)
	at org.openmrs.uitestframework.test.TestBase.startWebDriver(TestBase.java:127)
	at sun.reflect.NativeMethodAccessorImpl.invoke0(Native Method)
	at sun.reflect.NativeMethodAccessorImpl.invoke(NativeMethodAccessorImpl.java:62)
	at sun.reflect.DelegatingMethodAccessorImpl.invoke(DelegatingMethodAccessorImpl.java:43)
	at java.lang.reflect.Method.invoke(Method.java:498)
	at org.junit.runners.model.FrameworkMethod$1.runReflectiveCall(FrameworkMethod.java:59)
(31 more lines...)
Collapse Failed EditPersonTest editPersonTest History
Run QA UI Tests < 1 sec
java.lang.AssertionError: Test killed due to server failure
	at org.junit.Assert.fail(Assert.java:89)
	at org.openmrs.uitestframework.test.TestBase.startWebDriver(TestBase.java:127)
	at sun.reflect.NativeMethodAccessorImpl.invoke0(Native Method)
	at sun.reflect.NativeMethodAccessorImpl.invoke(NativeMethodAccessorImpl.java:62)
	at sun.reflect.DelegatingMethodAccessorImpl.invoke(DelegatingMethodAccessorImpl.java:43)
	at java.lang.reflect.Method.invoke(Method.java:498)
	at org.junit.runners.model.FrameworkMethod$1.runReflectiveCall(FrameworkMethod.java:59)
(31 more lines...)
Collapse Failed EditProviderTest editProviderTest History
Run QA UI Tests < 1 sec
java.lang.AssertionError: Test killed due to server failure
	at org.junit.Assert.fail(Assert.java:89)
	at org.openmrs.uitestframework.test.TestBase.startWebDriver(TestBase.java:127)
	at sun.reflect.GeneratedMethodAccessor3.invoke(Unknown Source)
	at sun.reflect.DelegatingMethodAccessorImpl.invoke(DelegatingMethodAccessorImpl.java:43)
	at java.lang.reflect.Method.invoke(Method.java:498)
	at org.junit.runners.model.FrameworkMethod$1.runReflectiveCall(FrameworkMethod.java:59)
	at org.junit.internal.runners.model.ReflectiveCallable.run(ReflectiveCallable.java:12)
(30 more lines...)
Collapse Failed EditServiceTest editServiceTest History
Run QA UI Tests < 1 sec
java.lang.AssertionError: Test killed due to server failure
	at org.junit.Assert.fail(Assert.java:89)
	at org.openmrs.uitestframework.test.TestBase.startWebDriver(TestBase.java:127)
	at sun.reflect.GeneratedMethodAccessor3.invoke(Unknown Source)
	at sun.reflect.DelegatingMethodAccessorImpl.invoke(DelegatingMethodAccessorImpl.java:43)
	at java.lang.reflect.Method.invoke(Method.java:498)
	at org.junit.runners.model.FrameworkMethod$1.runReflectiveCall(FrameworkMethod.java:59)
	at org.junit.internal.runners.model.ReflectiveCallable.run(ReflectiveCallable.java:12)
(30 more lines...)
Collapse Failed EditVisitTypeTest editVisitTypeTest History
Run QA UI Tests < 1 sec
java.lang.AssertionError: Test killed due to server failure
	at org.junit.Assert.fail(Assert.java:89)
	at org.openmrs.uitestframework.test.TestBase.startWebDriver(TestBase.java:127)
	at sun.reflect.NativeMethodAccessorImpl.invoke0(Native Method)
	at sun.reflect.NativeMethodAccessorImpl.invoke(NativeMethodAccessorImpl.java:62)
	at sun.reflect.DelegatingMethodAccessorImpl.invoke(DelegatingMethodAccessorImpl.java:43)
	at java.lang.reflect.Method.invoke(Method.java:498)
	at org.junit.runners.model.FrameworkMethod$1.runReflectiveCall(FrameworkMethod.java:59)
(31 more lines...)
Collapse Failed MergePatientTest mergePatientByNameTest History
Run QA UI Tests < 1 sec
java.lang.AssertionError: Test killed due to server failure
	at org.junit.Assert.fail(Assert.java:89)
	at org.openmrs.uitestframework.test.TestBase.startWebDriver(TestBase.java:127)
	at sun.reflect.GeneratedMethodAccessor3.invoke(Unknown Source)
	at sun.reflect.DelegatingMethodAccessorImpl.invoke(DelegatingMethodAccessorImpl.java:43)
	at java.lang.reflect.Method.invoke(Method.java:498)
	at org.junit.runners.model.FrameworkMethod$1.runReflectiveCall(FrameworkMethod.java:59)
	at org.junit.internal.runners.model.ReflectiveCallable.run(ReflectiveCallable.java:12)
(30 more lines...)
Collapse Failed NamePatientAccentedLetterTest namePatientAccentedLetterTest History
Run QA UI Tests < 1 sec
java.lang.AssertionError: Test killed due to server failure
	at org.junit.Assert.fail(Assert.java:89)
	at org.openmrs.uitestframework.test.TestBase.startWebDriver(TestBase.java:127)
	at sun.reflect.GeneratedMethodAccessor3.invoke(Unknown Source)
	at sun.reflect.DelegatingMethodAccessorImpl.invoke(DelegatingMethodAccessorImpl.java:43)
	at java.lang.reflect.Method.invoke(Method.java:498)
	at org.junit.runners.model.FrameworkMethod$1.runReflectiveCall(FrameworkMethod.java:59)
	at org.junit.internal.runners.model.ReflectiveCallable.run(ReflectiveCallable.java:12)
(30 more lines...)
Collapse Failed RegisterPatientTest registerPatient History
Run QA UI Tests < 1 sec
java.lang.AssertionError: Test killed due to server failure
	at org.junit.Assert.fail(Assert.java:89)
	at org.openmrs.uitestframework.test.TestBase.startWebDriver(TestBase.java:127)
	at sun.reflect.GeneratedMethodAccessor3.invoke(Unknown Source)
	at sun.reflect.DelegatingMethodAccessorImpl.invoke(DelegatingMethodAccessorImpl.java:43)
	at java.lang.reflect.Method.invoke(Method.java:498)
	at org.junit.runners.model.FrameworkMethod$1.runReflectiveCall(FrameworkMethod.java:59)
	at org.junit.internal.runners.model.ReflectiveCallable.run(ReflectiveCallable.java:12)
(30 more lines...)
Collapse Failed RegisterUnidentifiedPatientTest registerUnidentifiedPatient History
Run QA UI Tests < 1 sec
java.lang.AssertionError: Test killed due to server failure
	at org.junit.Assert.fail(Assert.java:89)
	at org.openmrs.uitestframework.test.TestBase.startWebDriver(TestBase.java:127)
	at sun.reflect.NativeMethodAccessorImpl.invoke0(Native Method)
	at sun.reflect.NativeMethodAccessorImpl.invoke(NativeMethodAccessorImpl.java:62)
	at sun.reflect.DelegatingMethodAccessorImpl.invoke(DelegatingMethodAccessorImpl.java:43)
	at java.lang.reflect.Method.invoke(Method.java:498)
	at org.junit.runners.model.FrameworkMethod$1.runReflectiveCall(FrameworkMethod.java:59)
(31 more lines...)
Collapse Failed RetireLocationTest retireLocationTest History
Run QA UI Tests < 1 sec
java.lang.AssertionError: Test killed due to server failure
	at org.junit.Assert.fail(Assert.java:89)
	at org.openmrs.uitestframework.test.TestBase.startWebDriver(TestBase.java:127)
	at sun.reflect.NativeMethodAccessorImpl.invoke0(Native Method)
	at sun.reflect.NativeMethodAccessorImpl.invoke(NativeMethodAccessorImpl.java:62)
	at sun.reflect.DelegatingMethodAccessorImpl.invoke(DelegatingMethodAccessorImpl.java:43)
	at java.lang.reflect.Method.invoke(Method.java:498)
	at org.junit.runners.model.FrameworkMethod$1.runReflectiveCall(FrameworkMethod.java:59)
(31 more lines...)
Collapse Failed RetirePersonTest retirePersonTest History
Run QA UI Tests < 1 sec
java.lang.AssertionError: Test killed due to server failure
	at org.junit.Assert.fail(Assert.java:89)
	at org.openmrs.uitestframework.test.TestBase.startWebDriver(TestBase.java:127)
	at sun.reflect.GeneratedMethodAccessor3.invoke(Unknown Source)
	at sun.reflect.DelegatingMethodAccessorImpl.invoke(DelegatingMethodAccessorImpl.java:43)
	at java.lang.reflect.Method.invoke(Method.java:498)
	at org.junit.runners.model.FrameworkMethod$1.runReflectiveCall(FrameworkMethod.java:59)
	at org.junit.internal.runners.model.ReflectiveCallable.run(ReflectiveCallable.java:12)
(30 more lines...)
Collapse Failed RetireProviderTest retireProviderTest History
Run QA UI Tests < 1 sec
java.lang.AssertionError: Test killed due to server failure
	at org.junit.Assert.fail(Assert.java:89)
	at org.openmrs.uitestframework.test.TestBase.startWebDriver(TestBase.java:127)
	at sun.reflect.GeneratedMethodAccessor3.invoke(Unknown Source)
	at sun.reflect.DelegatingMethodAccessorImpl.invoke(DelegatingMethodAccessorImpl.java:43)
	at java.lang.reflect.Method.invoke(Method.java:498)
	at org.junit.runners.model.FrameworkMethod$1.runReflectiveCall(FrameworkMethod.java:59)
	at org.junit.internal.runners.model.ReflectiveCallable.run(ReflectiveCallable.java:12)
(30 more lines...)
Collapse Failed RetireVisitTypeTest retireVisitTypeTest History
Run QA UI Tests < 1 sec
java.lang.AssertionError: Test killed due to server failure
	at org.junit.Assert.fail(Assert.java:89)
	at org.openmrs.uitestframework.test.TestBase.startWebDriver(TestBase.java:127)
	at sun.reflect.GeneratedMethodAccessor3.invoke(Unknown Source)
	at sun.reflect.DelegatingMethodAccessorImpl.invoke(DelegatingMethodAccessorImpl.java:43)
	at java.lang.reflect.Method.invoke(Method.java:498)
	at org.junit.runners.model.FrameworkMethod$1.runReflectiveCall(FrameworkMethod.java:59)
	at org.junit.internal.runners.model.ReflectiveCallable.run(ReflectiveCallable.java:12)
(30 more lines...)
Collapse Failed SearchActiveVisitsTest searchActiveVisitsByPatientNameOrIdOrLastSeenTest History
Run QA UI Tests < 1 sec
java.lang.AssertionError: Test killed due to server failure
	at org.junit.Assert.fail(Assert.java:89)
	at org.openmrs.uitestframework.test.TestBase.startWebDriver(TestBase.java:127)
	at sun.reflect.NativeMethodAccessorImpl.invoke0(Native Method)
	at sun.reflect.NativeMethodAccessorImpl.invoke(NativeMethodAccessorImpl.java:62)
	at sun.reflect.DelegatingMethodAccessorImpl.invoke(DelegatingMethodAccessorImpl.java:43)
	at java.lang.reflect.Method.invoke(Method.java:498)
	at org.junit.runners.model.FrameworkMethod$1.runReflectiveCall(FrameworkMethod.java:59)
(31 more lines...)
Collapse Failed StartVisitTest startVisitTest History
Run QA UI Tests < 1 sec
java.lang.AssertionError: Test killed due to server failure
	at org.junit.Assert.fail(Assert.java:89)
	at org.openmrs.uitestframework.test.TestBase.startWebDriver(TestBase.java:127)
	at sun.reflect.GeneratedMethodAccessor3.invoke(Unknown Source)
	at sun.reflect.DelegatingMethodAccessorImpl.invoke(DelegatingMethodAccessorImpl.java:43)
	at java.lang.reflect.Method.invoke(Method.java:498)
	at org.junit.runners.model.FrameworkMethod$1.runReflectiveCall(FrameworkMethod.java:59)
	at org.junit.internal.runners.model.ReflectiveCallable.run(ReflectiveCallable.java:12)
(30 more lines...)