UI tests for the reference application

Build: #233 failed Scheduled

Logs

The following logs have been generated by the jobs in this plan.
  • Expand all
  • Collapse all
Job Logs
Collapse Run QA UI Tests Ref App UI Testing Download or View
10-Jun-2021 02:12:48 [INFO] Reactor Summary:
10-Jun-2021 02:12:48 [INFO]
10-Jun-2021 02:12:48 [INFO] Reference Application Distribution ................. SUCCESS [  0.330 s]
10-Jun-2021 02:12:48 [INFO] Reference Application Distribution Package ......... SUCCESS [01:10 min]
10-Jun-2021 02:12:48 [INFO] Reference Application Distribution UI Tests ........ FAILURE [10:37 min]
10-Jun-2021 02:12:48 [INFO] ------------------------------------------------------------------------
10-Jun-2021 02:12:48 [INFO] BUILD FAILURE
10-Jun-2021 02:12:48 [INFO] ------------------------------------------------------------------------
10-Jun-2021 02:12:48 [INFO] Total time: 11:48 min
10-Jun-2021 02:12:48 [INFO] Finished at: 2021-06-10T02:12:48+00:00
10-Jun-2021 02:12:48 [INFO] Final Memory: 63M/366M
10-Jun-2021 02:12:48 [INFO] ------------------------------------------------------------------------
10-Jun-2021 02:12:48 [ERROR] Failed to execute goal org.apache.maven.plugins:maven-surefire-plugin:2.12:test (default-test) on project referenceapplication-ui-tests: There are test failures.
10-Jun-2021 02:12:48 [ERROR]
10-Jun-2021 02:12:48 [ERROR] Please refer to /home/bamboo-agent/bamboo-agent/xml-data/build-dir/REFAPP-UI-FRAMEWORK/ui-tests/target/surefire-reports for the individual test results.
10-Jun-2021 02:12:48 [ERROR] -> [Help 1]
10-Jun-2021 02:12:48 [ERROR]
10-Jun-2021 02:12:48 [ERROR] To see the full stack trace of the errors, re-run Maven with the -e switch.
10-Jun-2021 02:12:48 [ERROR] Re-run Maven using the -X switch to enable full debug logging.
10-Jun-2021 02:12:48 [ERROR]
10-Jun-2021 02:12:48 [ERROR] For more information about the errors and possible solutions, please read the following articles:
10-Jun-2021 02:12:48 [ERROR] [Help 1] http://cwiki.apache.org/confluence/display/MAVEN/MojoFailureException
10-Jun-2021 02:12:48 [ERROR]
10-Jun-2021 02:12:48 [ERROR] After correcting the problems, you can resume the build with the command
10-Jun-2021 02:12:48 [ERROR]   mvn <goals> -rf :referenceapplication-ui-tests