UI tests for the reference application

Build result summary

Details

Completed
Queue duration
1 second
Duration
11 minutes
Labels
None
Revisions
Distribution
1c6c4295a070119abba7df8b6a08cf47b34808e2 1c6c4295a070119abba7df8b6a08cf47b34808e2
UI Test Framework
c6b058290b27cada9379f09d9075f63735d2f321 c6b058290b27cada9379f09d9075f63735d2f321
Total tests
53
Fixed in
#262 (Changes by OpenMRS Administrator)

Tests

Responsible

No one has taken responsibility for this failure

Code commits

Distribution
Author Commit Message Commit date
Kakumirizi Daud <dkakumirizii@gmail.com> Kakumirizi Daud <dkakumirizii@gmail.com> 1c6c4295a070119abba7df8b6a08cf47b34808e2 1c6c4295a070119abba7df8b6a08cf47b34808e2 RATEST-143: Fix record merge issue test (#448)
* RATEST-143: Fix record merge issue test

* RATEST-143: Refactoring code base for quality assurance

Tests

New test failures 2
Status Test View job Duration
Collapse Failed AddPastVisitTest addPastVisitTest History
Run QA UI Tests 2 mins
org.openqa.selenium.remote.UnreachableBrowserException: Error communicating with the remote browser. It may have died. Build info: version: '4.0.0-alpha-6', revision: '5f43a29cfc' System info: host: 'yokobue', ip: '127.0.0.1', os.name: 'Linux', os.arch: 'amd64', os.version: '4.4.0-210-generic', java.version: '1.8.0_292' Driver info: driver.version: RemoteWebDriver Capabilities {acceptInsecureCerts: false, browserName: chrome, browserVersion: 90.0.4430.72, chrome: {chromedriverVersion: 90.0.4430.24 (4c6d850f087da..., userDataDir: /tmp/.com.google.Chrome.u3s9IZ}, goog:chromeOptions: {debuggerAddress: localhost:42829}, javascriptEnabled: true, networkConnectionEnabled: false, pageLoadStrategy: normal, platform: LINUX, platformName: LINUX, proxy: Proxy(), setWindowRect: true, strictFileInteractability: false, timeouts: {implicit: 0, pageLoad: 300000, script: 30000}, unhandledPromptBehavior: dismiss and notify, webauthn:extension:largeBlob: true, webauthn:virtualAuthenticators: true} Session ID: 4b406727afa254ae795a88b1faef8d9c
org.openqa.selenium.remote.UnreachableBrowserException: Error communicating with the remote browser. It may have died.
Build info: version: '4.0.0-alpha-6', revision: '5f43a29cfc'
System info: host: 'yokobue', ip: '127.0.0.1', os.name: 'Linux', os.arch: 'amd64', os.version: '4.4.0-210-generic', java.version: '1.8.0_292'
Driver info: driver.version: RemoteWebDriver
Capabilities {acceptInsecureCerts: false, browserName: chrome, browserVersion: 90.0.4430.72, chrome: {chromedriverVersion: 90.0.4430.24 (4c6d850f087da..., userDataDir: /tmp/.com.google.Chrome.u3s9IZ}, goog:chromeOptions: {debuggerAddress: localhost:42829}, javascriptEnabled: true, networkConnectionEnabled: false, pageLoadStrategy: normal, platform: LINUX, platformName: LINUX, proxy: Proxy(), setWindowRect: true, strictFileInteractability: false, timeouts: {implicit: 0, pageLoad: 300000, script: 30000}, unhandledPromptBehavior: dismiss and notify, webauthn:extension:largeBlob: true, webauthn:virtualAuthenticators: true}
Session ID: 4b406727afa254ae795a88b1faef8d9c
	at org.openqa.selenium.remote.RemoteWebDriver.execute(RemoteWebDriver.java:603)
(35 more lines...)
Collapse Failed RecordMergeIssueTest recordMergeIssueTest History
Run QA UI Tests 2 mins
org.openqa.selenium.TimeoutException: Expected condition failed: waiting for visibility of element located by By.className: logout (tried for 120 second(s) with 500 milliseconds interval) Build info: version: '4.0.0-alpha-6', revision: '5f43a29cfc' System info: host: 'yokobue', ip: '127.0.0.1', os.name: 'Linux', os.arch: 'amd64', os.version: '4.4.0-210-generic', java.version: '1.8.0_292' Driver info: org.openqa.selenium.chrome.ChromeDriver Capabilities {acceptInsecureCerts: false, browserName: chrome, browserVersion: 90.0.4430.72, chrome: {chromedriverVersion: 90.0.4430.24 (4c6d850f087da..., userDataDir: /tmp/.com.google.Chrome.HzU5fX}, goog:chromeOptions: {debuggerAddress: localhost:45584}, javascriptEnabled: true, networkConnectionEnabled: false, pageLoadStrategy: normal, platform: LINUX, platformName: LINUX, proxy: Proxy(), setWindowRect: true, strictFileInteractability: false, timeouts: {implicit: 0, pageLoad: 300000, script: 30000}, unhandledPromptBehavior: dismiss and notify, webauthn:extension:largeBlob: true, webauthn:virtualAuthenticators: true} Session ID: 053c680c3a93a9591b03561df06213b5
org.openqa.selenium.TimeoutException: Expected condition failed: waiting for visibility of element located by By.className: logout (tried for 120 second(s) with 500 milliseconds interval)
Build info: version: '4.0.0-alpha-6', revision: '5f43a29cfc'
System info: host: 'yokobue', ip: '127.0.0.1', os.name: 'Linux', os.arch: 'amd64', os.version: '4.4.0-210-generic', java.version: '1.8.0_292'
Driver info: org.openqa.selenium.chrome.ChromeDriver
Capabilities {acceptInsecureCerts: false, browserName: chrome, browserVersion: 90.0.4430.72, chrome: {chromedriverVersion: 90.0.4430.24 (4c6d850f087da..., userDataDir: /tmp/.com.google.Chrome.HzU5fX}, goog:chromeOptions: {debuggerAddress: localhost:45584}, javascriptEnabled: true, networkConnectionEnabled: false, pageLoadStrategy: normal, platform: LINUX, platformName: LINUX, proxy: Proxy(), setWindowRect: true, strictFileInteractability: false, timeouts: {implicit: 0, pageLoad: 300000, script: 30000}, unhandledPromptBehavior: dismiss and notify, webauthn:extension:largeBlob: true, webauthn:virtualAuthenticators: true}
Session ID: 053c680c3a93a9591b03561df06213b5
	at org.openqa.selenium.support.ui.WebDriverWait.timeoutException(WebDriverWait.java:138)
(3 more lines...)

Jira issues

IssueDescriptionStatus
Unknown Issue TypeRATEST-143Could not obtain issue details from Jira