UI tests for the reference application

Test results

  • 52 tests in total
  • 2 tests failed
  • 2 failures are new
  • 16 tests were quarantined / skipped
  • 8 minutes taken in total.
New test failures 2
Status Test View job Duration
Collapse Failed AdmitExitInpatientTest admitExitInpatientTest History
Run QA UI Tests 2 mins
org.openqa.selenium.remote.UnreachableBrowserException: Error communicating with the remote browser. It may have died. Build info: version: '4.0.0-alpha-6', revision: '5f43a29cfc' System info: host: 'yokobue', ip: '127.0.0.1', os.name: 'Linux', os.arch: 'amd64', os.version: '4.4.0-210-generic', java.version: '1.8.0_292' Driver info: driver.version: RemoteWebDriver Capabilities {acceptInsecureCerts: false, browserName: chrome, browserVersion: 90.0.4430.72, chrome: {chromedriverVersion: 90.0.4430.24 (4c6d850f087da..., userDataDir: /tmp/.com.google.Chrome.8tDngF}, goog:chromeOptions: {debuggerAddress: localhost:38419}, javascriptEnabled: true, networkConnectionEnabled: false, pageLoadStrategy: normal, platform: LINUX, platformName: LINUX, proxy: Proxy(), setWindowRect: true, strictFileInteractability: false, timeouts: {implicit: 0, pageLoad: 300000, script: 30000}, unhandledPromptBehavior: dismiss and notify, webauthn:extension:largeBlob: true, webauthn:virtualAuthenticators: true} Session ID: 2b9460fb46f53c6b6ba1ec561c520818
org.openqa.selenium.remote.UnreachableBrowserException: Error communicating with the remote browser. It may have died.
Build info: version: '4.0.0-alpha-6', revision: '5f43a29cfc'
System info: host: 'yokobue', ip: '127.0.0.1', os.name: 'Linux', os.arch: 'amd64', os.version: '4.4.0-210-generic', java.version: '1.8.0_292'
Driver info: driver.version: RemoteWebDriver
Capabilities {acceptInsecureCerts: false, browserName: chrome, browserVersion: 90.0.4430.72, chrome: {chromedriverVersion: 90.0.4430.24 (4c6d850f087da..., userDataDir: /tmp/.com.google.Chrome.8tDngF}, goog:chromeOptions: {debuggerAddress: localhost:38419}, javascriptEnabled: true, networkConnectionEnabled: false, pageLoadStrategy: normal, platform: LINUX, platformName: LINUX, proxy: Proxy(), setWindowRect: true, strictFileInteractability: false, timeouts: {implicit: 0, pageLoad: 300000, script: 30000}, unhandledPromptBehavior: dismiss and notify, webauthn:extension:largeBlob: true, webauthn:virtualAuthenticators: true}
Session ID: 2b9460fb46f53c6b6ba1ec561c520818
	at org.openqa.selenium.remote.RemoteWebDriver.execute(RemoteWebDriver.java:603)
(35 more lines...)
Collapse Failed EditDemographicTest editDemographicTest History
Run QA UI Tests 2 mins
org.openqa.selenium.remote.UnreachableBrowserException: Error communicating with the remote browser. It may have died. Build info: version: '4.0.0-alpha-6', revision: '5f43a29cfc' System info: host: 'yokobue', ip: '127.0.0.1', os.name: 'Linux', os.arch: 'amd64', os.version: '4.4.0-210-generic', java.version: '1.8.0_292' Driver info: driver.version: RemoteWebDriver Capabilities {acceptInsecureCerts: false, browserName: chrome, browserVersion: 90.0.4430.72, chrome: {chromedriverVersion: 90.0.4430.24 (4c6d850f087da..., userDataDir: /tmp/.com.google.Chrome.V2svII}, goog:chromeOptions: {debuggerAddress: localhost:38912}, javascriptEnabled: true, networkConnectionEnabled: false, pageLoadStrategy: normal, platform: LINUX, platformName: LINUX, proxy: Proxy(), setWindowRect: true, strictFileInteractability: false, timeouts: {implicit: 0, pageLoad: 300000, script: 30000}, unhandledPromptBehavior: dismiss and notify, webauthn:extension:largeBlob: true, webauthn:virtualAuthenticators: true} Session ID: 435fdc901246bb65e228da6bf3c8c565
org.openqa.selenium.remote.UnreachableBrowserException: Error communicating with the remote browser. It may have died.
Build info: version: '4.0.0-alpha-6', revision: '5f43a29cfc'
System info: host: 'yokobue', ip: '127.0.0.1', os.name: 'Linux', os.arch: 'amd64', os.version: '4.4.0-210-generic', java.version: '1.8.0_292'
Driver info: driver.version: RemoteWebDriver
Capabilities {acceptInsecureCerts: false, browserName: chrome, browserVersion: 90.0.4430.72, chrome: {chromedriverVersion: 90.0.4430.24 (4c6d850f087da..., userDataDir: /tmp/.com.google.Chrome.V2svII}, goog:chromeOptions: {debuggerAddress: localhost:38912}, javascriptEnabled: true, networkConnectionEnabled: false, pageLoadStrategy: normal, platform: LINUX, platformName: LINUX, proxy: Proxy(), setWindowRect: true, strictFileInteractability: false, timeouts: {implicit: 0, pageLoad: 300000, script: 30000}, unhandledPromptBehavior: dismiss and notify, webauthn:extension:largeBlob: true, webauthn:virtualAuthenticators: true}
Session ID: 435fdc901246bb65e228da6bf3c8c565
	at org.openqa.selenium.remote.RemoteWebDriver.execute(RemoteWebDriver.java:603)
(35 more lines...)
Skipped tests 16
Status Test Failing since View job
Skipped AddEditAppointmentBlockTest org.openmrs.reference.AddEditAppointmentBlockTest History
Run QA UI Tests
Skipped AddFormTest addFormTest History
Failing since build #218 (Rebuilt by Sharif Magembe) Run QA UI Tests
Skipped AddPatientAppointmentTest addPatientAppointmentTest History
Run QA UI Tests
Skipped BookRequestAppointmentTest bookRequestAppointmentTest History
Run QA UI Tests
Skipped ContactInfoTest contactInfoTest History
Run QA UI Tests
Skipped DeleteAppointmentBlockTest org.openmrs.reference.DeleteAppointmentBlockTest History
Run QA UI Tests
Skipped DeleteFormTest deleteFormTest History
Failing since build #257 (Rebuilt by Sharif Magembe) Run QA UI Tests
Skipped EditFormTest EditFormTest History
Run QA UI Tests
Skipped EndVisitTest EndVisitTest History
Run QA UI Tests
Skipped EyeReportTest eyeReportTest History
Run QA UI Tests
Skipped LoginTest org.openmrs.reference.LoginTest History
Run QA UI Tests
Skipped MergeVisitsTest mergeVisitsTest History
Run QA UI Tests
Skipped TransferToWardServiceTest transferToWardServiceTest History
Run QA UI Tests
Skipped UsingBackButtonInMergePatientTest usingBackButtonInMergePatientTest History
Run QA UI Tests
Skipped VisitNoteTest VisitNoteTest History
Run QA UI Tests
Skipped XSSOnPhoneNumberFieldTest XSSOnPhoneNumberFieldTest History
Run QA UI Tests