UI tests for the reference application

Build: #399 failed Changes by OpenMRS Administrator

Logs

The following logs have been generated by the jobs in this plan.
  • Expand all
  • Collapse all
Job Logs
Collapse Run QA UI Tests Ref App UI Testing Download or View
02-Aug-2021 21:47:44 [INFO] Reactor Summary:
02-Aug-2021 21:47:44 [INFO]
02-Aug-2021 21:47:44 [INFO] Reference Application Distribution ................. SUCCESS [  0.316 s]
02-Aug-2021 21:47:44 [INFO] Reference Application Distribution Package ......... SUCCESS [01:08 min]
02-Aug-2021 21:47:44 [INFO] Reference Application Distribution UI Tests ........ FAILURE [01:34 min]
02-Aug-2021 21:47:44 [INFO] ------------------------------------------------------------------------
02-Aug-2021 21:47:44 [INFO] BUILD FAILURE
02-Aug-2021 21:47:44 [INFO] ------------------------------------------------------------------------
02-Aug-2021 21:47:44 [INFO] Total time: 02:44 min
02-Aug-2021 21:47:44 [INFO] Finished at: 2021-08-02T21:47:44+00:00
02-Aug-2021 21:47:45 [INFO] Final Memory: 63M/362M
02-Aug-2021 21:47:45 [INFO] ------------------------------------------------------------------------
02-Aug-2021 21:47:45 [ERROR] Failed to execute goal org.apache.maven.plugins:maven-surefire-plugin:2.12:test (default-test) on project referenceapplication-ui-tests: There are test failures.
02-Aug-2021 21:47:45 [ERROR]
02-Aug-2021 21:47:45 [ERROR] Please refer to /home/bamboo-agent/bamboo-agent/xml-data/build-dir/REFAPP-UI-FRAMEWORK/ui-tests/target/surefire-reports for the individual test results.
02-Aug-2021 21:47:45 [ERROR] -> [Help 1]
02-Aug-2021 21:47:45 [ERROR]
02-Aug-2021 21:47:45 [ERROR] To see the full stack trace of the errors, re-run Maven with the -e switch.
02-Aug-2021 21:47:45 [ERROR] Re-run Maven using the -X switch to enable full debug logging.
02-Aug-2021 21:47:45 [ERROR]
02-Aug-2021 21:47:45 [ERROR] For more information about the errors and possible solutions, please read the following articles:
02-Aug-2021 21:47:45 [ERROR] [Help 1] http://cwiki.apache.org/confluence/display/MAVEN/MojoFailureException
02-Aug-2021 21:47:45 [ERROR]
02-Aug-2021 21:47:45 [ERROR] After correcting the problems, you can resume the build with the command
02-Aug-2021 21:47:45 [ERROR]   mvn <goals> -rf :referenceapplication-ui-tests