UI tests for the reference application

Build: #434 failed Manual run by Sharif Magembe


The following logs have been generated by the jobs in this plan.
  • Expand all
  • Collapse all
Job Logs
Collapse Run QA UI Tests Ref App UI Testing Download or View
10-Aug-2021 11:32:58 [INFO] Reactor Summary:
10-Aug-2021 11:32:58 [INFO]
10-Aug-2021 11:32:58 [INFO] Reference Application Distribution ................. SUCCESS [  0.410 s]
10-Aug-2021 11:32:58 [INFO] Reference Application Distribution Package ......... SUCCESS [ 34.702 s]
10-Aug-2021 11:32:58 [INFO] Reference Application Distribution UI Tests ........ FAILURE [12:28 min]
10-Aug-2021 11:32:58 [INFO] ------------------------------------------------------------------------
10-Aug-2021 11:32:58 [INFO] BUILD FAILURE
10-Aug-2021 11:32:58 [INFO] ------------------------------------------------------------------------
10-Aug-2021 11:32:58 [INFO] Total time: 13:03 min
10-Aug-2021 11:32:58 [INFO] Finished at: 2021-08-10T11:32:58+00:00
10-Aug-2021 11:32:59 [INFO] Final Memory: 63M/365M
10-Aug-2021 11:32:59 [INFO] ------------------------------------------------------------------------
10-Aug-2021 11:32:59 [ERROR] Failed to execute goal org.apache.maven.plugins:maven-surefire-plugin:2.12:test (default-test) on project referenceapplication-ui-tests: There are test failures.
10-Aug-2021 11:32:59 [ERROR]
10-Aug-2021 11:32:59 [ERROR] Please refer to /home/bamboo-agent/bamboo-agent/xml-data/build-dir/REFAPP-UI-FRAMEWORK/ui-tests/target/surefire-reports for the individual test results.
10-Aug-2021 11:32:59 [ERROR] -> [Help 1]
10-Aug-2021 11:32:59 [ERROR]
10-Aug-2021 11:32:59 [ERROR] To see the full stack trace of the errors, re-run Maven with the -e switch.
10-Aug-2021 11:32:59 [ERROR] Re-run Maven using the -X switch to enable full debug logging.
10-Aug-2021 11:32:59 [ERROR]
10-Aug-2021 11:32:59 [ERROR] For more information about the errors and possible solutions, please read the following articles:
10-Aug-2021 11:32:59 [ERROR] [Help 1] http://cwiki.apache.org/confluence/display/MAVEN/MojoFailureException
10-Aug-2021 11:32:59 [ERROR]
10-Aug-2021 11:32:59 [ERROR] After correcting the problems, you can resume the build with the command
10-Aug-2021 11:32:59 [ERROR]   mvn <goals> -rf :referenceapplication-ui-tests