UI tests for the reference application

Build: #552 failed Scheduled

Logs

The following logs have been generated by the jobs in this plan.
  • Expand all
  • Collapse all
Job Logs
Collapse Run QA UI Tests Ref App UI Testing Download or View
14-Sep-2021 02:11:34         at sun.reflect.DelegatingMethodAccessorImpl.invoke(DelegatingMethodAccessorImpl.java:43)
14-Sep-2021 02:11:34         at java.lang.reflect.Method.invoke(Method.java:498)
14-Sep-2021 02:11:34         at org.codehaus.plexus.classworlds.launcher.Launcher.launchEnhanced(Launcher.java:289)
14-Sep-2021 02:11:34         at org.codehaus.plexus.classworlds.launcher.Launcher.launch(Launcher.java:229)
14-Sep-2021 02:11:34         at org.codehaus.plexus.classworlds.launcher.Launcher.mainWithExitCode(Launcher.java:415)
14-Sep-2021 02:11:34         at org.codehaus.plexus.classworlds.launcher.Launcher.main(Launcher.java:356)
14-Sep-2021 02:11:34 Caused by: org.apache.maven.plugin.MojoFailureException: There are test failures.
14-Sep-2021 02:11:34
14-Sep-2021 02:11:34 Please refer to /home/bamboo-agent/bamboo-agent/xml-data/build-dir/REFAPP-UI-FRAMEWORK/ui-tests/target/surefire-reports for the individual test results.
14-Sep-2021 02:11:34         at org.apache.maven.plugin.surefire.SurefireHelper.reportExecution(SurefireHelper.java:83)
14-Sep-2021 02:11:34         at org.apache.maven.plugin.surefire.SurefirePlugin.writeSummary(SurefirePlugin.java:673)
14-Sep-2021 02:11:34         at org.apache.maven.plugin.surefire.SurefirePlugin.handleSummary(SurefirePlugin.java:647)
14-Sep-2021 02:11:34         at org.apache.maven.plugin.surefire.AbstractSurefireMojo.executeAfterPreconditionsChecked(AbstractSurefireMojo.java:137)
14-Sep-2021 02:11:34         at org.apache.maven.plugin.surefire.AbstractSurefireMojo.execute(AbstractSurefireMojo.java:98)
14-Sep-2021 02:11:34         at org.apache.maven.plugin.DefaultBuildPluginManager.executeMojo(DefaultBuildPluginManager.java:134)
14-Sep-2021 02:11:34         at org.apache.maven.lifecycle.internal.MojoExecutor.execute(MojoExecutor.java:207)
14-Sep-2021 02:11:34         ... 20 more
14-Sep-2021 02:11:34 [ERROR]
14-Sep-2021 02:11:34 [ERROR] Re-run Maven using the -X switch to enable full debug logging.
14-Sep-2021 02:11:34 [ERROR]
14-Sep-2021 02:11:34 [ERROR] For more information about the errors and possible solutions, please read the following articles:
14-Sep-2021 02:11:34 [ERROR] [Help 1] http://cwiki.apache.org/confluence/display/MAVEN/MojoFailureException
14-Sep-2021 02:11:34 [ERROR]
14-Sep-2021 02:11:34 [ERROR] After correcting the problems, you can resume the build with the command
14-Sep-2021 02:11:34 [ERROR]   mvn <goals> -rf :referenceapplication-ui-tests