UI tests for the reference application

Build: #562 failed Changes by Daniel Kayiwa

Logs

The following logs have been generated by the jobs in this plan.
  • Expand all
  • Collapse all
Job Logs
Collapse Run QA UI Tests Ref App UI Testing Download or View
15-Sep-2021 09:28:52         at sun.reflect.DelegatingMethodAccessorImpl.invoke(DelegatingMethodAccessorImpl.java:43)
15-Sep-2021 09:28:52         at java.lang.reflect.Method.invoke(Method.java:498)
15-Sep-2021 09:28:52         at org.codehaus.plexus.classworlds.launcher.Launcher.launchEnhanced(Launcher.java:289)
15-Sep-2021 09:28:52         at org.codehaus.plexus.classworlds.launcher.Launcher.launch(Launcher.java:229)
15-Sep-2021 09:28:52         at org.codehaus.plexus.classworlds.launcher.Launcher.mainWithExitCode(Launcher.java:415)
15-Sep-2021 09:28:52         at org.codehaus.plexus.classworlds.launcher.Launcher.main(Launcher.java:356)
15-Sep-2021 09:28:52 Caused by: org.apache.maven.plugin.MojoFailureException: There are test failures.
15-Sep-2021 09:28:52
15-Sep-2021 09:28:52 Please refer to /home/bamboo-agent/bamboo-agent/xml-data/build-dir/REFAPP-UI-FRAMEWORK/ui-tests/target/surefire-reports for the individual test results.
15-Sep-2021 09:28:52         at org.apache.maven.plugin.surefire.SurefireHelper.reportExecution(SurefireHelper.java:83)
15-Sep-2021 09:28:52         at org.apache.maven.plugin.surefire.SurefirePlugin.writeSummary(SurefirePlugin.java:673)
15-Sep-2021 09:28:52         at org.apache.maven.plugin.surefire.SurefirePlugin.handleSummary(SurefirePlugin.java:647)
15-Sep-2021 09:28:52         at org.apache.maven.plugin.surefire.AbstractSurefireMojo.executeAfterPreconditionsChecked(AbstractSurefireMojo.java:137)
15-Sep-2021 09:28:52         at org.apache.maven.plugin.surefire.AbstractSurefireMojo.execute(AbstractSurefireMojo.java:98)
15-Sep-2021 09:28:52         at org.apache.maven.plugin.DefaultBuildPluginManager.executeMojo(DefaultBuildPluginManager.java:134)
15-Sep-2021 09:28:52         at org.apache.maven.lifecycle.internal.MojoExecutor.execute(MojoExecutor.java:207)
15-Sep-2021 09:28:52         ... 20 more
15-Sep-2021 09:28:52 [ERROR]
15-Sep-2021 09:28:52 [ERROR] Re-run Maven using the -X switch to enable full debug logging.
15-Sep-2021 09:28:52 [ERROR]
15-Sep-2021 09:28:52 [ERROR] For more information about the errors and possible solutions, please read the following articles:
15-Sep-2021 09:28:52 [ERROR] [Help 1] http://cwiki.apache.org/confluence/display/MAVEN/MojoFailureException
15-Sep-2021 09:28:52 [ERROR]
15-Sep-2021 09:28:52 [ERROR] After correcting the problems, you can resume the build with the command
15-Sep-2021 09:28:52 [ERROR]   mvn <goals> -rf :referenceapplication-ui-tests