UI tests for the reference application

Build: #646 failed Changes by HerbertYiga <herbertyiga24@gmail.com>

Build result summary

Details

Completed
Duration
4 minutes
Labels
None
Revisions
Distribution
0b4ec039c3cffd4535df6afac0d4b6fa776f99b8 0b4ec039c3cffd4535df6afac0d4b6fa776f99b8
UI Test Framework
8838c8eeee749c044f9846bcb0a31a7065db1260 8838c8eeee749c044f9846bcb0a31a7065db1260
Total tests
58
Failing since
#645 (Changes by OpenMRS Administrator)
Fixed in
#650 (Manual run by Kakumirizi Daud)

Responsible

Code commits

Distribution
Author Commit Message Commit date
HerbertYiga <herbertyiga24@gmail.com> HerbertYiga <herbertyiga24@gmail.com> 0b4ec039c3cffd4535df6afac0d4b6fa776f99b8 0b4ec039c3cffd4535df6afac0d4b6fa776f99b8 Updating Reff App Version (#588)

Tests

New test failures 8
Status Test View job Duration
Collapse Failed AddVisitTypeTest addVisitTypeTest History
Run QA UI Tests < 1 sec
java.lang.AssertionError: Test killed due to server failure
	at org.junit.Assert.fail(Assert.java:89)
	at org.openmrs.uitestframework.test.TestBase.startWebDriver(TestBase.java:127)
	at sun.reflect.NativeMethodAccessorImpl.invoke0(Native Method)
	at sun.reflect.NativeMethodAccessorImpl.invoke(NativeMethodAccessorImpl.java:62)
	at sun.reflect.DelegatingMethodAccessorImpl.invoke(DelegatingMethodAccessorImpl.java:43)
	at java.lang.reflect.Method.invoke(Method.java:498)
	at org.junit.runners.model.FrameworkMethod$1.runReflectiveCall(FrameworkMethod.java:59)
(31 more lines...)
Collapse Failed DeleteAllergyTest deleteAllergyTest History
Run QA UI Tests < 1 sec
java.lang.AssertionError: Test killed due to server failure
	at org.junit.Assert.fail(Assert.java:89)
	at org.openmrs.uitestframework.test.TestBase.startWebDriver(TestBase.java:127)
	at sun.reflect.NativeMethodAccessorImpl.invoke0(Native Method)
	at sun.reflect.NativeMethodAccessorImpl.invoke(NativeMethodAccessorImpl.java:62)
	at sun.reflect.DelegatingMethodAccessorImpl.invoke(DelegatingMethodAccessorImpl.java:43)
	at java.lang.reflect.Method.invoke(Method.java:498)
	at org.junit.runners.model.FrameworkMethod$1.runReflectiveCall(FrameworkMethod.java:59)
(31 more lines...)
Collapse Failed EditPersonTest editPersonTest History
Run QA UI Tests < 1 sec
java.lang.AssertionError: Test killed due to server failure
	at org.junit.Assert.fail(Assert.java:89)
	at org.openmrs.uitestframework.test.TestBase.startWebDriver(TestBase.java:127)
	at sun.reflect.NativeMethodAccessorImpl.invoke0(Native Method)
	at sun.reflect.NativeMethodAccessorImpl.invoke(NativeMethodAccessorImpl.java:62)
	at sun.reflect.DelegatingMethodAccessorImpl.invoke(DelegatingMethodAccessorImpl.java:43)
	at java.lang.reflect.Method.invoke(Method.java:498)
	at org.junit.runners.model.FrameworkMethod$1.runReflectiveCall(FrameworkMethod.java:59)
(31 more lines...)
Collapse Failed FindPatientRecordTest findPatientRecordTest History
Run QA UI Tests < 1 sec
java.lang.AssertionError: Test killed due to server failure
	at org.junit.Assert.fail(Assert.java:89)
	at org.openmrs.uitestframework.test.TestBase.startWebDriver(TestBase.java:127)
	at sun.reflect.NativeMethodAccessorImpl.invoke0(Native Method)
	at sun.reflect.NativeMethodAccessorImpl.invoke(NativeMethodAccessorImpl.java:62)
	at sun.reflect.DelegatingMethodAccessorImpl.invoke(DelegatingMethodAccessorImpl.java:43)
	at java.lang.reflect.Method.invoke(Method.java:498)
	at org.junit.runners.model.FrameworkMethod$1.runReflectiveCall(FrameworkMethod.java:59)
(31 more lines...)
Collapse Failed RetireLocationTest retireLocationTest History
Run QA UI Tests < 1 sec
java.lang.AssertionError: Test killed due to server failure
	at org.junit.Assert.fail(Assert.java:89)
	at org.openmrs.uitestframework.test.TestBase.startWebDriver(TestBase.java:127)
	at sun.reflect.NativeMethodAccessorImpl.invoke0(Native Method)
	at sun.reflect.NativeMethodAccessorImpl.invoke(NativeMethodAccessorImpl.java:62)
	at sun.reflect.DelegatingMethodAccessorImpl.invoke(DelegatingMethodAccessorImpl.java:43)
	at java.lang.reflect.Method.invoke(Method.java:498)
	at org.junit.runners.model.FrameworkMethod$1.runReflectiveCall(FrameworkMethod.java:59)
(31 more lines...)
Collapse Failed SearchActiveVisitsTest searchActiveVisitsTest History
Run QA UI Tests < 1 sec
java.lang.AssertionError: Test killed due to server failure
	at org.junit.Assert.fail(Assert.java:89)
	at org.openmrs.uitestframework.test.TestBase.startWebDriver(TestBase.java:127)
	at sun.reflect.NativeMethodAccessorImpl.invoke0(Native Method)
	at sun.reflect.NativeMethodAccessorImpl.invoke(NativeMethodAccessorImpl.java:62)
	at sun.reflect.DelegatingMethodAccessorImpl.invoke(DelegatingMethodAccessorImpl.java:43)
	at java.lang.reflect.Method.invoke(Method.java:498)
	at org.junit.runners.model.FrameworkMethod$1.runReflectiveCall(FrameworkMethod.java:59)
(31 more lines...)
Collapse Failed UnidentifiedPatientKeyboardTest unidentifiedPatientKeyboardTest History
Run QA UI Tests 1 min
java.lang.AssertionError: Test killed due to server failure
	at org.junit.Assert.fail(Assert.java:89)
	at org.openmrs.uitestframework.test.TestBase.failTest(TestBase.java:216)
	at org.openmrs.uitestframework.test.TestBase.launchBrowser(TestBase.java:196)
	at org.openmrs.uitestframework.test.TestBase.startWebDriver(TestBase.java:130)
	at sun.reflect.NativeMethodAccessorImpl.invoke0(Native Method)
	at sun.reflect.NativeMethodAccessorImpl.invoke(NativeMethodAccessorImpl.java:62)
	at sun.reflect.DelegatingMethodAccessorImpl.invoke(DelegatingMethodAccessorImpl.java:43)
(33 more lines...)
Collapse Failed XSSOnPhoneNumberFieldTest xssOnPhoneNumberFieldTest History
Run QA UI Tests < 1 sec
java.lang.AssertionError: Test killed due to server failure
	at org.junit.Assert.fail(Assert.java:89)
	at org.openmrs.uitestframework.test.TestBase.startWebDriver(TestBase.java:127)
	at sun.reflect.NativeMethodAccessorImpl.invoke0(Native Method)
	at sun.reflect.NativeMethodAccessorImpl.invoke(NativeMethodAccessorImpl.java:62)
	at sun.reflect.DelegatingMethodAccessorImpl.invoke(DelegatingMethodAccessorImpl.java:43)
	at java.lang.reflect.Method.invoke(Method.java:498)
	at org.junit.runners.model.FrameworkMethod$1.runReflectiveCall(FrameworkMethod.java:59)
(31 more lines...)
Existing test failures 50
Status Test Failing since View job Duration
java.lang.AssertionError: Test killed due to server failure
	at org.junit.Assert.fail(Assert.java:89)
	at org.openmrs.uitestframework.test.TestBase.startWebDriver(TestBase.java:127)
	at sun.reflect.GeneratedMethodAccessor6.invoke(Unknown Source)
	at sun.reflect.DelegatingMethodAccessorImpl.invoke(DelegatingMethodAccessorImpl.java:43)
	at java.lang.reflect.Method.invoke(Method.java:498)
	at org.junit.runners.model.FrameworkMethod$1.runReflectiveCall(FrameworkMethod.java:59)
	at org.junit.internal.runners.model.ReflectiveCallable.run(ReflectiveCallable.java:12)
(30 more lines...)
java.lang.AssertionError: Test killed due to server failure
	at org.junit.Assert.fail(Assert.java:89)
	at org.openmrs.uitestframework.test.TestBase.startWebDriver(TestBase.java:127)
	at sun.reflect.GeneratedMethodAccessor6.invoke(Unknown Source)
	at sun.reflect.DelegatingMethodAccessorImpl.invoke(DelegatingMethodAccessorImpl.java:43)
	at java.lang.reflect.Method.invoke(Method.java:498)
	at org.junit.runners.model.FrameworkMethod$1.runReflectiveCall(FrameworkMethod.java:59)
	at org.junit.internal.runners.model.ReflectiveCallable.run(ReflectiveCallable.java:12)
(30 more lines...)
java.lang.AssertionError: Test killed due to server failure
	at org.junit.Assert.fail(Assert.java:89)
	at org.openmrs.uitestframework.test.TestBase.startWebDriver(TestBase.java:127)
	at sun.reflect.GeneratedMethodAccessor6.invoke(Unknown Source)
	at sun.reflect.DelegatingMethodAccessorImpl.invoke(DelegatingMethodAccessorImpl.java:43)
	at java.lang.reflect.Method.invoke(Method.java:498)
	at org.junit.runners.model.FrameworkMethod$1.runReflectiveCall(FrameworkMethod.java:59)
	at org.junit.internal.runners.model.ReflectiveCallable.run(ReflectiveCallable.java:12)
(30 more lines...)
java.lang.AssertionError: Test killed due to server failure
	at org.junit.Assert.fail(Assert.java:89)
	at org.openmrs.uitestframework.test.TestBase.startWebDriver(TestBase.java:127)
	at sun.reflect.GeneratedMethodAccessor6.invoke(Unknown Source)
	at sun.reflect.DelegatingMethodAccessorImpl.invoke(DelegatingMethodAccessorImpl.java:43)
	at java.lang.reflect.Method.invoke(Method.java:498)
	at org.junit.runners.model.FrameworkMethod$1.runReflectiveCall(FrameworkMethod.java:59)
	at org.junit.internal.runners.model.ReflectiveCallable.run(ReflectiveCallable.java:12)
(30 more lines...)
java.lang.AssertionError: Test killed due to server failure
	at org.junit.Assert.fail(Assert.java:89)
	at org.openmrs.uitestframework.test.TestBase.startWebDriver(TestBase.java:127)
	at sun.reflect.GeneratedMethodAccessor6.invoke(Unknown Source)
	at sun.reflect.DelegatingMethodAccessorImpl.invoke(DelegatingMethodAccessorImpl.java:43)
	at java.lang.reflect.Method.invoke(Method.java:498)
	at org.junit.runners.model.FrameworkMethod$1.runReflectiveCall(FrameworkMethod.java:59)
	at org.junit.internal.runners.model.ReflectiveCallable.run(ReflectiveCallable.java:12)
(30 more lines...)
java.lang.AssertionError: Test killed due to server failure
	at org.junit.Assert.fail(Assert.java:89)
	at org.openmrs.uitestframework.test.TestBase.startWebDriver(TestBase.java:127)
	at sun.reflect.GeneratedMethodAccessor6.invoke(Unknown Source)
	at sun.reflect.DelegatingMethodAccessorImpl.invoke(DelegatingMethodAccessorImpl.java:43)
	at java.lang.reflect.Method.invoke(Method.java:498)
	at org.junit.runners.model.FrameworkMethod$1.runReflectiveCall(FrameworkMethod.java:59)
	at org.junit.internal.runners.model.ReflectiveCallable.run(ReflectiveCallable.java:12)
(30 more lines...)
java.lang.AssertionError: Test killed due to server failure
	at org.junit.Assert.fail(Assert.java:89)
	at org.openmrs.uitestframework.test.TestBase.startWebDriver(TestBase.java:127)
	at sun.reflect.GeneratedMethodAccessor6.invoke(Unknown Source)
	at sun.reflect.DelegatingMethodAccessorImpl.invoke(DelegatingMethodAccessorImpl.java:43)
	at java.lang.reflect.Method.invoke(Method.java:498)
	at org.junit.runners.model.FrameworkMethod$1.runReflectiveCall(FrameworkMethod.java:59)
	at org.junit.internal.runners.model.ReflectiveCallable.run(ReflectiveCallable.java:12)
(30 more lines...)
java.lang.AssertionError: Test killed due to server failure
	at org.junit.Assert.fail(Assert.java:89)
	at org.openmrs.uitestframework.test.TestBase.startWebDriver(TestBase.java:127)
	at sun.reflect.GeneratedMethodAccessor6.invoke(Unknown Source)
	at sun.reflect.DelegatingMethodAccessorImpl.invoke(DelegatingMethodAccessorImpl.java:43)
	at java.lang.reflect.Method.invoke(Method.java:498)
	at org.junit.runners.model.FrameworkMethod$1.runReflectiveCall(FrameworkMethod.java:59)
	at org.junit.internal.runners.model.ReflectiveCallable.run(ReflectiveCallable.java:12)
(30 more lines...)
java.lang.AssertionError: Test killed due to server failure
	at org.junit.Assert.fail(Assert.java:89)
	at org.openmrs.uitestframework.test.TestBase.startWebDriver(TestBase.java:127)
	at sun.reflect.GeneratedMethodAccessor6.invoke(Unknown Source)
	at sun.reflect.DelegatingMethodAccessorImpl.invoke(DelegatingMethodAccessorImpl.java:43)
	at java.lang.reflect.Method.invoke(Method.java:498)
	at org.junit.runners.model.FrameworkMethod$1.runReflectiveCall(FrameworkMethod.java:59)
	at org.junit.internal.runners.model.ReflectiveCallable.run(ReflectiveCallable.java:12)
(30 more lines...)
java.lang.AssertionError: Test killed due to server failure
	at org.junit.Assert.fail(Assert.java:89)
	at org.openmrs.uitestframework.test.TestBase.startWebDriver(TestBase.java:127)
	at sun.reflect.GeneratedMethodAccessor6.invoke(Unknown Source)
	at sun.reflect.DelegatingMethodAccessorImpl.invoke(DelegatingMethodAccessorImpl.java:43)
	at java.lang.reflect.Method.invoke(Method.java:498)
	at org.junit.runners.model.FrameworkMethod$1.runReflectiveCall(FrameworkMethod.java:59)
	at org.junit.internal.runners.model.ReflectiveCallable.run(ReflectiveCallable.java:12)
(30 more lines...)
java.lang.AssertionError: Test killed due to server failure
	at org.junit.Assert.fail(Assert.java:89)
	at org.openmrs.uitestframework.test.TestBase.startWebDriver(TestBase.java:127)
	at sun.reflect.GeneratedMethodAccessor6.invoke(Unknown Source)
	at sun.reflect.DelegatingMethodAccessorImpl.invoke(DelegatingMethodAccessorImpl.java:43)
	at java.lang.reflect.Method.invoke(Method.java:498)
	at org.junit.runners.model.FrameworkMethod$1.runReflectiveCall(FrameworkMethod.java:59)
	at org.junit.internal.runners.model.ReflectiveCallable.run(ReflectiveCallable.java:12)
(30 more lines...)
java.lang.AssertionError: Test killed due to server failure
	at org.junit.Assert.fail(Assert.java:89)
	at org.openmrs.uitestframework.test.TestBase.startWebDriver(TestBase.java:127)
	at sun.reflect.GeneratedMethodAccessor6.invoke(Unknown Source)
	at sun.reflect.DelegatingMethodAccessorImpl.invoke(DelegatingMethodAccessorImpl.java:43)
	at java.lang.reflect.Method.invoke(Method.java:498)
	at org.junit.runners.model.FrameworkMethod$1.runReflectiveCall(FrameworkMethod.java:59)
	at org.junit.internal.runners.model.ReflectiveCallable.run(ReflectiveCallable.java:12)
(30 more lines...)
java.lang.AssertionError: Test killed due to server failure
	at org.junit.Assert.fail(Assert.java:89)
	at org.openmrs.uitestframework.test.TestBase.startWebDriver(TestBase.java:127)
	at sun.reflect.NativeMethodAccessorImpl.invoke0(Native Method)
	at sun.reflect.NativeMethodAccessorImpl.invoke(NativeMethodAccessorImpl.java:62)
	at sun.reflect.DelegatingMethodAccessorImpl.invoke(DelegatingMethodAccessorImpl.java:43)
	at java.lang.reflect.Method.invoke(Method.java:498)
	at org.junit.runners.model.FrameworkMethod$1.runReflectiveCall(FrameworkMethod.java:59)
(31 more lines...)
java.lang.AssertionError: Test killed due to server failure
	at org.junit.Assert.fail(Assert.java:89)
	at org.openmrs.uitestframework.test.TestBase.startWebDriver(TestBase.java:127)
	at sun.reflect.GeneratedMethodAccessor6.invoke(Unknown Source)
	at sun.reflect.DelegatingMethodAccessorImpl.invoke(DelegatingMethodAccessorImpl.java:43)
	at java.lang.reflect.Method.invoke(Method.java:498)
	at org.junit.runners.model.FrameworkMethod$1.runReflectiveCall(FrameworkMethod.java:59)
	at org.junit.internal.runners.model.ReflectiveCallable.run(ReflectiveCallable.java:12)
(30 more lines...)
java.lang.AssertionError: Test killed due to server failure
	at org.junit.Assert.fail(Assert.java:89)
	at org.openmrs.uitestframework.test.TestBase.startWebDriver(TestBase.java:127)
	at sun.reflect.GeneratedMethodAccessor6.invoke(Unknown Source)
	at sun.reflect.DelegatingMethodAccessorImpl.invoke(DelegatingMethodAccessorImpl.java:43)
	at java.lang.reflect.Method.invoke(Method.java:498)
	at org.junit.runners.model.FrameworkMethod$1.runReflectiveCall(FrameworkMethod.java:59)
	at org.junit.internal.runners.model.ReflectiveCallable.run(ReflectiveCallable.java:12)
(30 more lines...)
java.lang.AssertionError: Test killed due to server failure
	at org.junit.Assert.fail(Assert.java:89)
	at org.openmrs.uitestframework.test.TestBase.startWebDriver(TestBase.java:127)
	at sun.reflect.GeneratedMethodAccessor6.invoke(Unknown Source)
	at sun.reflect.DelegatingMethodAccessorImpl.invoke(DelegatingMethodAccessorImpl.java:43)
	at java.lang.reflect.Method.invoke(Method.java:498)
	at org.junit.runners.model.FrameworkMethod$1.runReflectiveCall(FrameworkMethod.java:59)
	at org.junit.internal.runners.model.ReflectiveCallable.run(ReflectiveCallable.java:12)
(30 more lines...)
java.lang.AssertionError: Test killed due to server failure
	at org.junit.Assert.fail(Assert.java:89)
	at org.openmrs.uitestframework.test.TestBase.startWebDriver(TestBase.java:127)
	at sun.reflect.GeneratedMethodAccessor6.invoke(Unknown Source)
	at sun.reflect.DelegatingMethodAccessorImpl.invoke(DelegatingMethodAccessorImpl.java:43)
	at java.lang.reflect.Method.invoke(Method.java:498)
	at org.junit.runners.model.FrameworkMethod$1.runReflectiveCall(FrameworkMethod.java:59)
	at org.junit.internal.runners.model.ReflectiveCallable.run(ReflectiveCallable.java:12)
(30 more lines...)
java.lang.AssertionError: Test killed due to server failure
	at org.junit.Assert.fail(Assert.java:89)
	at org.openmrs.uitestframework.test.TestBase.startWebDriver(TestBase.java:127)
	at sun.reflect.GeneratedMethodAccessor6.invoke(Unknown Source)
	at sun.reflect.DelegatingMethodAccessorImpl.invoke(DelegatingMethodAccessorImpl.java:43)
	at java.lang.reflect.Method.invoke(Method.java:498)
	at org.junit.runners.model.FrameworkMethod$1.runReflectiveCall(FrameworkMethod.java:59)
	at org.junit.internal.runners.model.ReflectiveCallable.run(ReflectiveCallable.java:12)
(30 more lines...)
java.lang.AssertionError: Test killed due to server failure
	at org.junit.Assert.fail(Assert.java:89)
	at org.openmrs.uitestframework.test.TestBase.startWebDriver(TestBase.java:127)
	at sun.reflect.GeneratedMethodAccessor6.invoke(Unknown Source)
	at sun.reflect.DelegatingMethodAccessorImpl.invoke(DelegatingMethodAccessorImpl.java:43)
	at java.lang.reflect.Method.invoke(Method.java:498)
	at org.junit.runners.model.FrameworkMethod$1.runReflectiveCall(FrameworkMethod.java:59)
	at org.junit.internal.runners.model.ReflectiveCallable.run(ReflectiveCallable.java:12)
(30 more lines...)
java.lang.AssertionError: Test killed due to server failure
	at org.junit.Assert.fail(Assert.java:89)
	at org.openmrs.uitestframework.test.TestBase.startWebDriver(TestBase.java:127)
	at sun.reflect.NativeMethodAccessorImpl.invoke0(Native Method)
	at sun.reflect.NativeMethodAccessorImpl.invoke(NativeMethodAccessorImpl.java:62)
	at sun.reflect.DelegatingMethodAccessorImpl.invoke(DelegatingMethodAccessorImpl.java:43)
	at java.lang.reflect.Method.invoke(Method.java:498)
	at org.junit.runners.model.FrameworkMethod$1.runReflectiveCall(FrameworkMethod.java:59)
(31 more lines...)
java.lang.AssertionError: Test killed due to server failure
	at org.junit.Assert.fail(Assert.java:89)
	at org.openmrs.uitestframework.test.TestBase.startWebDriver(TestBase.java:127)
	at sun.reflect.GeneratedMethodAccessor6.invoke(Unknown Source)
	at sun.reflect.DelegatingMethodAccessorImpl.invoke(DelegatingMethodAccessorImpl.java:43)
	at java.lang.reflect.Method.invoke(Method.java:498)
	at org.junit.runners.model.FrameworkMethod$1.runReflectiveCall(FrameworkMethod.java:59)
	at org.junit.internal.runners.model.ReflectiveCallable.run(ReflectiveCallable.java:12)
(30 more lines...)
java.lang.AssertionError: Test killed due to server failure
	at org.junit.Assert.fail(Assert.java:89)
	at org.openmrs.uitestframework.test.TestBase.startWebDriver(TestBase.java:127)
	at sun.reflect.GeneratedMethodAccessor6.invoke(Unknown Source)
	at sun.reflect.DelegatingMethodAccessorImpl.invoke(DelegatingMethodAccessorImpl.java:43)
	at java.lang.reflect.Method.invoke(Method.java:498)
	at org.junit.runners.model.FrameworkMethod$1.runReflectiveCall(FrameworkMethod.java:59)
	at org.junit.internal.runners.model.ReflectiveCallable.run(ReflectiveCallable.java:12)
(30 more lines...)
java.lang.AssertionError: Test killed due to server failure
	at org.junit.Assert.fail(Assert.java:89)
	at org.openmrs.uitestframework.test.TestBase.startWebDriver(TestBase.java:127)
	at sun.reflect.NativeMethodAccessorImpl.invoke0(Native Method)
	at sun.reflect.NativeMethodAccessorImpl.invoke(NativeMethodAccessorImpl.java:62)
	at sun.reflect.DelegatingMethodAccessorImpl.invoke(DelegatingMethodAccessorImpl.java:43)
	at java.lang.reflect.Method.invoke(Method.java:498)
	at org.junit.runners.model.FrameworkMethod$1.runReflectiveCall(FrameworkMethod.java:59)
(31 more lines...)
java.lang.AssertionError: Test killed due to server failure
	at org.junit.Assert.fail(Assert.java:89)
	at org.openmrs.uitestframework.test.TestBase.startWebDriver(TestBase.java:127)
	at sun.reflect.GeneratedMethodAccessor6.invoke(Unknown Source)
	at sun.reflect.DelegatingMethodAccessorImpl.invoke(DelegatingMethodAccessorImpl.java:43)
	at java.lang.reflect.Method.invoke(Method.java:498)
	at org.junit.runners.model.FrameworkMethod$1.runReflectiveCall(FrameworkMethod.java:59)
	at org.junit.internal.runners.model.ReflectiveCallable.run(ReflectiveCallable.java:12)
(30 more lines...)
java.lang.AssertionError: Test killed due to server failure
	at org.junit.Assert.fail(Assert.java:89)
	at org.openmrs.uitestframework.test.TestBase.startWebDriver(TestBase.java:127)
	at sun.reflect.GeneratedMethodAccessor6.invoke(Unknown Source)
	at sun.reflect.DelegatingMethodAccessorImpl.invoke(DelegatingMethodAccessorImpl.java:43)
	at java.lang.reflect.Method.invoke(Method.java:498)
	at org.junit.runners.model.FrameworkMethod$1.runReflectiveCall(FrameworkMethod.java:59)
	at org.junit.internal.runners.model.ReflectiveCallable.run(ReflectiveCallable.java:12)
(30 more lines...)
java.lang.AssertionError: Test killed due to server failure
	at org.junit.Assert.fail(Assert.java:89)
	at org.openmrs.uitestframework.test.TestBase.startWebDriver(TestBase.java:127)
	at sun.reflect.NativeMethodAccessorImpl.invoke0(Native Method)
	at sun.reflect.NativeMethodAccessorImpl.invoke(NativeMethodAccessorImpl.java:62)
	at sun.reflect.DelegatingMethodAccessorImpl.invoke(DelegatingMethodAccessorImpl.java:43)
	at java.lang.reflect.Method.invoke(Method.java:498)
	at org.junit.runners.model.FrameworkMethod$1.runReflectiveCall(FrameworkMethod.java:59)
(31 more lines...)
java.lang.AssertionError: Test killed due to server failure
	at org.junit.Assert.fail(Assert.java:89)
	at org.openmrs.uitestframework.test.TestBase.startWebDriver(TestBase.java:127)
	at sun.reflect.GeneratedMethodAccessor6.invoke(Unknown Source)
	at sun.reflect.DelegatingMethodAccessorImpl.invoke(DelegatingMethodAccessorImpl.java:43)
	at java.lang.reflect.Method.invoke(Method.java:498)
	at org.junit.runners.model.FrameworkMethod$1.runReflectiveCall(FrameworkMethod.java:59)
	at org.junit.internal.runners.model.ReflectiveCallable.run(ReflectiveCallable.java:12)
(30 more lines...)
java.lang.AssertionError: Test killed due to server failure
	at org.junit.Assert.fail(Assert.java:89)
	at org.openmrs.uitestframework.test.TestBase.startWebDriver(TestBase.java:127)
	at sun.reflect.GeneratedMethodAccessor6.invoke(Unknown Source)
	at sun.reflect.DelegatingMethodAccessorImpl.invoke(DelegatingMethodAccessorImpl.java:43)
	at java.lang.reflect.Method.invoke(Method.java:498)
	at org.junit.runners.model.FrameworkMethod$1.runReflectiveCall(FrameworkMethod.java:59)
	at org.junit.internal.runners.model.ReflectiveCallable.run(ReflectiveCallable.java:12)
(30 more lines...)
java.lang.AssertionError: Test killed due to server failure
	at org.junit.Assert.fail(Assert.java:89)
	at org.openmrs.uitestframework.test.TestBase.startWebDriver(TestBase.java:127)
	at sun.reflect.NativeMethodAccessorImpl.invoke0(Native Method)
	at sun.reflect.NativeMethodAccessorImpl.invoke(NativeMethodAccessorImpl.java:62)
	at sun.reflect.DelegatingMethodAccessorImpl.invoke(DelegatingMethodAccessorImpl.java:43)
	at java.lang.reflect.Method.invoke(Method.java:498)
	at org.junit.runners.model.FrameworkMethod$1.runReflectiveCall(FrameworkMethod.java:59)
(31 more lines...)
java.lang.AssertionError: Test killed due to server failure
	at org.junit.Assert.fail(Assert.java:89)
	at org.openmrs.uitestframework.test.TestBase.startWebDriver(TestBase.java:127)
	at sun.reflect.NativeMethodAccessorImpl.invoke0(Native Method)
	at sun.reflect.NativeMethodAccessorImpl.invoke(NativeMethodAccessorImpl.java:62)
	at sun.reflect.DelegatingMethodAccessorImpl.invoke(DelegatingMethodAccessorImpl.java:43)
	at java.lang.reflect.Method.invoke(Method.java:498)
	at org.junit.runners.model.FrameworkMethod$1.runReflectiveCall(FrameworkMethod.java:59)
(31 more lines...)
java.lang.AssertionError: Test killed due to server failure
	at org.junit.Assert.fail(Assert.java:89)
	at org.openmrs.uitestframework.test.TestBase.startWebDriver(TestBase.java:127)
	at sun.reflect.NativeMethodAccessorImpl.invoke0(Native Method)
	at sun.reflect.NativeMethodAccessorImpl.invoke(NativeMethodAccessorImpl.java:62)
	at sun.reflect.DelegatingMethodAccessorImpl.invoke(DelegatingMethodAccessorImpl.java:43)
	at java.lang.reflect.Method.invoke(Method.java:498)
	at org.junit.runners.model.FrameworkMethod$1.runReflectiveCall(FrameworkMethod.java:59)
(31 more lines...)
java.lang.AssertionError: Test killed due to server failure
	at org.junit.Assert.fail(Assert.java:89)
	at org.openmrs.uitestframework.test.TestBase.startWebDriver(TestBase.java:127)
	at sun.reflect.GeneratedMethodAccessor6.invoke(Unknown Source)
	at sun.reflect.DelegatingMethodAccessorImpl.invoke(DelegatingMethodAccessorImpl.java:43)
	at java.lang.reflect.Method.invoke(Method.java:498)
	at org.junit.runners.model.FrameworkMethod$1.runReflectiveCall(FrameworkMethod.java:59)
	at org.junit.internal.runners.model.ReflectiveCallable.run(ReflectiveCallable.java:12)
(30 more lines...)
java.lang.AssertionError: Test killed due to server failure
	at org.junit.Assert.fail(Assert.java:89)
	at org.openmrs.uitestframework.test.TestBase.startWebDriver(TestBase.java:127)
	at sun.reflect.GeneratedMethodAccessor6.invoke(Unknown Source)
	at sun.reflect.DelegatingMethodAccessorImpl.invoke(DelegatingMethodAccessorImpl.java:43)
	at java.lang.reflect.Method.invoke(Method.java:498)
	at org.junit.runners.model.FrameworkMethod$1.runReflectiveCall(FrameworkMethod.java:59)
	at org.junit.internal.runners.model.ReflectiveCallable.run(ReflectiveCallable.java:12)
(30 more lines...)
java.lang.AssertionError: Test killed due to server failure
	at org.junit.Assert.fail(Assert.java:89)
	at org.openmrs.uitestframework.test.TestBase.startWebDriver(TestBase.java:127)
	at sun.reflect.GeneratedMethodAccessor6.invoke(Unknown Source)
	at sun.reflect.DelegatingMethodAccessorImpl.invoke(DelegatingMethodAccessorImpl.java:43)
	at java.lang.reflect.Method.invoke(Method.java:498)
	at org.junit.runners.model.FrameworkMethod$1.runReflectiveCall(FrameworkMethod.java:59)
	at org.junit.internal.runners.model.ReflectiveCallable.run(ReflectiveCallable.java:12)
(30 more lines...)
java.lang.AssertionError: Test killed due to server failure
	at org.junit.Assert.fail(Assert.java:89)
	at org.openmrs.uitestframework.test.TestBase.startWebDriver(TestBase.java:127)
	at sun.reflect.GeneratedMethodAccessor6.invoke(Unknown Source)
	at sun.reflect.DelegatingMethodAccessorImpl.invoke(DelegatingMethodAccessorImpl.java:43)
	at java.lang.reflect.Method.invoke(Method.java:498)
	at org.junit.runners.model.FrameworkMethod$1.runReflectiveCall(FrameworkMethod.java:59)
	at org.junit.internal.runners.model.ReflectiveCallable.run(ReflectiveCallable.java:12)
(30 more lines...)
java.lang.AssertionError: Test killed due to server failure
	at org.junit.Assert.fail(Assert.java:89)
	at org.openmrs.uitestframework.test.TestBase.startWebDriver(TestBase.java:127)
	at sun.reflect.GeneratedMethodAccessor6.invoke(Unknown Source)
	at sun.reflect.DelegatingMethodAccessorImpl.invoke(DelegatingMethodAccessorImpl.java:43)
	at java.lang.reflect.Method.invoke(Method.java:498)
	at org.junit.runners.model.FrameworkMethod$1.runReflectiveCall(FrameworkMethod.java:59)
	at org.junit.internal.runners.model.ReflectiveCallable.run(ReflectiveCallable.java:12)
(30 more lines...)
java.lang.AssertionError: Test killed due to server failure
	at org.junit.Assert.fail(Assert.java:89)
	at org.openmrs.uitestframework.test.TestBase.startWebDriver(TestBase.java:127)
	at sun.reflect.GeneratedMethodAccessor6.invoke(Unknown Source)
	at sun.reflect.DelegatingMethodAccessorImpl.invoke(DelegatingMethodAccessorImpl.java:43)
	at java.lang.reflect.Method.invoke(Method.java:498)
	at org.junit.runners.model.FrameworkMethod$1.runReflectiveCall(FrameworkMethod.java:59)
	at org.junit.internal.runners.model.ReflectiveCallable.run(ReflectiveCallable.java:12)
(30 more lines...)
java.lang.AssertionError: Test killed due to server failure
	at org.junit.Assert.fail(Assert.java:89)
	at org.openmrs.uitestframework.test.TestBase.startWebDriver(TestBase.java:127)
	at sun.reflect.GeneratedMethodAccessor6.invoke(Unknown Source)
	at sun.reflect.DelegatingMethodAccessorImpl.invoke(DelegatingMethodAccessorImpl.java:43)
	at java.lang.reflect.Method.invoke(Method.java:498)
	at org.junit.runners.model.FrameworkMethod$1.runReflectiveCall(FrameworkMethod.java:59)
	at org.junit.internal.runners.model.ReflectiveCallable.run(ReflectiveCallable.java:12)
(30 more lines...)
java.lang.AssertionError: Test killed due to server failure
	at org.junit.Assert.fail(Assert.java:89)
	at org.openmrs.uitestframework.test.TestBase.startWebDriver(TestBase.java:127)
	at sun.reflect.GeneratedMethodAccessor6.invoke(Unknown Source)
	at sun.reflect.DelegatingMethodAccessorImpl.invoke(DelegatingMethodAccessorImpl.java:43)
	at java.lang.reflect.Method.invoke(Method.java:498)
	at org.junit.runners.model.FrameworkMethod$1.runReflectiveCall(FrameworkMethod.java:59)
	at org.junit.internal.runners.model.ReflectiveCallable.run(ReflectiveCallable.java:12)
(30 more lines...)
java.lang.AssertionError: Test killed due to server failure
	at org.junit.Assert.fail(Assert.java:89)
	at org.openmrs.uitestframework.test.TestBase.startWebDriver(TestBase.java:127)
	at sun.reflect.GeneratedMethodAccessor6.invoke(Unknown Source)
	at sun.reflect.DelegatingMethodAccessorImpl.invoke(DelegatingMethodAccessorImpl.java:43)
	at java.lang.reflect.Method.invoke(Method.java:498)
	at org.junit.runners.model.FrameworkMethod$1.runReflectiveCall(FrameworkMethod.java:59)
	at org.junit.internal.runners.model.ReflectiveCallable.run(ReflectiveCallable.java:12)
(30 more lines...)
java.lang.AssertionError: Test killed due to server failure
	at org.junit.Assert.fail(Assert.java:89)
	at org.openmrs.uitestframework.test.TestBase.startWebDriver(TestBase.java:127)
	at sun.reflect.GeneratedMethodAccessor6.invoke(Unknown Source)
	at sun.reflect.DelegatingMethodAccessorImpl.invoke(DelegatingMethodAccessorImpl.java:43)
	at java.lang.reflect.Method.invoke(Method.java:498)
	at org.junit.runners.model.FrameworkMethod$1.runReflectiveCall(FrameworkMethod.java:59)
	at org.junit.internal.runners.model.ReflectiveCallable.run(ReflectiveCallable.java:12)
(30 more lines...)
java.lang.AssertionError: Test killed due to server failure
	at org.junit.Assert.fail(Assert.java:89)
	at org.openmrs.uitestframework.test.TestBase.startWebDriver(TestBase.java:127)
	at sun.reflect.GeneratedMethodAccessor6.invoke(Unknown Source)
	at sun.reflect.DelegatingMethodAccessorImpl.invoke(DelegatingMethodAccessorImpl.java:43)
	at java.lang.reflect.Method.invoke(Method.java:498)
	at org.junit.runners.model.FrameworkMethod$1.runReflectiveCall(FrameworkMethod.java:59)
	at org.junit.internal.runners.model.ReflectiveCallable.run(ReflectiveCallable.java:12)
(30 more lines...)
java.lang.AssertionError: Test killed due to server failure
	at org.junit.Assert.fail(Assert.java:89)
	at org.openmrs.uitestframework.test.TestBase.startWebDriver(TestBase.java:127)
	at sun.reflect.GeneratedMethodAccessor6.invoke(Unknown Source)
	at sun.reflect.DelegatingMethodAccessorImpl.invoke(DelegatingMethodAccessorImpl.java:43)
	at java.lang.reflect.Method.invoke(Method.java:498)
	at org.junit.runners.model.FrameworkMethod$1.runReflectiveCall(FrameworkMethod.java:59)
	at org.junit.internal.runners.model.ReflectiveCallable.run(ReflectiveCallable.java:12)
(30 more lines...)
java.lang.AssertionError: Test killed due to server failure
	at org.junit.Assert.fail(Assert.java:89)
	at org.openmrs.uitestframework.test.TestBase.startWebDriver(TestBase.java:127)
	at sun.reflect.GeneratedMethodAccessor6.invoke(Unknown Source)
	at sun.reflect.DelegatingMethodAccessorImpl.invoke(DelegatingMethodAccessorImpl.java:43)
	at java.lang.reflect.Method.invoke(Method.java:498)
	at org.junit.runners.model.FrameworkMethod$1.runReflectiveCall(FrameworkMethod.java:59)
	at org.junit.internal.runners.model.ReflectiveCallable.run(ReflectiveCallable.java:12)
(30 more lines...)
java.lang.AssertionError: Test killed due to server failure
	at org.junit.Assert.fail(Assert.java:89)
	at org.openmrs.uitestframework.test.TestBase.startWebDriver(TestBase.java:127)
	at sun.reflect.GeneratedMethodAccessor6.invoke(Unknown Source)
	at sun.reflect.DelegatingMethodAccessorImpl.invoke(DelegatingMethodAccessorImpl.java:43)
	at java.lang.reflect.Method.invoke(Method.java:498)
	at org.junit.runners.model.FrameworkMethod$1.runReflectiveCall(FrameworkMethod.java:59)
	at org.junit.internal.runners.model.ReflectiveCallable.run(ReflectiveCallable.java:12)
(30 more lines...)
java.lang.AssertionError: Test killed due to server failure
	at org.junit.Assert.fail(Assert.java:89)
	at org.openmrs.uitestframework.test.TestBase.startWebDriver(TestBase.java:127)
	at sun.reflect.GeneratedMethodAccessor6.invoke(Unknown Source)
	at sun.reflect.DelegatingMethodAccessorImpl.invoke(DelegatingMethodAccessorImpl.java:43)
	at java.lang.reflect.Method.invoke(Method.java:498)
	at org.junit.runners.model.FrameworkMethod$1.runReflectiveCall(FrameworkMethod.java:59)
	at org.junit.internal.runners.model.ReflectiveCallable.run(ReflectiveCallable.java:12)
(30 more lines...)
java.lang.AssertionError: Test killed due to server failure
	at org.junit.Assert.fail(Assert.java:89)
	at org.openmrs.uitestframework.test.TestBase.startWebDriver(TestBase.java:127)
	at sun.reflect.GeneratedMethodAccessor6.invoke(Unknown Source)
	at sun.reflect.DelegatingMethodAccessorImpl.invoke(DelegatingMethodAccessorImpl.java:43)
	at java.lang.reflect.Method.invoke(Method.java:498)
	at org.junit.runners.model.FrameworkMethod$1.runReflectiveCall(FrameworkMethod.java:59)
	at org.junit.internal.runners.model.ReflectiveCallable.run(ReflectiveCallable.java:12)
(30 more lines...)
java.lang.AssertionError: Test killed due to server failure
	at org.junit.Assert.fail(Assert.java:89)
	at org.openmrs.uitestframework.test.TestBase.startWebDriver(TestBase.java:127)
	at sun.reflect.NativeMethodAccessorImpl.invoke0(Native Method)
	at sun.reflect.NativeMethodAccessorImpl.invoke(NativeMethodAccessorImpl.java:62)
	at sun.reflect.DelegatingMethodAccessorImpl.invoke(DelegatingMethodAccessorImpl.java:43)
	at java.lang.reflect.Method.invoke(Method.java:498)
	at org.junit.runners.model.FrameworkMethod$1.runReflectiveCall(FrameworkMethod.java:59)
(31 more lines...)
java.lang.AssertionError: Test killed due to server failure
	at org.junit.Assert.fail(Assert.java:89)
	at org.openmrs.uitestframework.test.TestBase.startWebDriver(TestBase.java:127)
	at sun.reflect.GeneratedMethodAccessor6.invoke(Unknown Source)
	at sun.reflect.DelegatingMethodAccessorImpl.invoke(DelegatingMethodAccessorImpl.java:43)
	at java.lang.reflect.Method.invoke(Method.java:498)
	at org.junit.runners.model.FrameworkMethod$1.runReflectiveCall(FrameworkMethod.java:59)
	at org.junit.internal.runners.model.ReflectiveCallable.run(ReflectiveCallable.java:12)
(30 more lines...)
java.lang.AssertionError: Test killed due to server failure
	at org.junit.Assert.fail(Assert.java:89)
	at org.openmrs.uitestframework.test.TestBase.startWebDriver(TestBase.java:127)
	at sun.reflect.GeneratedMethodAccessor6.invoke(Unknown Source)
	at sun.reflect.DelegatingMethodAccessorImpl.invoke(DelegatingMethodAccessorImpl.java:43)
	at java.lang.reflect.Method.invoke(Method.java:498)
	at org.junit.runners.model.FrameworkMethod$1.runReflectiveCall(FrameworkMethod.java:59)
	at org.junit.internal.runners.model.ReflectiveCallable.run(ReflectiveCallable.java:12)
(30 more lines...)