UI tests for the reference application

Build: #69 failed Rebuilt by Kaweesi Joseph

Build result summary

Details

Completed
Duration
9 minutes
Labels
None
Revisions
Distribution
704f6569ddbdd785671377f9e288979fee72b11a 704f6569ddbdd785671377f9e288979fee72b11a
UI Test Framework
d5a413fa08d2aaaa2f29c194e50eb343c2d26190 d5a413fa08d2aaaa2f29c194e50eb343c2d26190
Total tests
38
Fixed in
#70 (Manual run by Kaweesi Joseph)
Number of retries
2

Tests

Responsible

Code commits

Distribution
Author Commit Message Commit date
k-joseph <kaweesi.joseph2012@gmail.com> k-joseph <kaweesi.joseph2012@gmail.com> 704f6569ddbdd785671377f9e288979fee72b11a 704f6569ddbdd785671377f9e288979fee72b11a Merge pull request #345 from kdaud/RATEST-96
RATEST-96: Fixing End Visit Test
k-joseph <kaweesi.joseph2012@gmail.com> k-joseph <kaweesi.joseph2012@gmail.com> 629d3849f0b7f9aee32a7ff83904a3d441552eff 629d3849f0b7f9aee32a7ff83904a3d441552eff Merge pull request #334 from HerbertYiga/RATEST-97
RATEST-97:Fix AddDiagnosisToVisitNoteTest
Kakumirizi Daud Kakumirizi Daud 0168e132d27a64b18ce44ebb9bf36d92a4e085be 0168e132d27a64b18ce44ebb9bf36d92a4e085be RATEST-96: Fix End Visit Test
HerbertYiga <herbertyiga24@gmail.com> HerbertYiga <herbertyiga24@gmail.com> ae17c391078a92a395292361b728ce2f3b55f5ca ae17c391078a92a395292361b728ce2f3b55f5ca RATEST-97:Fix AddDiagnosisToVisitNoteTest

Tests

New test failures 2
Status Test View job Duration
Collapse Failed AddDiagnosisToVisitNoteTest AddDiagnosisToVisitNoteTest History
Run QA UI Tests 2 mins
org.openqa.selenium.TimeoutException: Expected condition failed: waiting for visibility of element located by By.id: selected-location (tried for 120 second(s) with 500 milliseconds interval) Build info: version: '4.0.0-alpha-6', revision: '5f43a29cfc' System info: host: 'yak', ip: '127.0.0.1', os.name: 'Linux', os.arch: 'amd64', os.version: '4.4.0-206-generic', java.version: '1.8.0_282' Driver info: org.openqa.selenium.chrome.ChromeDriver Capabilities {acceptInsecureCerts: false, browserName: chrome, browserVersion: 89.0.4389.90, chrome: {chromedriverVersion: 89.0.4389.23 (61b08ee2c5002..., userDataDir: /tmp/.com.google.Chrome.Hau5S9}, goog:chromeOptions: {debuggerAddress: localhost:39045}, javascriptEnabled: true, networkConnectionEnabled: false, pageLoadStrategy: normal, platform: LINUX, platformName: LINUX, proxy: Proxy(), setWindowRect: true, strictFileInteractability: false, timeouts: {implicit: 0, pageLoad: 300000, script: 30000}, unhandledPromptBehavior: dismiss and notify, webauthn:extension:largeBlob: true, webauthn:virtualAuthenticators: true} Session ID: f2c84bb3168c62d7bdcf43ea5f565a8c
org.openqa.selenium.TimeoutException: Expected condition failed: waiting for visibility of element located by By.id: selected-location (tried for 120 second(s) with 500 milliseconds interval)
Build info: version: '4.0.0-alpha-6', revision: '5f43a29cfc'
System info: host: 'yak', ip: '127.0.0.1', os.name: 'Linux', os.arch: 'amd64', os.version: '4.4.0-206-generic', java.version: '1.8.0_282'
Driver info: org.openqa.selenium.chrome.ChromeDriver
Capabilities {acceptInsecureCerts: false, browserName: chrome, browserVersion: 89.0.4389.90, chrome: {chromedriverVersion: 89.0.4389.23 (61b08ee2c5002..., userDataDir: /tmp/.com.google.Chrome.Hau5S9}, goog:chromeOptions: {debuggerAddress: localhost:39045}, javascriptEnabled: true, networkConnectionEnabled: false, pageLoadStrategy: normal, platform: LINUX, platformName: LINUX, proxy: Proxy(), setWindowRect: true, strictFileInteractability: false, timeouts: {implicit: 0, pageLoad: 300000, script: 30000}, unhandledPromptBehavior: dismiss and notify, webauthn:extension:largeBlob: true, webauthn:virtualAuthenticators: true}
Session ID: f2c84bb3168c62d7bdcf43ea5f565a8c
	at org.openqa.selenium.support.ui.WebDriverWait.timeoutException(WebDriverWait.java:138)
(3 more lines...)
Collapse Failed EndVisitTest EndVisitTest History
Run QA UI Tests 2 mins
org.openqa.selenium.TimeoutException: Expected condition failed: waiting for visibility of element located by By.id: selected-location (tried for 120 second(s) with 500 milliseconds interval) Build info: version: '4.0.0-alpha-6', revision: '5f43a29cfc' System info: host: 'yak', ip: '127.0.0.1', os.name: 'Linux', os.arch: 'amd64', os.version: '4.4.0-206-generic', java.version: '1.8.0_282' Driver info: org.openqa.selenium.chrome.ChromeDriver Capabilities {acceptInsecureCerts: false, browserName: chrome, browserVersion: 89.0.4389.90, chrome: {chromedriverVersion: 89.0.4389.23 (61b08ee2c5002..., userDataDir: /tmp/.com.google.Chrome.fELIfc}, goog:chromeOptions: {debuggerAddress: localhost:44648}, javascriptEnabled: true, networkConnectionEnabled: false, pageLoadStrategy: normal, platform: LINUX, platformName: LINUX, proxy: Proxy(), setWindowRect: true, strictFileInteractability: false, timeouts: {implicit: 0, pageLoad: 300000, script: 30000}, unhandledPromptBehavior: dismiss and notify, webauthn:extension:largeBlob: true, webauthn:virtualAuthenticators: true} Session ID: d0a1d4f90618af8f2cdf7bfcbb88230e
org.openqa.selenium.TimeoutException: Expected condition failed: waiting for visibility of element located by By.id: selected-location (tried for 120 second(s) with 500 milliseconds interval)
Build info: version: '4.0.0-alpha-6', revision: '5f43a29cfc'
System info: host: 'yak', ip: '127.0.0.1', os.name: 'Linux', os.arch: 'amd64', os.version: '4.4.0-206-generic', java.version: '1.8.0_282'
Driver info: org.openqa.selenium.chrome.ChromeDriver
Capabilities {acceptInsecureCerts: false, browserName: chrome, browserVersion: 89.0.4389.90, chrome: {chromedriverVersion: 89.0.4389.23 (61b08ee2c5002..., userDataDir: /tmp/.com.google.Chrome.fELIfc}, goog:chromeOptions: {debuggerAddress: localhost:44648}, javascriptEnabled: true, networkConnectionEnabled: false, pageLoadStrategy: normal, platform: LINUX, platformName: LINUX, proxy: Proxy(), setWindowRect: true, strictFileInteractability: false, timeouts: {implicit: 0, pageLoad: 300000, script: 30000}, unhandledPromptBehavior: dismiss and notify, webauthn:extension:largeBlob: true, webauthn:virtualAuthenticators: true}
Session ID: d0a1d4f90618af8f2cdf7bfcbb88230e
	at org.openqa.selenium.support.ui.WebDriverWait.timeoutException(WebDriverWait.java:138)
(3 more lines...)

Jira issues

IssueDescriptionStatus
Unknown Issue TypeRATEST-96Could not obtain issue details from Jira
Unknown Issue TypeRATEST-97Could not obtain issue details from Jira