UI tests for the reference application

Build: #69 failed Rebuilt by Kaweesi Joseph

Logs

The following logs have been generated by the jobs in this plan.
  • Expand all
  • Collapse all
Job Logs
Collapse Run QA UI Tests Ref App UI Testing Download or View
31-Mar-2021 13:25:13 [INFO] Reactor Summary:
31-Mar-2021 13:25:13 [INFO]
31-Mar-2021 13:25:13 [INFO] Reference Application Distribution ................. SUCCESS [  0.252 s]
31-Mar-2021 13:25:13 [INFO] Reference Application Distribution Package ......... SUCCESS [01:42 min]
31-Mar-2021 13:25:13 [INFO] Reference Application Distribution UI Tests ........ FAILURE [06:49 min]
31-Mar-2021 13:25:13 [INFO] ------------------------------------------------------------------------
31-Mar-2021 13:25:13 [INFO] BUILD FAILURE
31-Mar-2021 13:25:13 [INFO] ------------------------------------------------------------------------
31-Mar-2021 13:25:13 [INFO] Total time: 08:32 min
31-Mar-2021 13:25:13 [INFO] Finished at: 2021-03-31T13:25:13+00:00
31-Mar-2021 13:25:13 [INFO] Final Memory: 60M/414M
31-Mar-2021 13:25:13 [INFO] ------------------------------------------------------------------------
31-Mar-2021 13:25:13 [ERROR] Failed to execute goal org.apache.maven.plugins:maven-surefire-plugin:2.12:test (default-test) on project referenceapplication-ui-tests: There are test failures.
31-Mar-2021 13:25:13 [ERROR]
31-Mar-2021 13:25:13 [ERROR] Please refer to /home/bamboo-agent/bamboo-agent/xml-data/build-dir/REFAPP-UI-FRAMEWORK/ui-tests/target/surefire-reports for the individual test results.
31-Mar-2021 13:25:13 [ERROR] -> [Help 1]
31-Mar-2021 13:25:13 [ERROR]
31-Mar-2021 13:25:13 [ERROR] To see the full stack trace of the errors, re-run Maven with the -e switch.
31-Mar-2021 13:25:13 [ERROR] Re-run Maven using the -X switch to enable full debug logging.
31-Mar-2021 13:25:13 [ERROR]
31-Mar-2021 13:25:13 [ERROR] For more information about the errors and possible solutions, please read the following articles:
31-Mar-2021 13:25:13 [ERROR] [Help 1] http://cwiki.apache.org/confluence/display/MAVEN/MojoFailureException
31-Mar-2021 13:25:13 [ERROR]
31-Mar-2021 13:25:13 [ERROR] After correcting the problems, you can resume the build with the command
31-Mar-2021 13:25:13 [ERROR]   mvn <goals> -rf :referenceapplication-ui-tests