UI tests for the reference application

Build: #69 failed Rebuilt by Kaweesi Joseph

Test results

  • 38 tests in total
  • 2 tests failed
  • 2 failures are new
  • 17 tests were quarantined / skipped
  • 6 minutes taken in total.
New test failures 2
Status Test View job Duration
Collapse Failed AddDiagnosisToVisitNoteTest AddDiagnosisToVisitNoteTest History
Run QA UI Tests 2 mins
org.openqa.selenium.TimeoutException: Expected condition failed: waiting for visibility of element located by By.id: selected-location (tried for 120 second(s) with 500 milliseconds interval) Build info: version: '4.0.0-alpha-6', revision: '5f43a29cfc' System info: host: 'yak', ip: '127.0.0.1', os.name: 'Linux', os.arch: 'amd64', os.version: '4.4.0-206-generic', java.version: '1.8.0_282' Driver info: org.openqa.selenium.chrome.ChromeDriver Capabilities {acceptInsecureCerts: false, browserName: chrome, browserVersion: 89.0.4389.90, chrome: {chromedriverVersion: 89.0.4389.23 (61b08ee2c5002..., userDataDir: /tmp/.com.google.Chrome.Hau5S9}, goog:chromeOptions: {debuggerAddress: localhost:39045}, javascriptEnabled: true, networkConnectionEnabled: false, pageLoadStrategy: normal, platform: LINUX, platformName: LINUX, proxy: Proxy(), setWindowRect: true, strictFileInteractability: false, timeouts: {implicit: 0, pageLoad: 300000, script: 30000}, unhandledPromptBehavior: dismiss and notify, webauthn:extension:largeBlob: true, webauthn:virtualAuthenticators: true} Session ID: f2c84bb3168c62d7bdcf43ea5f565a8c
org.openqa.selenium.TimeoutException: Expected condition failed: waiting for visibility of element located by By.id: selected-location (tried for 120 second(s) with 500 milliseconds interval)
Build info: version: '4.0.0-alpha-6', revision: '5f43a29cfc'
System info: host: 'yak', ip: '127.0.0.1', os.name: 'Linux', os.arch: 'amd64', os.version: '4.4.0-206-generic', java.version: '1.8.0_282'
Driver info: org.openqa.selenium.chrome.ChromeDriver
Capabilities {acceptInsecureCerts: false, browserName: chrome, browserVersion: 89.0.4389.90, chrome: {chromedriverVersion: 89.0.4389.23 (61b08ee2c5002..., userDataDir: /tmp/.com.google.Chrome.Hau5S9}, goog:chromeOptions: {debuggerAddress: localhost:39045}, javascriptEnabled: true, networkConnectionEnabled: false, pageLoadStrategy: normal, platform: LINUX, platformName: LINUX, proxy: Proxy(), setWindowRect: true, strictFileInteractability: false, timeouts: {implicit: 0, pageLoad: 300000, script: 30000}, unhandledPromptBehavior: dismiss and notify, webauthn:extension:largeBlob: true, webauthn:virtualAuthenticators: true}
Session ID: f2c84bb3168c62d7bdcf43ea5f565a8c
	at org.openqa.selenium.support.ui.WebDriverWait.timeoutException(WebDriverWait.java:138)
(3 more lines...)
Collapse Failed EndVisitTest EndVisitTest History
Run QA UI Tests 2 mins
org.openqa.selenium.TimeoutException: Expected condition failed: waiting for visibility of element located by By.id: selected-location (tried for 120 second(s) with 500 milliseconds interval) Build info: version: '4.0.0-alpha-6', revision: '5f43a29cfc' System info: host: 'yak', ip: '127.0.0.1', os.name: 'Linux', os.arch: 'amd64', os.version: '4.4.0-206-generic', java.version: '1.8.0_282' Driver info: org.openqa.selenium.chrome.ChromeDriver Capabilities {acceptInsecureCerts: false, browserName: chrome, browserVersion: 89.0.4389.90, chrome: {chromedriverVersion: 89.0.4389.23 (61b08ee2c5002..., userDataDir: /tmp/.com.google.Chrome.fELIfc}, goog:chromeOptions: {debuggerAddress: localhost:44648}, javascriptEnabled: true, networkConnectionEnabled: false, pageLoadStrategy: normal, platform: LINUX, platformName: LINUX, proxy: Proxy(), setWindowRect: true, strictFileInteractability: false, timeouts: {implicit: 0, pageLoad: 300000, script: 30000}, unhandledPromptBehavior: dismiss and notify, webauthn:extension:largeBlob: true, webauthn:virtualAuthenticators: true} Session ID: d0a1d4f90618af8f2cdf7bfcbb88230e
org.openqa.selenium.TimeoutException: Expected condition failed: waiting for visibility of element located by By.id: selected-location (tried for 120 second(s) with 500 milliseconds interval)
Build info: version: '4.0.0-alpha-6', revision: '5f43a29cfc'
System info: host: 'yak', ip: '127.0.0.1', os.name: 'Linux', os.arch: 'amd64', os.version: '4.4.0-206-generic', java.version: '1.8.0_282'
Driver info: org.openqa.selenium.chrome.ChromeDriver
Capabilities {acceptInsecureCerts: false, browserName: chrome, browserVersion: 89.0.4389.90, chrome: {chromedriverVersion: 89.0.4389.23 (61b08ee2c5002..., userDataDir: /tmp/.com.google.Chrome.fELIfc}, goog:chromeOptions: {debuggerAddress: localhost:44648}, javascriptEnabled: true, networkConnectionEnabled: false, pageLoadStrategy: normal, platform: LINUX, platformName: LINUX, proxy: Proxy(), setWindowRect: true, strictFileInteractability: false, timeouts: {implicit: 0, pageLoad: 300000, script: 30000}, unhandledPromptBehavior: dismiss and notify, webauthn:extension:largeBlob: true, webauthn:virtualAuthenticators: true}
Session ID: d0a1d4f90618af8f2cdf7bfcbb88230e
	at org.openqa.selenium.support.ui.WebDriverWait.timeoutException(WebDriverWait.java:138)
(3 more lines...)
Skipped tests 17
Status Test Failing since View job
Skipped AddEditAppointmentBlockTest org.openmrs.reference.AddEditAppointmentBlockTest History
Run QA UI Tests
Skipped AddFormTest addFormTest History
Run QA UI Tests
Skipped AddPatientAppointmentTest addPatientAppointmentTest History
Run QA UI Tests
Skipped BookRequestAppointmentTest bookRequestAppointmentTest History
Run QA UI Tests
Skipped ContactInfoTest contactInfoTest History
Run QA UI Tests
Skipped DeleteAppointmentBlockTest org.openmrs.reference.DeleteAppointmentBlockTest History
Run QA UI Tests
Skipped DeleteFormTest deleteFormTest History
Run QA UI Tests
Skipped DeleteRequestAppointmentTest deleteRequestAppointmentTest History
Run QA UI Tests
Skipped EditFormTest EditFormTest History
Run QA UI Tests
Skipped EyeReportTest eyeReportTest History
Run QA UI Tests
Skipped LoginTest org.openmrs.reference.LoginTest History
Run QA UI Tests
Skipped MergeVisitsTest mergeVisitsTest History
Run QA UI Tests
Skipped TransferToWardServiceTest transferToWardServiceTest History
Run QA UI Tests
Skipped UnidentifiedPatientKeyboardTest registerUnidentifiedPatient History
Run QA UI Tests
Skipped UsingBackButtonInMergePatientTest usingBackButtonInMergePatientTest History
Run QA UI Tests
Skipped VisitNoteTest VisitNoteTest History
Run QA UI Tests
Skipped XSSOnPhoneNumberFieldTest XSSOnPhoneNumberFieldTest History
Run QA UI Tests