UI tests for the reference application

Build: #255 failed

Job: Run QA UI Tests failed

Stages & jobs

  1. Ref App UI Testing

Job result summary

Completed
Duration
11 minutes
Agent
yokobue.openmrs.org
Revisions
Distribution
1c6c4295a070119abba7df8b6a08cf47b34808e2 1c6c4295a070119abba7df8b6a08cf47b34808e2
UI Test Framework
c6b058290b27cada9379f09d9075f63735d2f321 c6b058290b27cada9379f09d9075f63735d2f321
Total tests
53
Fixed in
#262 (Code changes detected)

Tests

  • 53 tests in total
  • 2 tests failed
  • 2 failures are new
  • 16 tests were quarantined / skipped
  • 9 minutes taken in total.
New test failures 2
Status Test Duration
Collapse Failed AddPastVisitTest addPastVisitTest History
2 mins
org.openqa.selenium.remote.UnreachableBrowserException: Error communicating with the remote browser. It may have died. Build info: version: '4.0.0-alpha-6', revision: '5f43a29cfc' System info: host: 'yokobue', ip: '127.0.0.1', os.name: 'Linux', os.arch: 'amd64', os.version: '4.4.0-210-generic', java.version: '1.8.0_292' Driver info: driver.version: RemoteWebDriver Capabilities {acceptInsecureCerts: false, browserName: chrome, browserVersion: 90.0.4430.72, chrome: {chromedriverVersion: 90.0.4430.24 (4c6d850f087da..., userDataDir: /tmp/.com.google.Chrome.u3s9IZ}, goog:chromeOptions: {debuggerAddress: localhost:42829}, javascriptEnabled: true, networkConnectionEnabled: false, pageLoadStrategy: normal, platform: LINUX, platformName: LINUX, proxy: Proxy(), setWindowRect: true, strictFileInteractability: false, timeouts: {implicit: 0, pageLoad: 300000, script: 30000}, unhandledPromptBehavior: dismiss and notify, webauthn:extension:largeBlob: true, webauthn:virtualAuthenticators: true} Session ID: 4b406727afa254ae795a88b1faef8d9c
org.openqa.selenium.remote.UnreachableBrowserException: Error communicating with the remote browser. It may have died.
Build info: version: '4.0.0-alpha-6', revision: '5f43a29cfc'
System info: host: 'yokobue', ip: '127.0.0.1', os.name: 'Linux', os.arch: 'amd64', os.version: '4.4.0-210-generic', java.version: '1.8.0_292'
Driver info: driver.version: RemoteWebDriver
Capabilities {acceptInsecureCerts: false, browserName: chrome, browserVersion: 90.0.4430.72, chrome: {chromedriverVersion: 90.0.4430.24 (4c6d850f087da..., userDataDir: /tmp/.com.google.Chrome.u3s9IZ}, goog:chromeOptions: {debuggerAddress: localhost:42829}, javascriptEnabled: true, networkConnectionEnabled: false, pageLoadStrategy: normal, platform: LINUX, platformName: LINUX, proxy: Proxy(), setWindowRect: true, strictFileInteractability: false, timeouts: {implicit: 0, pageLoad: 300000, script: 30000}, unhandledPromptBehavior: dismiss and notify, webauthn:extension:largeBlob: true, webauthn:virtualAuthenticators: true}
Session ID: 4b406727afa254ae795a88b1faef8d9c
	at org.openqa.selenium.remote.RemoteWebDriver.execute(RemoteWebDriver.java:603)
(35 more lines...)
Collapse Failed RecordMergeIssueTest recordMergeIssueTest History
2 mins
org.openqa.selenium.TimeoutException: Expected condition failed: waiting for visibility of element located by By.className: logout (tried for 120 second(s) with 500 milliseconds interval) Build info: version: '4.0.0-alpha-6', revision: '5f43a29cfc' System info: host: 'yokobue', ip: '127.0.0.1', os.name: 'Linux', os.arch: 'amd64', os.version: '4.4.0-210-generic', java.version: '1.8.0_292' Driver info: org.openqa.selenium.chrome.ChromeDriver Capabilities {acceptInsecureCerts: false, browserName: chrome, browserVersion: 90.0.4430.72, chrome: {chromedriverVersion: 90.0.4430.24 (4c6d850f087da..., userDataDir: /tmp/.com.google.Chrome.HzU5fX}, goog:chromeOptions: {debuggerAddress: localhost:45584}, javascriptEnabled: true, networkConnectionEnabled: false, pageLoadStrategy: normal, platform: LINUX, platformName: LINUX, proxy: Proxy(), setWindowRect: true, strictFileInteractability: false, timeouts: {implicit: 0, pageLoad: 300000, script: 30000}, unhandledPromptBehavior: dismiss and notify, webauthn:extension:largeBlob: true, webauthn:virtualAuthenticators: true} Session ID: 053c680c3a93a9591b03561df06213b5
org.openqa.selenium.TimeoutException: Expected condition failed: waiting for visibility of element located by By.className: logout (tried for 120 second(s) with 500 milliseconds interval)
Build info: version: '4.0.0-alpha-6', revision: '5f43a29cfc'
System info: host: 'yokobue', ip: '127.0.0.1', os.name: 'Linux', os.arch: 'amd64', os.version: '4.4.0-210-generic', java.version: '1.8.0_292'
Driver info: org.openqa.selenium.chrome.ChromeDriver
Capabilities {acceptInsecureCerts: false, browserName: chrome, browserVersion: 90.0.4430.72, chrome: {chromedriverVersion: 90.0.4430.24 (4c6d850f087da..., userDataDir: /tmp/.com.google.Chrome.HzU5fX}, goog:chromeOptions: {debuggerAddress: localhost:45584}, javascriptEnabled: true, networkConnectionEnabled: false, pageLoadStrategy: normal, platform: LINUX, platformName: LINUX, proxy: Proxy(), setWindowRect: true, strictFileInteractability: false, timeouts: {implicit: 0, pageLoad: 300000, script: 30000}, unhandledPromptBehavior: dismiss and notify, webauthn:extension:largeBlob: true, webauthn:virtualAuthenticators: true}
Session ID: 053c680c3a93a9591b03561df06213b5
	at org.openqa.selenium.support.ui.WebDriverWait.timeoutException(WebDriverWait.java:138)
(3 more lines...)