UI tests for the reference application

Build: #399 failed

Job: Run QA UI Tests failed

Stages & jobs

  1. Ref App UI Testing

Build log

The build generated 1,052 lines of output.The output is too long and has been truncated to the last 1,000 lines. Download or view full build log

02-Aug-2021 21:44:45 [PredatorPreBuildAction] Deleting folder /home/bamboo-agent/bamboo-agent/xml-data/build-dir/TRAN-AREV-JOB1
02-Aug-2021 21:44:45 [PredatorPreBuildAction] Deleting folder /home/bamboo-agent/bamboo-agent/xml-data/build-dir/OCL-OCLAPI2-BO
02-Aug-2021 21:44:45 [PredatorPreBuildAction] Deleting 0 snapshot folders from /home/bamboo-agent/.m2/repository
02-Aug-2021 21:44:45 [PredatorPreBuildAction] Maven snapshot disk freed: 0 GB
02-Aug-2021 21:44:46 [PredatorPreBuildAction] 0 empty artifacts were found and deleted by Predator
02-Aug-2021 21:44:46 [PredatorPreBuildAction] Maven stable disk freed: 0.0 GB, deleted 0 files
02-Aug-2021 21:44:46 [PredatorPreBuildAction] File /home/bamboo-agent/.npmrc does not exist.
02-Aug-2021 21:44:46 [PredatorPreBuildAction] File /home/bamboo-agent/.docker/config.json does not exist.
02-Aug-2021 21:44:46 [PredatorPreBuildAction] File /home/bamboo-agent/.OpenMRS/liquibaseUpdateLogs.txt does not exist.
02-Aug-2021 21:44:46 [PredatorPreBuildAction] Final free space: 5.051361 GB
02-Aug-2021 21:44:46 [PredatorPreBuildAction] Done
02-Aug-2021 21:44:46 Starting task 'Build uitestframework' of type 'com.atlassian.bamboo.plugins.maven:task.builder.mvn3'
02-Aug-2021 21:44:46
Beginning to execute external process for build 'Reference Application - UI - Run QA UI Tests #399 (REFAPP-UI-FRAMEWORK-399)'
... running command line:
/usr/share/apache-maven-3.3.9/bin/mvn --batch-mode -Djava.io.tmpdir=/home/bamboo-agent/bamboo-agent/.agent_tmp/REFAPP-UI-FRAMEWORK clean install
... in: /home/bamboo-agent/bamboo-agent/xml-data/build-dir/REFAPP-UI-FRAMEWORK
... using extra environment variables:
bamboo_planRepository_1_branch=master
bamboo_capability_system_builder_grailsBuilder_Grails_2_3_7=/opt/grails
bamboo_planRepository_2_branch=master
bamboo_planRepository_1_branchDisplayName=master
bamboo_repository_revision_number=c47ad85be992c00ecf51b913876d117a56e7e643
MAVEN2_HOME=/usr/share/apache-maven-3.3.9
bamboo_saucelabs_username=rkorytkowski
bamboo_repository_207388681_previous_revision_number=17664014f2e1732fa798ce946c649bf568461c1f
bamboo_buildKey=REFAPP-UI-FRAMEWORK
bamboo_DISPLAY=10
bamboo_maven_release_version=2.8.0
bamboo_planRepository_2_branchDisplayName=master
bamboo_repository_207388681_name=Distribution
bamboo_shortJobName=Run QA UI Tests
bamboo_buildResultsUrl=https://ci.openmrs.org/browse/REFAPP-UI-FRAMEWORK-399
bamboo_planRepository_repositoryUrl=git://github.com/openmrs/openmrs-distro-referenceapplication.git
bamboo_agentId=189792258
bamboo_maven_development_version=
bamboo_capability_system_jdk_JDK_8=/usr/lib/jvm/java-8-openjdk-amd64
bamboo_planRepository_revision=c47ad85be992c00ecf51b913876d117a56e7e643
bamboo_planRepository_previousRevision=17664014f2e1732fa798ce946c649bf568461c1f
bamboo_capability_system_jdk_JDK_1_8_0_265=/usr/lib/jvm/java-1.8.0-openjdk-amd64/
bamboo_repository_branch_name=master
bamboo_dockerhub_username=openmrsci
bamboo_refapp_distro_scm=git@github.com:openmrs/openmrs-distro-referenceapplication.git
bamboo_repository_207388681_branch_name=master
JAVA_HOME=/usr/lib/jvm/java-1.8.0-openjdk-amd64/
bamboo_repository_207388680_branch_name=master
bamboo_repository_207388681_git_username=
bamboo_planRepository_branch=master
bamboo_repository_207388681_revision_number=c47ad85be992c00ecf51b913876d117a56e7e643
bamboo_capability_system_jdk_JDK_1_8_0_275=/usr/lib/jvm/java-1.8.0-openjdk-amd64/
bamboo_capability_system_jdk_JDK_1_8_0_272=/usr/lib/jvm/java-1.8.0-openjdk-amd64/
bamboo_capability_system_jdk_JDK_11=/usr/lib/jvm/java-11-openjdk-amd64
bamboo_planRepository_1_type=gitv2
bamboo_planRepository_branchName=master
bamboo_saucelabs_password=********
bamboo_capability_system_jdk_JDK=/usr/lib/jvm/java-1.8.0-openjdk-amd64/
bamboo_mavenBuildGoals=clean install
bamboo_hg_cache_directory=/home/bamboo-agent/bamboo-agent/xml-data/build-dir/_hg-repositories-cache
bamboo_planRepository_1_username=
bamboo_planRepository_type=gitv2
bamboo_git_cache_directory=/home/bamboo-agent/bamboo-agent/xml-data/build-dir/_git-repositories-cache
bamboo_planRepository_2_branchName=master
useMavenReturnCode=false
bamboo_capability_system_builder_node_Node_js=/usr/bin/node
bamboo_travis_password=********
bamboo_capability_system_builder_mvn3_Maven_3=/usr/share/apache-maven-3.3.9
bamboo_tmp_directory=/home/bamboo-agent/bamboo-agent/temp
bamboo_planKey=REFAPP-UI
bamboo_capability_system_builder_command_nvm=nvm
bamboo_planRepository_username=
bamboo_capability_system_jdk_JDK_1_8_0_282=/usr/lib/jvm/java-1.8.0-openjdk-amd64/
bamboo_planRepository_1_branchName=master
bamboo_dockerhub_password=********
bamboo_resultsUrl=https://ci.openmrs.org/browse/REFAPP-UI-FRAMEWORK-399
bamboo_capability_system_builder_command_transifex=/usr/bin/tx
bamboo_jdbc_password=********
bamboo_build_working_directory=/home/bamboo-agent/bamboo-agent/xml-data/build-dir/REFAPP-UI-FRAMEWORK
bamboo_planRepository_1_name=Distribution
bamboo_capability_system_jdk_JDK_1_8_0_292=/usr/lib/jvm/java-1.8.0-openjdk-amd64/
bamboo_preparing_refapp_distro_release=false
bamboo_shortPlanName=UI
bamboo_planRepository_2_username=
bamboo_planRepository_name=Distribution
bamboo_docs_aws_secret_key=********
bamboo_buildNumber=399
bamboo_repository_207388680_git_username=
bamboo_repository_207388681_git_repositoryUrl=git://github.com/openmrs/openmrs-distro-referenceapplication.git
bamboo_planName=Reference Application - UI
bamboo_shortPlanKey=UI
bamboo_shortJobKey=FRAMEWORK
bamboo_planRepository_2_name=UI Test Framework
bamboo_buildTimeStamp=2021-08-02T21:44:38.906Z
bamboo_repository_previous_revision_number=17664014f2e1732fa798ce946c649bf568461c1f
M2_HOME=/usr/share/apache-maven-3.3.9
bamboo_refapp_bamboo_build_number=
bamboo_repository_git_branch=master
bamboo_buildResultKey=REFAPP-UI-FRAMEWORK-399
bamboo_docs_aws_access_key=AKIAI7KMDL5KP2673G7A
bamboo_buildPlanName=Reference Application - UI - Run QA UI Tests
bamboo_openMRSVersion=2.1.3
bamboo_planRepository_1_revision=c47ad85be992c00ecf51b913876d117a56e7e643
bamboo_repository_207388680_git_repositoryUrl=git://github.com/openmrs/openmrs-contrib-uitestframework.git
bamboo_repository_name=UI Test Framework
bamboo_capability_system_jdk_openjdk_8_jdk=/usr/lib/jvm/java-8-openjdk-amd64
bamboo_planRepository_2_previousRevision=53261933a53762e3aa2703469b8abd666b6c5184
bamboo_transifex_password=********
bamboo_repository_207388680_name=UI Test Framework
bamboo_capability_system_jdk_openjdk_11_jdk=/usr/lib/jvm/java-11-openjdk-amd64
bamboo_repository_207388680_previous_revision_number=53261933a53762e3aa2703469b8abd666b6c5184
bamboo_buildFailed=false
bamboo_capability_system_builder_grailsBuilder_Grails_2=/opt/grails
bamboo_capability_system_docker_executable=/usr/bin/docker
bamboo_capability_system_builder_command_Bash=/bin/bash
bamboo_agentWorkingDirectory=/home/bamboo-agent/bamboo-agent/xml-data/build-dir
bamboo_planRepository_2_revision=53261933a53762e3aa2703469b8abd666b6c5184
bamboo_capability_system_git_executable=/usr/bin/git
bamboo_repository_git_username=
bamboo_planRepository_1_previousRevision=17664014f2e1732fa798ce946c649bf568461c1f
bamboo_planRepository_branchDisplayName=master
bamboo_planRepository_2_type=gitv2
bamboo_plan_storageTag=plan-207093778
bamboo_repository_207388680_git_branch=master
bamboo_planRepository_2_repositoryUrl=git://github.com/openmrs/openmrs-contrib-uitestframework.git
bamboo_repository_git_repositoryUrl=git://github.com/openmrs/openmrs-distro-referenceapplication.git
bamboo_transifex_username=api
bamboo_refapp_distro_dev_branch=master
bamboo_working_directory=/home/bamboo-agent/bamboo-agent/xml-data/build-dir/REFAPP-UI-FRAMEWORK
bamboo_planRepository_1_repositoryUrl=git://github.com/openmrs/openmrs-distro-referenceapplication.git
bamboo_capability_system_jdk_JDK_1_8=/usr/lib/jvm/java-1.8.0-openjdk-amd64/
bamboo_repository_207388681_git_branch=master
bamboo_repository_207388680_revision_number=53261933a53762e3aa2703469b8abd666b6c5184
PATH=/usr/lib/jvm/java-1.8.0-openjdk-amd64//bin:/home/bamboo-agent/.nvm/versions/node/v10.22.1/bin:/home/bamboo-agent/bin:/home/bamboo-agent/.local/bin:/usr/local/sbin:/usr/local/bin:/usr/sbin:/usr/bin:/sbin:/bin:/usr/games:/usr/local/games:/snap/bin:/opt/puppetlabs/bin
02-Aug-2021 21:44:47 [INFO] Scanning for projects...
02-Aug-2021 21:44:47 [WARNING]
02-Aug-2021 21:44:47 [WARNING] Some problems were encountered while building the effective model for org.openmrs.contrib:uitestframework:jar:2.5.0-SNAPSHOT
02-Aug-2021 21:44:47 [WARNING] 'build.plugins.plugin.version' for org.apache.maven.plugins:maven-compiler-plugin is missing. @ line 125, column 21
02-Aug-2021 21:44:47 [WARNING]
02-Aug-2021 21:44:47 [WARNING] It is highly recommended to fix these problems because they threaten the stability of your build.
02-Aug-2021 21:44:47 [WARNING]
02-Aug-2021 21:44:47 [WARNING] For this reason, future Maven versions might no longer support building such malformed projects.
02-Aug-2021 21:44:47 [WARNING]
02-Aug-2021 21:44:47 [INFO]                                                                         
02-Aug-2021 21:44:47 [INFO] ------------------------------------------------------------------------
02-Aug-2021 21:44:47 [INFO] Building UI Test Framework 2.5.0-SNAPSHOT
02-Aug-2021 21:44:47 [INFO] ------------------------------------------------------------------------
02-Aug-2021 21:44:50 [INFO]
02-Aug-2021 21:44:50 [INFO] --- maven-clean-plugin:2.5:clean (default-clean) @ uitestframework ---
02-Aug-2021 21:44:50 [INFO]
02-Aug-2021 21:44:50 [INFO] --- maven-resources-plugin:2.6:resources (default-resources) @ uitestframework ---
02-Aug-2021 21:44:50 [WARNING] Using platform encoding (UTF-8 actually) to copy filtered resources, i.e. build is platform dependent!
02-Aug-2021 21:44:50 [INFO] Copying 5 resources
02-Aug-2021 21:44:50 [INFO]
02-Aug-2021 21:44:50 [INFO] --- maven-compiler-plugin:3.1:compile (default-compile) @ uitestframework ---
02-Aug-2021 21:44:50 [INFO] Changes detected - recompiling the module!
02-Aug-2021 21:44:50 [WARNING] File encoding has not been set, using platform encoding UTF-8, i.e. build is platform dependent!
02-Aug-2021 21:44:50 [INFO] Compiling 9 source files to /home/bamboo-agent/bamboo-agent/xml-data/build-dir/REFAPP-UI-FRAMEWORK/target/classes
02-Aug-2021 21:44:53 [WARNING] /home/bamboo-agent/bamboo-agent/xml-data/build-dir/REFAPP-UI-FRAMEWORK/src/main/java/org/openmrs/uitestframework/page/Page.java: Some input files use or override a deprecated API.
02-Aug-2021 21:44:53 [WARNING] /home/bamboo-agent/bamboo-agent/xml-data/build-dir/REFAPP-UI-FRAMEWORK/src/main/java/org/openmrs/uitestframework/page/Page.java: Recompile with -Xlint:deprecation for details.
02-Aug-2021 21:44:53 [INFO]
02-Aug-2021 21:44:53 [INFO] --- maven-resources-plugin:2.6:testResources (default-testResources) @ uitestframework ---
02-Aug-2021 21:44:53 [WARNING] Using platform encoding (UTF-8 actually) to copy filtered resources, i.e. build is platform dependent!
02-Aug-2021 21:44:53 [INFO] skip non existing resourceDirectory /home/bamboo-agent/bamboo-agent/xml-data/build-dir/REFAPP-UI-FRAMEWORK/src/test/resources
02-Aug-2021 21:44:53 [INFO]
02-Aug-2021 21:44:53 [INFO] --- maven-compiler-plugin:3.1:testCompile (default-testCompile) @ uitestframework ---
02-Aug-2021 21:44:53 [INFO] No sources to compile
02-Aug-2021 21:44:53 [INFO]
02-Aug-2021 21:44:53 [INFO] --- maven-surefire-plugin:2.12.4:test (default-test) @ uitestframework ---
02-Aug-2021 21:44:54 [INFO] No tests to run.
02-Aug-2021 21:44:54 [INFO]
02-Aug-2021 21:44:54 [INFO] --- maven-jar-plugin:2.4:jar (default-jar) @ uitestframework ---
02-Aug-2021 21:44:54 [INFO] Building jar: /home/bamboo-agent/bamboo-agent/xml-data/build-dir/REFAPP-UI-FRAMEWORK/target/uitestframework-2.5.0-SNAPSHOT.jar
02-Aug-2021 21:44:56 [INFO]
02-Aug-2021 21:44:56 [INFO] --- maven-install-plugin:2.4:install (default-install) @ uitestframework ---
02-Aug-2021 21:44:56 [INFO] Installing /home/bamboo-agent/bamboo-agent/xml-data/build-dir/REFAPP-UI-FRAMEWORK/target/uitestframework-2.5.0-SNAPSHOT.jar to /home/bamboo-agent/.m2/repository/org/openmrs/contrib/uitestframework/2.5.0-SNAPSHOT/uitestframework-2.5.0-SNAPSHOT.jar
02-Aug-2021 21:44:56 [INFO] Installing /home/bamboo-agent/bamboo-agent/xml-data/build-dir/REFAPP-UI-FRAMEWORK/pom.xml to /home/bamboo-agent/.m2/repository/org/openmrs/contrib/uitestframework/2.5.0-SNAPSHOT/uitestframework-2.5.0-SNAPSHOT.pom
02-Aug-2021 21:44:56 [INFO] ------------------------------------------------------------------------
02-Aug-2021 21:44:56 [INFO] BUILD SUCCESS
02-Aug-2021 21:44:56 [INFO] ------------------------------------------------------------------------
02-Aug-2021 21:44:56 [INFO] Total time: 9.233 s
02-Aug-2021 21:44:56 [INFO] Finished at: 2021-08-02T21:44:56+00:00
02-Aug-2021 21:44:56 [INFO] Final Memory: 25M/243M
02-Aug-2021 21:44:56 [INFO] ------------------------------------------------------------------------
02-Aug-2021 21:44:57 Finished task 'Build uitestframework' with result: Success
02-Aug-2021 21:44:57 Starting task 'Checkout distribution' of type 'com.atlassian.bamboo.plugins.vcs:task.vcs.checkout'
02-Aug-2021 21:44:57 Build always requires a clean checkout
02-Aug-2021 21:44:57 Cleaning build directory '/home/bamboo-agent/bamboo-agent/xml-data/build-dir/REFAPP-UI-FRAMEWORK'
02-Aug-2021 21:44:57 Checking out into /home/bamboo-agent/bamboo-agent/xml-data/build-dir/REFAPP-UI-FRAMEWORK
02-Aug-2021 21:44:57 Updating source code to revision: c47ad85be992c00ecf51b913876d117a56e7e643
02-Aug-2021 21:44:57 Enforcing full fetch as requested revision has not been found on the configured branch
02-Aug-2021 21:44:57 Creating local git repository in '/home/bamboo-agent/bamboo-agent/xml-data/build-dir/REFAPP-UI-FRAMEWORK/.git'.
02-Aug-2021 21:44:57 Initialized empty Git repository in /home/bamboo-agent/bamboo-agent/xml-data/build-dir/REFAPP-UI-FRAMEWORK/.git/
02-Aug-2021 21:44:57 Fetching 'refs/heads/*' from 'git://github.com/openmrs/openmrs-distro-referenceapplication.git'.
02-Aug-2021 21:44:59 From git://github.com/openmrs/openmrs-distro-referenceapplication
02-Aug-2021 21:44:59 * [new branch]      2.3.x      -> 2.3.x
02-Aug-2021 21:44:59 * [new branch]      2.6.x      -> 2.6.x
02-Aug-2021 21:44:59 * [new branch]      3.x        -> 3.x
02-Aug-2021 21:44:59 * [new branch]      3.x-npx-no-install -> 3.x-npx-no-install
02-Aug-2021 21:44:59 * [new branch]      master     -> master
02-Aug-2021 21:44:59 * [new branch]      msf        -> msf
02-Aug-2021 21:44:59 * [new branch]      platform-2.1.x -> platform-2.1.x
02-Aug-2021 21:44:59 * [new branch]      release    -> release
02-Aug-2021 21:44:59 * [new branch]      revert-204-OCLM-50 -> revert-204-OCLM-50
02-Aug-2021 21:44:59 * [new branch]      revert-214-RA-1320 -> revert-214-RA-1320
02-Aug-2021 21:44:59 * [new branch]      revert-272-RA-1818 -> revert-272-RA-1818
02-Aug-2021 21:44:59 * [new branch]      revert-273-sherrif10 -> revert-273-sherrif10
02-Aug-2021 21:44:59 * [new branch]      revert-294-fhir -> revert-294-fhir
02-Aug-2021 21:44:59 * [new branch]      revert-334-RATEST-97 -> revert-334-RATEST-97
02-Aug-2021 21:44:59 * [new branch]      revert-344-RATEST-110 -> revert-344-RATEST-110
02-Aug-2021 21:44:59 * [new branch]      revert-345-RATEST-96 -> revert-345-RATEST-96
02-Aug-2021 21:44:59 * [new branch]      revert-385-RATEST-135 -> revert-385-RATEST-135
02-Aug-2021 21:44:59 * [new branch]      revert-399-RATEST-145 -> revert-399-RATEST-145
02-Aug-2021 21:44:59 * [new branch]      revert-410-RATEST-145 -> revert-410-RATEST-145
02-Aug-2021 21:44:59 * [new branch]      revert-423-RATEST-93 -> revert-423-RATEST-93
02-Aug-2021 21:44:59 * [new branch]      revert-429-RATEST-112 -> revert-429-RATEST-112
02-Aug-2021 21:44:59 * [new branch]      revert-442-RATEST-85 -> revert-442-RATEST-85
02-Aug-2021 21:44:59 * [new branch]      revert-448-RATEST-143 -> revert-448-RATEST-143
02-Aug-2021 21:44:59 * [new branch]      revert-449-RATEST-145 -> revert-449-RATEST-145
02-Aug-2021 21:44:59 * [new branch]      revert-454-RATEST-135 -> revert-454-RATEST-135
02-Aug-2021 21:44:59 * [new branch]      revert-479-RATEST-93 -> revert-479-RATEST-93
02-Aug-2021 21:44:59 * [new branch]      samuelmale-patch-1 -> samuelmale-patch-1
02-Aug-2021 21:44:59 * [new branch]      samuelmale-patch-2 -> samuelmale-patch-2
02-Aug-2021 21:44:59 * [new branch]      samuelmale-patch-3 -> samuelmale-patch-3
02-Aug-2021 21:44:59 * [new branch]      uat        -> uat
02-Aug-2021 21:44:59 * [new tag]         2.0.1769   -> 2.0.1769
02-Aug-2021 21:44:59 * [new tag]         2.1        -> 2.1
02-Aug-2021 21:44:59 * [new tag]         2.10.0     -> 2.10.0
02-Aug-2021 21:44:59 * [new tag]         2.11.0     -> 2.11.0
02-Aug-2021 21:44:59 * [new tag]         2.2        -> 2.2
02-Aug-2021 21:44:59 * [new tag]         2.3        -> 2.3
02-Aug-2021 21:44:59 * [new tag]         2.3.1      -> 2.3.1
02-Aug-2021 21:44:59 * [new tag]         2.4        -> 2.4
02-Aug-2021 21:44:59 * [new tag]         2.5        -> 2.5
02-Aug-2021 21:44:59 * [new tag]         2.6.0      -> 2.6.0
02-Aug-2021 21:44:59 * [new tag]         2.6.1      -> 2.6.1
02-Aug-2021 21:44:59 * [new tag]         2.7.0      -> 2.7.0
02-Aug-2021 21:44:59 * [new tag]         2.8.0      -> 2.8.0
02-Aug-2021 21:44:59 * [new tag]         2.8.1      -> 2.8.1
02-Aug-2021 21:44:59 * [new tag]         2.9.0      -> 2.9.0
02-Aug-2021 21:44:59 * [new tag]         latest     -> latest
02-Aug-2021 21:44:59 Checking out revision c47ad85be992c00ecf51b913876d117a56e7e643.
02-Aug-2021 21:44:59 Already on 'master'
02-Aug-2021 21:44:59 Updated source code to revision: c47ad85be992c00ecf51b913876d117a56e7e643
02-Aug-2021 21:44:59 Finished task 'Checkout distribution' with result: Success
02-Aug-2021 21:44:59 Skipping execution of task 'deploy docker db and web containers' as it is disabled
02-Aug-2021 21:44:59 Starting task 'ensure refapp instance is app and prepare for testing' of type 'com.atlassian.bamboo.plugins.scripttask:task.builder.script'
02-Aug-2021 21:44:59
Beginning to execute external process for build 'Reference Application - UI - Run QA UI Tests #399 (REFAPP-UI-FRAMEWORK-399)'
... running command line:
/home/bamboo-agent/bamboo-agent/temp/REFAPP-UI-FRAMEWORK-399-ScriptBuildTask-4727328764551625201.sh
... in: /home/bamboo-agent/bamboo-agent/xml-data/build-dir/REFAPP-UI-FRAMEWORK
... using extra environment variables:
bamboo_planRepository_1_branch=master
bamboo_capability_system_builder_grailsBuilder_Grails_2_3_7=/opt/grails
bamboo_planRepository_2_branch=master
bamboo_planRepository_1_branchDisplayName=master
bamboo_repository_revision_number=c47ad85be992c00ecf51b913876d117a56e7e643
bamboo_saucelabs_username=rkorytkowski
bamboo_repository_207388681_previous_revision_number=17664014f2e1732fa798ce946c649bf568461c1f
bamboo_buildKey=REFAPP-UI-FRAMEWORK
bamboo_DISPLAY=10
bamboo_maven_release_version=2.8.0
bamboo_planRepository_2_branchDisplayName=master
bamboo_repository_207388681_name=Distribution
bamboo_shortJobName=Run QA UI Tests
bamboo_buildResultsUrl=https://ci.openmrs.org/browse/REFAPP-UI-FRAMEWORK-399
bamboo_planRepository_repositoryUrl=git://github.com/openmrs/openmrs-distro-referenceapplication.git
bamboo_agentId=189792258
bamboo_maven_development_version=
bamboo_capability_system_jdk_JDK_8=/usr/lib/jvm/java-8-openjdk-amd64
bamboo_planRepository_revision=c47ad85be992c00ecf51b913876d117a56e7e643
bamboo_planRepository_previousRevision=17664014f2e1732fa798ce946c649bf568461c1f
bamboo_capability_system_jdk_JDK_1_8_0_265=/usr/lib/jvm/java-1.8.0-openjdk-amd64/
bamboo_repository_branch_name=master
bamboo_dockerhub_username=openmrsci
bamboo_refapp_distro_scm=git@github.com:openmrs/openmrs-distro-referenceapplication.git
bamboo_repository_207388681_branch_name=master
bamboo_repository_207388680_branch_name=master
bamboo_repository_207388681_git_username=
bamboo_planRepository_branch=master
bamboo_repository_207388681_revision_number=c47ad85be992c00ecf51b913876d117a56e7e643
bamboo_capability_system_jdk_JDK_1_8_0_275=/usr/lib/jvm/java-1.8.0-openjdk-amd64/
bamboo_capability_system_jdk_JDK_1_8_0_272=/usr/lib/jvm/java-1.8.0-openjdk-amd64/
bamboo_capability_system_jdk_JDK_11=/usr/lib/jvm/java-11-openjdk-amd64
bamboo_planRepository_1_type=gitv2
bamboo_planRepository_branchName=master
bamboo_saucelabs_password=********
bamboo_capability_system_jdk_JDK=/usr/lib/jvm/java-1.8.0-openjdk-amd64/
bamboo_mavenBuildGoals=clean install
bamboo_hg_cache_directory=/home/bamboo-agent/bamboo-agent/xml-data/build-dir/_hg-repositories-cache
bamboo_planRepository_1_username=
bamboo_planRepository_type=gitv2
bamboo_git_cache_directory=/home/bamboo-agent/bamboo-agent/xml-data/build-dir/_git-repositories-cache
bamboo_planRepository_2_branchName=master
bamboo_capability_system_builder_node_Node_js=/usr/bin/node
bamboo_build_commandline_com_atlassian_bamboo_plugins_maven_task_builder_mvn3_2=/usr/share/apache-maven-3.3.9/bin/mvn --batch-mode -Djava.io.tmpdir=/home/bamboo-agent/bamboo-agent/.agent_tmp/REFAPP-UI-FRAMEWORK clean install
bamboo_travis_password=********
bamboo_capability_system_builder_mvn3_Maven_3=/usr/share/apache-maven-3.3.9
bamboo_tmp_directory=/home/bamboo-agent/bamboo-agent/temp
bamboo_planKey=REFAPP-UI
bamboo_capability_system_builder_command_nvm=nvm
bamboo_planRepository_username=
bamboo_capability_system_jdk_JDK_1_8_0_282=/usr/lib/jvm/java-1.8.0-openjdk-amd64/
bamboo_planRepository_1_branchName=master
bamboo_dockerhub_password=********
bamboo_resultsUrl=https://ci.openmrs.org/browse/REFAPP-UI-FRAMEWORK-399
bamboo_capability_system_builder_command_transifex=/usr/bin/tx
bamboo_jdbc_password=********
bamboo_build_working_directory=/home/bamboo-agent/bamboo-agent/xml-data/build-dir/REFAPP-UI-FRAMEWORK
bamboo_planRepository_1_name=Distribution
bamboo_capability_system_jdk_JDK_1_8_0_292=/usr/lib/jvm/java-1.8.0-openjdk-amd64/
bamboo_preparing_refapp_distro_release=false
bamboo_shortPlanName=UI
bamboo_planRepository_2_username=
bamboo_planRepository_name=Distribution
bamboo_docs_aws_secret_key=********
bamboo_buildNumber=399
bamboo_repository_207388680_git_username=
bamboo_repository_207388681_git_repositoryUrl=git://github.com/openmrs/openmrs-distro-referenceapplication.git
bamboo_planName=Reference Application - UI
bamboo_shortPlanKey=UI
bamboo_shortJobKey=FRAMEWORK
bamboo_planRepository_2_name=UI Test Framework
bamboo_buildTimeStamp=2021-08-02T21:44:38.906Z
bamboo_repository_previous_revision_number=17664014f2e1732fa798ce946c649bf568461c1f
bamboo_refapp_bamboo_build_number=
bamboo_repository_git_branch=master
bamboo_buildResultKey=REFAPP-UI-FRAMEWORK-399
bamboo_docs_aws_access_key=AKIAI7KMDL5KP2673G7A
bamboo_buildPlanName=Reference Application - UI - Run QA UI Tests
bamboo_openMRSVersion=2.1.3
bamboo_planRepository_1_revision=c47ad85be992c00ecf51b913876d117a56e7e643
bamboo_repository_207388680_git_repositoryUrl=git://github.com/openmrs/openmrs-contrib-uitestframework.git
bamboo_repository_name=UI Test Framework
bamboo_capability_system_jdk_openjdk_8_jdk=/usr/lib/jvm/java-8-openjdk-amd64
bamboo_planRepository_2_previousRevision=53261933a53762e3aa2703469b8abd666b6c5184
bamboo_transifex_password=********
bamboo_repository_207388680_name=UI Test Framework
bamboo_capability_system_jdk_openjdk_11_jdk=/usr/lib/jvm/java-11-openjdk-amd64
bamboo_repository_207388680_previous_revision_number=53261933a53762e3aa2703469b8abd666b6c5184
bamboo_buildFailed=false
bamboo_capability_system_builder_grailsBuilder_Grails_2=/opt/grails
bamboo_capability_system_docker_executable=/usr/bin/docker
bamboo_capability_system_builder_command_Bash=/bin/bash
bamboo_agentWorkingDirectory=/home/bamboo-agent/bamboo-agent/xml-data/build-dir
bamboo_planRepository_2_revision=53261933a53762e3aa2703469b8abd666b6c5184
bamboo_capability_system_git_executable=/usr/bin/git
bamboo_repository_git_username=
bamboo_planRepository_1_previousRevision=17664014f2e1732fa798ce946c649bf568461c1f
bamboo_planRepository_branchDisplayName=master
bamboo_planRepository_2_type=gitv2
bamboo_plan_storageTag=plan-207093778
bamboo_repository_207388680_git_branch=master
bamboo_planRepository_2_repositoryUrl=git://github.com/openmrs/openmrs-contrib-uitestframework.git
bamboo_repository_git_repositoryUrl=git://github.com/openmrs/openmrs-distro-referenceapplication.git
bamboo_transifex_username=api
bamboo_refapp_distro_dev_branch=master
bamboo_working_directory=/home/bamboo-agent/bamboo-agent/xml-data/build-dir/REFAPP-UI-FRAMEWORK
bamboo_planRepository_1_repositoryUrl=git://github.com/openmrs/openmrs-distro-referenceapplication.git
bamboo_capability_system_jdk_JDK_1_8=/usr/lib/jvm/java-1.8.0-openjdk-amd64/
bamboo_repository_207388681_git_branch=master
bamboo_repository_207388680_revision_number=53261933a53762e3aa2703469b8abd666b6c5184
02-Aug-2021 21:44:59 Finished task 'ensure refapp instance is app and prepare for testing' with result: Success
02-Aug-2021 21:44:59 Starting task 'Build distribution' of type 'com.atlassian.bamboo.plugins.maven:task.builder.mvn3'
02-Aug-2021 21:44:59
Beginning to execute external process for build 'Reference Application - UI - Run QA UI Tests #399 (REFAPP-UI-FRAMEWORK-399)'
... running command line:
/usr/share/apache-maven-3.3.9/bin/mvn --batch-mode -Djava.io.tmpdir=/home/bamboo-agent/bamboo-agent/.agent_tmp/REFAPP-UI-FRAMEWORK clean install -DskipTests=false
... in: /home/bamboo-agent/bamboo-agent/xml-data/build-dir/REFAPP-UI-FRAMEWORK
... using extra environment variables:
bamboo_planRepository_1_branch=master
bamboo_capability_system_builder_grailsBuilder_Grails_2_3_7=/opt/grails
bamboo_planRepository_2_branch=master
bamboo_planRepository_1_branchDisplayName=master
bamboo_repository_revision_number=c47ad85be992c00ecf51b913876d117a56e7e643
MAVEN2_HOME=/usr/share/apache-maven-3.3.9
bamboo_saucelabs_username=rkorytkowski
bamboo_repository_207388681_previous_revision_number=17664014f2e1732fa798ce946c649bf568461c1f
bamboo_buildKey=REFAPP-UI-FRAMEWORK
bamboo_DISPLAY=10
bamboo_maven_release_version=2.8.0
bamboo_planRepository_2_branchDisplayName=master
bamboo_repository_207388681_name=Distribution
bamboo_shortJobName=Run QA UI Tests
bamboo_buildResultsUrl=https://ci.openmrs.org/browse/REFAPP-UI-FRAMEWORK-399
bamboo_planRepository_repositoryUrl=git://github.com/openmrs/openmrs-distro-referenceapplication.git
bamboo_agentId=189792258
bamboo_maven_development_version=
bamboo_capability_system_jdk_JDK_8=/usr/lib/jvm/java-8-openjdk-amd64
bamboo_planRepository_revision=c47ad85be992c00ecf51b913876d117a56e7e643
bamboo_planRepository_previousRevision=17664014f2e1732fa798ce946c649bf568461c1f
bamboo_capability_system_jdk_JDK_1_8_0_265=/usr/lib/jvm/java-1.8.0-openjdk-amd64/
bamboo_repository_branch_name=master
bamboo_dockerhub_username=openmrsci
bamboo_refapp_distro_scm=git@github.com:openmrs/openmrs-distro-referenceapplication.git
bamboo_repository_207388681_branch_name=master
JAVA_HOME=/usr/lib/jvm/java-1.8.0-openjdk-amd64/
bamboo_repository_207388680_branch_name=master
bamboo_repository_207388681_git_username=
bamboo_planRepository_branch=master
bamboo_repository_207388681_revision_number=c47ad85be992c00ecf51b913876d117a56e7e643
bamboo_capability_system_jdk_JDK_1_8_0_275=/usr/lib/jvm/java-1.8.0-openjdk-amd64/
bamboo_capability_system_jdk_JDK_1_8_0_272=/usr/lib/jvm/java-1.8.0-openjdk-amd64/
bamboo_capability_system_jdk_JDK_11=/usr/lib/jvm/java-11-openjdk-amd64
bamboo_planRepository_1_type=gitv2
bamboo_planRepository_branchName=master
bamboo_saucelabs_password=********
bamboo_capability_system_jdk_JDK=/usr/lib/jvm/java-1.8.0-openjdk-amd64/
bamboo_mavenBuildGoals=clean install
bamboo_hg_cache_directory=/home/bamboo-agent/bamboo-agent/xml-data/build-dir/_hg-repositories-cache
bamboo_planRepository_1_username=
bamboo_planRepository_type=gitv2
bamboo_git_cache_directory=/home/bamboo-agent/bamboo-agent/xml-data/build-dir/_git-repositories-cache
bamboo_planRepository_2_branchName=master
useMavenReturnCode=false
bamboo_capability_system_builder_node_Node_js=/usr/bin/node
bamboo_build_commandline_com_atlassian_bamboo_plugins_maven_task_builder_mvn3_2=/usr/share/apache-maven-3.3.9/bin/mvn --batch-mode -Djava.io.tmpdir=/home/bamboo-agent/bamboo-agent/.agent_tmp/REFAPP-UI-FRAMEWORK clean install
bamboo_travis_password=********
bamboo_capability_system_builder_mvn3_Maven_3=/usr/share/apache-maven-3.3.9
bamboo_tmp_directory=/home/bamboo-agent/bamboo-agent/temp
bamboo_planKey=REFAPP-UI
bamboo_capability_system_builder_command_nvm=nvm
bamboo_planRepository_username=
bamboo_capability_system_jdk_JDK_1_8_0_282=/usr/lib/jvm/java-1.8.0-openjdk-amd64/
bamboo_planRepository_1_branchName=master
bamboo_dockerhub_password=********
bamboo_resultsUrl=https://ci.openmrs.org/browse/REFAPP-UI-FRAMEWORK-399
bamboo_capability_system_builder_command_transifex=/usr/bin/tx
bamboo_jdbc_password=********
bamboo_build_working_directory=/home/bamboo-agent/bamboo-agent/xml-data/build-dir/REFAPP-UI-FRAMEWORK
bamboo_planRepository_1_name=Distribution
bamboo_capability_system_jdk_JDK_1_8_0_292=/usr/lib/jvm/java-1.8.0-openjdk-amd64/
bamboo_preparing_refapp_distro_release=false
bamboo_shortPlanName=UI
bamboo_planRepository_2_username=
bamboo_planRepository_name=Distribution
bamboo_docs_aws_secret_key=********
bamboo_buildNumber=399
bamboo_repository_207388680_git_username=
bamboo_repository_207388681_git_repositoryUrl=git://github.com/openmrs/openmrs-distro-referenceapplication.git
bamboo_planName=Reference Application - UI
bamboo_build_commandline_com_atlassian_bamboo_plugins_scripttask_task_builder_script_6=/home/bamboo-agent/bamboo-agent/temp/REFAPP-UI-FRAMEWORK-399-ScriptBuildTask-4727328764551625201.sh
bamboo_shortPlanKey=UI
bamboo_shortJobKey=FRAMEWORK
bamboo_planRepository_2_name=UI Test Framework
bamboo_buildTimeStamp=2021-08-02T21:44:38.906Z
bamboo_repository_previous_revision_number=17664014f2e1732fa798ce946c649bf568461c1f
M2_HOME=/usr/share/apache-maven-3.3.9
bamboo_refapp_bamboo_build_number=
bamboo_repository_git_branch=master
bamboo_buildResultKey=REFAPP-UI-FRAMEWORK-399
bamboo_docs_aws_access_key=AKIAI7KMDL5KP2673G7A
bamboo_buildPlanName=Reference Application - UI - Run QA UI Tests
bamboo_openMRSVersion=2.1.3
bamboo_planRepository_1_revision=c47ad85be992c00ecf51b913876d117a56e7e643
bamboo_repository_207388680_git_repositoryUrl=git://github.com/openmrs/openmrs-contrib-uitestframework.git
bamboo_repository_name=UI Test Framework
bamboo_capability_system_jdk_openjdk_8_jdk=/usr/lib/jvm/java-8-openjdk-amd64
bamboo_planRepository_2_previousRevision=53261933a53762e3aa2703469b8abd666b6c5184
bamboo_transifex_password=********
bamboo_repository_207388680_name=UI Test Framework
bamboo_capability_system_jdk_openjdk_11_jdk=/usr/lib/jvm/java-11-openjdk-amd64
bamboo_repository_207388680_previous_revision_number=53261933a53762e3aa2703469b8abd666b6c5184
bamboo_buildFailed=false
bamboo_capability_system_builder_grailsBuilder_Grails_2=/opt/grails
bamboo_capability_system_docker_executable=/usr/bin/docker
bamboo_capability_system_builder_command_Bash=/bin/bash
bamboo_agentWorkingDirectory=/home/bamboo-agent/bamboo-agent/xml-data/build-dir
bamboo_planRepository_2_revision=53261933a53762e3aa2703469b8abd666b6c5184
bamboo_capability_system_git_executable=/usr/bin/git
bamboo_repository_git_username=
bamboo_planRepository_1_previousRevision=17664014f2e1732fa798ce946c649bf568461c1f
bamboo_planRepository_branchDisplayName=master
bamboo_planRepository_2_type=gitv2
bamboo_plan_storageTag=plan-207093778
bamboo_repository_207388680_git_branch=master
bamboo_planRepository_2_repositoryUrl=git://github.com/openmrs/openmrs-contrib-uitestframework.git
bamboo_repository_git_repositoryUrl=git://github.com/openmrs/openmrs-distro-referenceapplication.git
bamboo_transifex_username=api
bamboo_refapp_distro_dev_branch=master
bamboo_working_directory=/home/bamboo-agent/bamboo-agent/xml-data/build-dir/REFAPP-UI-FRAMEWORK
bamboo_planRepository_1_repositoryUrl=git://github.com/openmrs/openmrs-distro-referenceapplication.git
bamboo_capability_system_jdk_JDK_1_8=/usr/lib/jvm/java-1.8.0-openjdk-amd64/
bamboo_repository_207388681_git_branch=master
bamboo_repository_207388680_revision_number=53261933a53762e3aa2703469b8abd666b6c5184
PATH=/usr/lib/jvm/java-1.8.0-openjdk-amd64//bin:/home/bamboo-agent/.nvm/versions/node/v10.22.1/bin:/home/bamboo-agent/bin:/home/bamboo-agent/.local/bin:/usr/local/sbin:/usr/local/bin:/usr/sbin:/usr/bin:/sbin:/bin:/usr/games:/usr/local/games:/snap/bin:/opt/puppetlabs/bin
02-Aug-2021 21:45:00 [INFO] Scanning for projects...
02-Aug-2021 21:45:00 [WARNING]
02-Aug-2021 21:45:00 [WARNING] Some problems were encountered while building the effective model for org.openmrs.distro:referenceapplication-ui-tests:jar:2.12.0-SNAPSHOT
02-Aug-2021 21:45:00 [WARNING] 'version' contains an expression but should be a constant. @ org.openmrs.distro:referenceapplication-ui-tests:${parent.version}, /home/bamboo-agent/bamboo-agent/xml-data/build-dir/REFAPP-UI-FRAMEWORK/ui-tests/pom.xml, line 6, column 14
02-Aug-2021 21:45:00 [WARNING] 'build.plugins.plugin.version' for org.apache.maven.plugins:maven-deploy-plugin is missing. @ org.openmrs.distro:referenceapplication-ui-tests:${parent.version}, /home/bamboo-agent/bamboo-agent/xml-data/build-dir/REFAPP-UI-FRAMEWORK/ui-tests/pom.xml, line 88, column 21
02-Aug-2021 21:45:00 [WARNING] The expression ${parent.version} is deprecated. Please use ${project.parent.version} instead. @ org.openmrs.distro:referenceapplication-ui-tests:${parent.version}, /home/bamboo-agent/bamboo-agent/xml-data/build-dir/REFAPP-UI-FRAMEWORK/ui-tests/pom.xml
02-Aug-2021 21:45:00 [WARNING]
02-Aug-2021 21:45:00 [WARNING] It is highly recommended to fix these problems because they threaten the stability of your build.
02-Aug-2021 21:45:00 [WARNING]
02-Aug-2021 21:45:00 [WARNING] For this reason, future Maven versions might no longer support building such malformed projects.
02-Aug-2021 21:45:00 [WARNING]
02-Aug-2021 21:45:00 [INFO] ------------------------------------------------------------------------
02-Aug-2021 21:45:00 [INFO] Reactor Build Order:
02-Aug-2021 21:45:00 [INFO]
02-Aug-2021 21:45:00 [INFO] Reference Application Distribution
02-Aug-2021 21:45:00 [INFO] Reference Application Distribution Package
02-Aug-2021 21:45:00 [INFO] Reference Application Distribution UI Tests
02-Aug-2021 21:45:00 [INFO]                                                                         
02-Aug-2021 21:45:00 [INFO] ------------------------------------------------------------------------
02-Aug-2021 21:45:00 [INFO] Building Reference Application Distribution 2.12.0-SNAPSHOT
02-Aug-2021 21:45:00 [INFO] ------------------------------------------------------------------------
02-Aug-2021 21:45:00 [INFO]
02-Aug-2021 21:45:00 [INFO] --- maven-clean-plugin:2.5:clean (default-clean) @ referenceapplication ---
02-Aug-2021 21:45:00 [INFO]
02-Aug-2021 21:45:00 [INFO] --- maven-install-plugin:2.4:install (default-install) @ referenceapplication ---
02-Aug-2021 21:45:01 [INFO] Installing /home/bamboo-agent/bamboo-agent/xml-data/build-dir/REFAPP-UI-FRAMEWORK/pom.xml to /home/bamboo-agent/.m2/repository/org/openmrs/distro/referenceapplication/2.12.0-SNAPSHOT/referenceapplication-2.12.0-SNAPSHOT.pom
02-Aug-2021 21:45:01 [INFO]                                                                         
02-Aug-2021 21:45:01 [INFO] ------------------------------------------------------------------------
02-Aug-2021 21:45:01 [INFO] Building Reference Application Distribution Package 2.12.0-SNAPSHOT
02-Aug-2021 21:45:01 [INFO] ------------------------------------------------------------------------
02-Aug-2021 21:45:03 [INFO]
02-Aug-2021 21:45:03 [INFO] --- maven-clean-plugin:2.5:clean (default-clean) @ referenceapplication-package ---
02-Aug-2021 21:45:03 [INFO]
02-Aug-2021 21:45:03 [INFO] --- maven-resources-plugin:2.6:resources (default-resources) @ referenceapplication-package ---
02-Aug-2021 21:45:03 [INFO] Using 'UTF-8' encoding to copy filtered resources.
02-Aug-2021 21:45:03 [INFO] Copying 1 resource
02-Aug-2021 21:45:03 [INFO] Copying 2 resources
02-Aug-2021 21:45:03 [INFO] skip non existing resourceDirectory /home/bamboo-agent/bamboo-agent/xml-data/build-dir/REFAPP-UI-FRAMEWORK/package/src/main/webapp
02-Aug-2021 21:45:03 [INFO]
02-Aug-2021 21:45:03 [INFO] --- openmrs-sdk-maven-plugin:4.0.0:build-distro (build-distro) @ referenceapplication-package ---
02-Aug-2021 21:45:05
02-Aug-2021 21:45:05 Downloading modules...
02-Aug-2021 21:45:05
02-Aug-2021 21:45:06 [INFO] Configured Artifact: org.openmrs.web:openmrs-webapp:2.4.0:war
02-Aug-2021 21:45:06 [INFO] Copying openmrs-webapp-2.4.0.war to /home/bamboo-agent/bamboo-agent/xml-data/build-dir/REFAPP-UI-FRAMEWORK/package/target/distro/web/openmrs-2.4.0.war
02-Aug-2021 21:45:08 file:/home/bamboo-agent/bamboo-agent/xml-data/build-dir/REFAPP-UI-FRAMEWORK/package/target/distro/web/openmrs-2.4.0.war
02-Aug-2021 21:45:08 target:/home/bamboo-agent/bamboo-agent/xml-data/build-dir/REFAPP-UI-FRAMEWORK/package/target/distro/web
02-Aug-2021 21:45:08 [INFO] Configured Artifact: org.openmrs.module:addresshierarchy-omod:2.14.2:jar
02-Aug-2021 21:45:08 [INFO] Configured Artifact: org.openmrs.module:legacyui-omod:1.8.3:jar
02-Aug-2021 21:45:08 [INFO] Configured Artifact: org.openmrs.module:openconceptlab-omod:1.2.6:jar
02-Aug-2021 21:45:08 [INFO] Configured Artifact: org.openmrs.module:metadatadeploy-omod:1.13.0:jar
02-Aug-2021 21:45:08 [INFO] Configured Artifact: org.openmrs.module:reportingrest-omod:1.12.0:jar
02-Aug-2021 21:45:08 [INFO] Configured Artifact: org.openmrs.module:owa-omod:1.13.0:jar
02-Aug-2021 21:45:08 [INFO] Configured Artifact: org.openmrs.module:fhir2-omod:1.2.2:jar
02-Aug-2021 21:45:08 [INFO] Configured Artifact: org.openmrs.module:serialization.xstream-omod:0.2.15:omod
02-Aug-2021 21:45:08 [INFO] Configured Artifact: org.openmrs.module:registrationapp-omod:1.24.0:jar
02-Aug-2021 21:45:08 [INFO] Downloading: http://mavenrepo.openmrs.org/nexus/content/repositories/public/org/openmrs/module/registrationapp-omod/1.24.0/registrationapp-omod-1.24.0.jar
02-Aug-2021 21:45:16 [INFO] Downloaded: http://mavenrepo.openmrs.org/nexus/content/repositories/public/org/openmrs/module/registrationapp-omod/1.24.0/registrationapp-omod-1.24.0.jar (895 KB at 108.9 KB/sec)
02-Aug-2021 21:45:16 [INFO] Configured Artifact: org.openmrs:event-omod:2.10.0-SNAPSHOT:jar
02-Aug-2021 21:45:16 [INFO] Downloading: http://mavenrepo.openmrs.org/nexus/content/repositories/public/org/openmrs/event-omod/2.10.0-SNAPSHOT/maven-metadata.xml
02-Aug-2021 21:45:17 [INFO] Downloaded: http://mavenrepo.openmrs.org/nexus/content/repositories/public/org/openmrs/event-omod/2.10.0-SNAPSHOT/maven-metadata.xml (987 B at 3.7 KB/sec)
02-Aug-2021 21:45:17 [INFO] Downloading: http://mavenrepo.openmrs.org/nexus/content/repositories/public/org/openmrs/event-omod/2.10.0-SNAPSHOT/event-omod-2.10.0-20210702.124301-3.jar
02-Aug-2021 21:45:32 [INFO] Downloaded: http://mavenrepo.openmrs.org/nexus/content/repositories/public/org/openmrs/event-omod/2.10.0-SNAPSHOT/event-omod-2.10.0-20210702.124301-3.jar (4666 KB at 306.4 KB/sec)
02-Aug-2021 21:45:32 [INFO] Configured Artifact: org.openmrs.module:uilibrary-omod:2.0.7:jar
02-Aug-2021 21:45:32 [INFO] Configured Artifact: org.openmrs.module:htmlwidgets-omod:1.10.0:jar
02-Aug-2021 21:45:32 [INFO] Configured Artifact: org.openmrs.module:dataexchange-omod:1.3.7:jar
02-Aug-2021 21:45:32 [INFO] Configured Artifact: org.openmrs.module:appui-omod:1.14.0:jar
02-Aug-2021 21:45:32 [INFO] Configured Artifact: org.openmrs.module:allergyui-omod:1.8.4:jar
02-Aug-2021 21:45:32 [INFO] Configured Artifact: org.openmrs.module:providermanagement-omod:2.13.0:jar
02-Aug-2021 21:45:32 [INFO] Configured Artifact: org.openmrs.module:appointmentschedulingui-omod:1.11.0:jar
02-Aug-2021 21:45:32 [INFO] Configured Artifact: org.openmrs.module:attachments-omod:2.5.0:jar
02-Aug-2021 21:45:32 [INFO] Configured Artifact: org.openmrs.module:formentryapp-omod:1.4.2:jar
02-Aug-2021 21:45:32 [INFO] Configured Artifact: org.openmrs.module:idgen-omod:4.7.0:jar
02-Aug-2021 21:45:32 [INFO] Configured Artifact: org.openmrs.module:metadatamapping-omod:1.4.0:jar
02-Aug-2021 21:45:32 [INFO] Configured Artifact: org.openmrs.module:htmlformentryui-omod:2.0.0-SNAPSHOT:jar
02-Aug-2021 21:45:32 [INFO] Downloading: http://mavenrepo.openmrs.org/nexus/content/repositories/public/org/openmrs/module/htmlformentryui-omod/2.0.0-SNAPSHOT/maven-metadata.xml
02-Aug-2021 21:45:32 [INFO] Downloaded: http://mavenrepo.openmrs.org/nexus/content/repositories/public/org/openmrs/module/htmlformentryui-omod/2.0.0-SNAPSHOT/maven-metadata.xml (1008 B at 3.7 KB/sec)
02-Aug-2021 21:45:32 [INFO] Downloading: http://mavenrepo.openmrs.org/nexus/content/repositories/public/org/openmrs/module/htmlformentryui-omod/2.0.0-SNAPSHOT/htmlformentryui-omod-2.0.0-20210802.191325-153.jar
02-Aug-2021 21:45:36 [INFO] Downloaded: http://mavenrepo.openmrs.org/nexus/content/repositories/public/org/openmrs/module/htmlformentryui-omod/2.0.0-SNAPSHOT/htmlformentryui-omod-2.0.0-20210802.191325-153.jar (1430 KB at 348.7 KB/sec)
02-Aug-2021 21:45:36 [INFO] Configured Artifact: org.openmrs.module:referencedemodata-omod:1.4.7-SNAPSHOT:jar
02-Aug-2021 21:45:36 [INFO] Downloading: http://mavenrepo.openmrs.org/nexus/content/repositories/public/org/openmrs/module/referencedemodata-omod/1.4.7-SNAPSHOT/maven-metadata.xml
02-Aug-2021 21:45:37 [INFO] Downloaded: http://mavenrepo.openmrs.org/nexus/content/repositories/public/org/openmrs/module/referencedemodata-omod/1.4.7-SNAPSHOT/maven-metadata.xml (796 B at 2.9 KB/sec)
02-Aug-2021 21:45:37 [INFO] Downloading: http://mavenrepo.openmrs.org/nexus/content/repositories/public/org/openmrs/module/referencedemodata-omod/1.4.7-SNAPSHOT/referencedemodata-omod-1.4.7-20210802.192705-209.jar
02-Aug-2021 21:45:37 [INFO] Downloaded: http://mavenrepo.openmrs.org/nexus/content/repositories/public/org/openmrs/module/referencedemodata-omod/1.4.7-SNAPSHOT/referencedemodata-omod-1.4.7-20210802.192705-209.jar (56 KB at 117.1 KB/sec)
02-Aug-2021 21:45:37 [INFO] Configured Artifact: org.openmrs.module:emrapi-omod:1.32.0-SNAPSHOT:jar
02-Aug-2021 21:45:37 [INFO] Downloading: http://mavenrepo.openmrs.org/nexus/content/repositories/public/org/openmrs/module/emrapi-omod/1.32.0-SNAPSHOT/maven-metadata.xml
02-Aug-2021 21:45:37 [INFO] Downloaded: http://mavenrepo.openmrs.org/nexus/content/repositories/public/org/openmrs/module/emrapi-omod/1.32.0-SNAPSHOT/maven-metadata.xml (1003 B at 3.7 KB/sec)
02-Aug-2021 21:45:37 [INFO] Downloading: http://mavenrepo.openmrs.org/nexus/content/repositories/public/org/openmrs/module/emrapi-omod/1.32.0-SNAPSHOT/emrapi-omod-1.32.0-20210802.184708-102.jar
02-Aug-2021 21:45:40 [INFO] Downloaded: http://mavenrepo.openmrs.org/nexus/content/repositories/public/org/openmrs/module/emrapi-omod/1.32.0-SNAPSHOT/emrapi-omod-1.32.0-20210802.184708-102.jar (1001 KB at 366.7 KB/sec)
02-Aug-2021 21:45:40 [INFO] Configured Artifact: org.openmrs.module:referenceapplication-omod:2.12.0-SNAPSHOT:jar
02-Aug-2021 21:45:40 [INFO] Downloading: http://mavenrepo.openmrs.org/nexus/content/repositories/public/org/openmrs/module/referenceapplication-omod/2.12.0-SNAPSHOT/maven-metadata.xml
02-Aug-2021 21:45:40 [INFO] Downloaded: http://mavenrepo.openmrs.org/nexus/content/repositories/public/org/openmrs/module/referenceapplication-omod/2.12.0-SNAPSHOT/maven-metadata.xml (802 B at 2.9 KB/sec)
02-Aug-2021 21:45:40 [INFO] Downloading: http://mavenrepo.openmrs.org/nexus/content/repositories/public/org/openmrs/module/referenceapplication-omod/2.12.0-SNAPSHOT/referenceapplication-omod-2.12.0-20210802.192900-220.jar
02-Aug-2021 21:45:43 [INFO] Downloaded: http://mavenrepo.openmrs.org/nexus/content/repositories/public/org/openmrs/module/referenceapplication-omod/2.12.0-SNAPSHOT/referenceapplication-omod-2.12.0-20210802.192900-220.jar (1900 KB at 641.0 KB/sec)
02-Aug-2021 21:45:43 [INFO] Configured Artifact: org.openmrs.module:htmlformentry-omod:4.0.2-SNAPSHOT:jar
02-Aug-2021 21:45:43 [INFO] Downloading: http://mavenrepo.openmrs.org/nexus/content/repositories/public/org/openmrs/module/htmlformentry-omod/4.0.2-SNAPSHOT/maven-metadata.xml
02-Aug-2021 21:45:44 [INFO] Downloaded: http://mavenrepo.openmrs.org/nexus/content/repositories/public/org/openmrs/module/htmlformentry-omod/4.0.2-SNAPSHOT/maven-metadata.xml (1002 B at 3.7 KB/sec)
02-Aug-2021 21:45:44 [INFO] Downloading: http://mavenrepo.openmrs.org/nexus/content/repositories/public/org/openmrs/module/htmlformentry-omod/4.0.2-SNAPSHOT/htmlformentry-omod-4.0.2-20210722.180223-11.jar
02-Aug-2021 21:45:45 [INFO] Downloaded: http://mavenrepo.openmrs.org/nexus/content/repositories/public/org/openmrs/module/htmlformentry-omod/4.0.2-SNAPSHOT/htmlformentry-omod-4.0.2-20210722.180223-11.jar (2342 KB at 1214.3 KB/sec)
02-Aug-2021 21:45:45 [INFO] Configured Artifact: org.openmrs.module:appframework-omod:2.16.0:jar
02-Aug-2021 21:45:45 [INFO] Configured Artifact: org.openmrs.module:referencemetadata-omod:2.12.0-SNAPSHOT:jar
02-Aug-2021 21:45:45 [INFO] Downloading: http://mavenrepo.openmrs.org/nexus/content/repositories/public/org/openmrs/module/referencemetadata-omod/2.12.0-SNAPSHOT/maven-metadata.xml
02-Aug-2021 21:45:46 [INFO] Downloaded: http://mavenrepo.openmrs.org/nexus/content/repositories/public/org/openmrs/module/referencemetadata-omod/2.12.0-SNAPSHOT/maven-metadata.xml (799 B at 3.0 KB/sec)
02-Aug-2021 21:45:46 [INFO] Downloading: http://mavenrepo.openmrs.org/nexus/content/repositories/public/org/openmrs/module/referencemetadata-omod/2.12.0-SNAPSHOT/referencemetadata-omod-2.12.0-20210802.190707-212.jar
02-Aug-2021 21:45:46 [INFO] Downloaded: http://mavenrepo.openmrs.org/nexus/content/repositories/public/org/openmrs/module/referencemetadata-omod/2.12.0-SNAPSHOT/referencemetadata-omod-2.12.0-20210802.190707-212.jar (525 KB at 830.1 KB/sec)
02-Aug-2021 21:45:46 [INFO] Configured Artifact: org.openmrs.module:reportingui-omod:1.8.0:jar
02-Aug-2021 21:45:46 [INFO] Configured Artifact: org.openmrs.module:coreapps-omod:1.33.0-SNAPSHOT:jar
02-Aug-2021 21:45:46 [INFO] Downloading: http://mavenrepo.openmrs.org/nexus/content/repositories/public/org/openmrs/module/coreapps-omod/1.33.0-SNAPSHOT/maven-metadata.xml
02-Aug-2021 21:45:47 [INFO] Downloaded: http://mavenrepo.openmrs.org/nexus/content/repositories/public/org/openmrs/module/coreapps-omod/1.33.0-SNAPSHOT/maven-metadata.xml (787 B at 2.9 KB/sec)
02-Aug-2021 21:45:47 [INFO] Downloading: http://mavenrepo.openmrs.org/nexus/content/repositories/public/org/openmrs/module/coreapps-omod/1.33.0-SNAPSHOT/coreapps-omod-1.33.0-20210802.191644-61.jar
02-Aug-2021 21:45:48 [INFO] Downloaded: http://mavenrepo.openmrs.org/nexus/content/repositories/public/org/openmrs/module/coreapps-omod/1.33.0-SNAPSHOT/coreapps-omod-1.33.0-20210802.191644-61.jar (3859 KB at 2126.0 KB/sec)
02-Aug-2021 21:45:48 [INFO] Configured Artifact: org.openmrs.module:reportingcompatibility-omod:2.0.8:jar
02-Aug-2021 21:45:48 [INFO] Configured Artifact: org.openmrs.module:reporting-omod:1.23.0:jar
02-Aug-2021 21:45:48 [INFO] Configured Artifact: org.openmrs.module:adminui-omod:1.5.0:jar
02-Aug-2021 21:45:49 [INFO] Configured Artifact: org.openmrs.module:registrationcore-omod:1.11.0:jar
02-Aug-2021 21:45:49 [INFO] Configured Artifact: org.openmrs.module:appointmentscheduling-omod:1.16.0:jar
02-Aug-2021 21:45:49 [INFO] Configured Artifact: org.openmrs.module:atlas-omod:2.2.5:omod
02-Aug-2021 21:45:49 [INFO] Configured Artifact: org.openmrs.module:calculation-omod:1.3.0:jar
02-Aug-2021 21:45:49 [INFO] Configured Artifact: org.openmrs.module:webservices.rest-omod:2.32.0-SNAPSHOT:jar
02-Aug-2021 21:45:49 [INFO] Downloading: http://mavenrepo.openmrs.org/nexus/content/repositories/public/org/openmrs/module/webservices.rest-omod/2.32.0-SNAPSHOT/maven-metadata.xml
02-Aug-2021 21:45:49 [INFO] Downloaded: http://mavenrepo.openmrs.org/nexus/content/repositories/public/org/openmrs/module/webservices.rest-omod/2.32.0-SNAPSHOT/maven-metadata.xml (1009 B at 3.8 KB/sec)
02-Aug-2021 21:45:49 [INFO] Downloading: http://mavenrepo.openmrs.org/nexus/content/repositories/public/org/openmrs/module/webservices.rest-omod/2.32.0-SNAPSHOT/webservices.rest-omod-2.32.0-20210802.182821-29.jar
02-Aug-2021 21:45:51 [INFO] Downloaded: http://mavenrepo.openmrs.org/nexus/content/repositories/public/org/openmrs/module/webservices.rest-omod/2.32.0-SNAPSHOT/webservices.rest-omod-2.32.0-20210802.182821-29.jar (6744 KB at 3506.9 KB/sec)
02-Aug-2021 21:45:51 [INFO] Configured Artifact: org.openmrs.module:spa-omod:1.0.8:jar
02-Aug-2021 21:45:51 [INFO] Configured Artifact: org.openmrs.module:uicommons-omod:2.18.0:jar
02-Aug-2021 21:45:51 [INFO] Configured Artifact: org.openmrs.module:uiframework-omod:3.21.0:jar
02-Aug-2021 21:45:51 [INFO] Configured Artifact: org.openmrs.module:metadatasharing-omod:1.8.0:jar
02-Aug-2021 21:45:51 [INFO] Copying addresshierarchy-omod-2.14.2.jar to /home/bamboo-agent/bamboo-agent/xml-data/build-dir/REFAPP-UI-FRAMEWORK/package/target/distro/web/modules/addresshierarchy-2.14.2.omod
02-Aug-2021 21:45:51 [INFO] Copying legacyui-omod-1.8.3.jar to /home/bamboo-agent/bamboo-agent/xml-data/build-dir/REFAPP-UI-FRAMEWORK/package/target/distro/web/modules/legacyui-1.8.3.omod
02-Aug-2021 21:45:51 [INFO] Copying openconceptlab-omod-1.2.6.jar to /home/bamboo-agent/bamboo-agent/xml-data/build-dir/REFAPP-UI-FRAMEWORK/package/target/distro/web/modules/openconceptlab-1.2.6.omod
02-Aug-2021 21:45:51 [INFO] Copying metadatadeploy-omod-1.13.0.jar to /home/bamboo-agent/bamboo-agent/xml-data/build-dir/REFAPP-UI-FRAMEWORK/package/target/distro/web/modules/metadatadeploy-1.13.0.omod
02-Aug-2021 21:45:51 [INFO] Copying reportingrest-omod-1.12.0.jar to /home/bamboo-agent/bamboo-agent/xml-data/build-dir/REFAPP-UI-FRAMEWORK/package/target/distro/web/modules/reportingrest-1.12.0.omod
02-Aug-2021 21:45:51 [INFO] Copying owa-omod-1.13.0.jar to /home/bamboo-agent/bamboo-agent/xml-data/build-dir/REFAPP-UI-FRAMEWORK/package/target/distro/web/modules/owa-1.13.0.omod
02-Aug-2021 21:45:51 [INFO] Copying fhir2-omod-1.2.2.jar to /home/bamboo-agent/bamboo-agent/xml-data/build-dir/REFAPP-UI-FRAMEWORK/package/target/distro/web/modules/fhir2-1.2.2.omod
02-Aug-2021 21:45:53 [INFO] Copying serialization.xstream-omod-0.2.15.omod to /home/bamboo-agent/bamboo-agent/xml-data/build-dir/REFAPP-UI-FRAMEWORK/package/target/distro/web/modules/serialization.xstream-0.2.15.omod
02-Aug-2021 21:45:53 [INFO] Copying registrationapp-omod-1.24.0.jar to /home/bamboo-agent/bamboo-agent/xml-data/build-dir/REFAPP-UI-FRAMEWORK/package/target/distro/web/modules/registrationapp-1.24.0.omod
02-Aug-2021 21:45:53 [INFO] Copying event-omod-2.10.0-SNAPSHOT.jar to /home/bamboo-agent/bamboo-agent/xml-data/build-dir/REFAPP-UI-FRAMEWORK/package/target/distro/web/modules/event-2.10.0-SNAPSHOT.omod
02-Aug-2021 21:45:53 [INFO] Copying uilibrary-omod-2.0.7.jar to /home/bamboo-agent/bamboo-agent/xml-data/build-dir/REFAPP-UI-FRAMEWORK/package/target/distro/web/modules/uilibrary-2.0.7.omod
02-Aug-2021 21:45:53 [INFO] Copying htmlwidgets-omod-1.10.0.jar to /home/bamboo-agent/bamboo-agent/xml-data/build-dir/REFAPP-UI-FRAMEWORK/package/target/distro/web/modules/htmlwidgets-1.10.0.omod
02-Aug-2021 21:45:53 [INFO] Copying dataexchange-omod-1.3.7.jar to /home/bamboo-agent/bamboo-agent/xml-data/build-dir/REFAPP-UI-FRAMEWORK/package/target/distro/web/modules/dataexchange-1.3.7.omod
02-Aug-2021 21:45:53 [INFO] Copying appui-omod-1.14.0.jar to /home/bamboo-agent/bamboo-agent/xml-data/build-dir/REFAPP-UI-FRAMEWORK/package/target/distro/web/modules/appui-1.14.0.omod
02-Aug-2021 21:45:53 [INFO] Copying allergyui-omod-1.8.4.jar to /home/bamboo-agent/bamboo-agent/xml-data/build-dir/REFAPP-UI-FRAMEWORK/package/target/distro/web/modules/allergyui-1.8.4.omod
02-Aug-2021 21:45:53 [INFO] Copying providermanagement-omod-2.13.0.jar to /home/bamboo-agent/bamboo-agent/xml-data/build-dir/REFAPP-UI-FRAMEWORK/package/target/distro/web/modules/providermanagement-2.13.0.omod
02-Aug-2021 21:45:53 [INFO] Copying appointmentschedulingui-omod-1.11.0.jar to /home/bamboo-agent/bamboo-agent/xml-data/build-dir/REFAPP-UI-FRAMEWORK/package/target/distro/web/modules/appointmentschedulingui-1.11.0.omod
02-Aug-2021 21:45:53 [INFO] Copying attachments-omod-2.5.0.jar to /home/bamboo-agent/bamboo-agent/xml-data/build-dir/REFAPP-UI-FRAMEWORK/package/target/distro/web/modules/attachments-2.5.0.omod
02-Aug-2021 21:45:53 [INFO] Copying formentryapp-omod-1.4.2.jar to /home/bamboo-agent/bamboo-agent/xml-data/build-dir/REFAPP-UI-FRAMEWORK/package/target/distro/web/modules/formentryapp-1.4.2.omod
02-Aug-2021 21:45:53 [INFO] Copying idgen-omod-4.7.0.jar to /home/bamboo-agent/bamboo-agent/xml-data/build-dir/REFAPP-UI-FRAMEWORK/package/target/distro/web/modules/idgen-4.7.0.omod
02-Aug-2021 21:45:53 [INFO] Copying metadatamapping-omod-1.4.0.jar to /home/bamboo-agent/bamboo-agent/xml-data/build-dir/REFAPP-UI-FRAMEWORK/package/target/distro/web/modules/metadatamapping-1.4.0.omod
02-Aug-2021 21:45:53 [INFO] Copying htmlformentryui-omod-2.0.0-SNAPSHOT.jar to /home/bamboo-agent/bamboo-agent/xml-data/build-dir/REFAPP-UI-FRAMEWORK/package/target/distro/web/modules/htmlformentryui-2.0.0-SNAPSHOT.omod
02-Aug-2021 21:45:53 [INFO] Copying referencedemodata-omod-1.4.7-SNAPSHOT.jar to /home/bamboo-agent/bamboo-agent/xml-data/build-dir/REFAPP-UI-FRAMEWORK/package/target/distro/web/modules/referencedemodata-1.4.7-SNAPSHOT.omod
02-Aug-2021 21:45:53 [INFO] Copying emrapi-omod-1.32.0-SNAPSHOT.jar to /home/bamboo-agent/bamboo-agent/xml-data/build-dir/REFAPP-UI-FRAMEWORK/package/target/distro/web/modules/emrapi-1.32.0-SNAPSHOT.omod
02-Aug-2021 21:45:53 [INFO] Copying referenceapplication-omod-2.12.0-SNAPSHOT.jar to /home/bamboo-agent/bamboo-agent/xml-data/build-dir/REFAPP-UI-FRAMEWORK/package/target/distro/web/modules/referenceapplication-2.12.0-SNAPSHOT.omod
02-Aug-2021 21:45:53 [INFO] Copying htmlformentry-omod-4.0.2-SNAPSHOT.jar to /home/bamboo-agent/bamboo-agent/xml-data/build-dir/REFAPP-UI-FRAMEWORK/package/target/distro/web/modules/htmlformentry-4.0.2-SNAPSHOT.omod
02-Aug-2021 21:45:53 [INFO] Copying appframework-omod-2.16.0.jar to /home/bamboo-agent/bamboo-agent/xml-data/build-dir/REFAPP-UI-FRAMEWORK/package/target/distro/web/modules/appframework-2.16.0.omod
02-Aug-2021 21:45:53 [INFO] Copying referencemetadata-omod-2.12.0-SNAPSHOT.jar to /home/bamboo-agent/bamboo-agent/xml-data/build-dir/REFAPP-UI-FRAMEWORK/package/target/distro/web/modules/referencemetadata-2.12.0-SNAPSHOT.omod
02-Aug-2021 21:45:53 [INFO] Copying reportingui-omod-1.8.0.jar to /home/bamboo-agent/bamboo-agent/xml-data/build-dir/REFAPP-UI-FRAMEWORK/package/target/distro/web/modules/reportingui-1.8.0.omod
02-Aug-2021 21:45:53 [INFO] Copying coreapps-omod-1.33.0-SNAPSHOT.jar to /home/bamboo-agent/bamboo-agent/xml-data/build-dir/REFAPP-UI-FRAMEWORK/package/target/distro/web/modules/coreapps-1.33.0-SNAPSHOT.omod
02-Aug-2021 21:45:53 [INFO] Copying reportingcompatibility-omod-2.0.8.jar to /home/bamboo-agent/bamboo-agent/xml-data/build-dir/REFAPP-UI-FRAMEWORK/package/target/distro/web/modules/reportingcompatibility-2.0.8.omod
02-Aug-2021 21:45:53 [INFO] Copying reporting-omod-1.23.0.jar to /home/bamboo-agent/bamboo-agent/xml-data/build-dir/REFAPP-UI-FRAMEWORK/package/target/distro/web/modules/reporting-1.23.0.omod
02-Aug-2021 21:45:54 [INFO] Copying adminui-omod-1.5.0.jar to /home/bamboo-agent/bamboo-agent/xml-data/build-dir/REFAPP-UI-FRAMEWORK/package/target/distro/web/modules/adminui-1.5.0.omod
02-Aug-2021 21:45:54 [INFO] Copying registrationcore-omod-1.11.0.jar to /home/bamboo-agent/bamboo-agent/xml-data/build-dir/REFAPP-UI-FRAMEWORK/package/target/distro/web/modules/registrationcore-1.11.0.omod
02-Aug-2021 21:45:54 [INFO] Copying appointmentscheduling-omod-1.16.0.jar to /home/bamboo-agent/bamboo-agent/xml-data/build-dir/REFAPP-UI-FRAMEWORK/package/target/distro/web/modules/appointmentscheduling-1.16.0.omod
02-Aug-2021 21:45:54 [INFO] Copying atlas-omod-2.2.5.omod to /home/bamboo-agent/bamboo-agent/xml-data/build-dir/REFAPP-UI-FRAMEWORK/package/target/distro/web/modules/atlas-2.2.5.omod
02-Aug-2021 21:45:54 [INFO] Copying calculation-omod-1.3.0.jar to /home/bamboo-agent/bamboo-agent/xml-data/build-dir/REFAPP-UI-FRAMEWORK/package/target/distro/web/modules/calculation-1.3.0.omod
02-Aug-2021 21:45:54 [INFO] Copying webservices.rest-omod-2.32.0-SNAPSHOT.jar to /home/bamboo-agent/bamboo-agent/xml-data/build-dir/REFAPP-UI-FRAMEWORK/package/target/distro/web/modules/webservices.rest-2.32.0-SNAPSHOT.omod
02-Aug-2021 21:45:54 [INFO] Copying spa-omod-1.0.8.jar to /home/bamboo-agent/bamboo-agent/xml-data/build-dir/REFAPP-UI-FRAMEWORK/package/target/distro/web/modules/spa-1.0.8.omod
02-Aug-2021 21:45:54 [INFO] Copying uicommons-omod-2.18.0.jar to /home/bamboo-agent/bamboo-agent/xml-data/build-dir/REFAPP-UI-FRAMEWORK/package/target/distro/web/modules/uicommons-2.18.0.omod
02-Aug-2021 21:45:54 [INFO] Copying uiframework-omod-3.21.0.jar to /home/bamboo-agent/bamboo-agent/xml-data/build-dir/REFAPP-UI-FRAMEWORK/package/target/distro/web/modules/uiframework-3.21.0.omod
02-Aug-2021 21:45:54 [INFO] Copying metadatasharing-omod-1.8.0.jar to /home/bamboo-agent/bamboo-agent/xml-data/build-dir/REFAPP-UI-FRAMEWORK/package/target/distro/web/modules/metadatasharing-1.8.0.omod
02-Aug-2021 21:45:54
02-Aug-2021 21:45:54 Downloading OWAs...
02-Aug-2021 21:45:54
02-Aug-2021 21:45:54
02-Aug-2021 21:45:54 Downloading OWA: org.openmrs.owa:openmrs-owa-sysadmin:1.2
02-Aug-2021 21:45:54 [INFO] Configured Artifact: org.openmrs.owa:sysadmin:1.2:zip
02-Aug-2021 21:45:54 [INFO] Copying sysadmin-1.2.zip to /home/bamboo-agent/bamboo-agent/xml-data/build-dir/REFAPP-UI-FRAMEWORK/package/target/distro/web/owa/sysadmin-1.2.zip
02-Aug-2021 21:45:54
02-Aug-2021 21:45:54 Creating Docker Compose configuration...
02-Aug-2021 21:45:54
02-Aug-2021 21:45:56
02-Aug-2021 21:45:56 The 'referenceapplication' distribution created! To start up the server run 'docker-compose up' from /home/bamboo-agent/bamboo-agent/xml-data/build-dir/REFAPP-UI-FRAMEWORK/package/target/distro
02-Aug-2021 21:45:56
02-Aug-2021 21:45:56 [INFO]
02-Aug-2021 21:45:56 [INFO] --- openmrs-sdk-maven-plugin:4.0.0:build-distro (build-bundled-distro) @ referenceapplication-package ---
02-Aug-2021 21:45:56
02-Aug-2021 21:45:56 Downloading modules...
02-Aug-2021 21:45:56
02-Aug-2021 21:45:56 [INFO] Configured Artifact: org.openmrs.web:openmrs-webapp:2.4.0:war
02-Aug-2021 21:45:56 [INFO] Copying openmrs-webapp-2.4.0.war to /home/bamboo-agent/bamboo-agent/xml-data/build-dir/REFAPP-UI-FRAMEWORK/package/target/bundled-distro/web/openmrs-2.4.0.war
02-Aug-2021 21:45:56 file:/home/bamboo-agent/bamboo-agent/xml-data/build-dir/REFAPP-UI-FRAMEWORK/package/target/bundled-distro/web/openmrs-2.4.0.war
02-Aug-2021 21:45:56 target:/home/bamboo-agent/bamboo-agent/xml-data/build-dir/REFAPP-UI-FRAMEWORK/package/target/bundled-distro/web
02-Aug-2021 21:45:56 [INFO] Configured Artifact: org.openmrs.module:addresshierarchy-omod:2.14.2:jar
02-Aug-2021 21:45:56 [INFO] Configured Artifact: org.openmrs.module:legacyui-omod:1.8.3:jar
02-Aug-2021 21:45:56 [INFO] Configured Artifact: org.openmrs.module:openconceptlab-omod:1.2.6:jar
02-Aug-2021 21:45:56 [INFO] Configured Artifact: org.openmrs.module:metadatadeploy-omod:1.13.0:jar
02-Aug-2021 21:45:56 [INFO] Configured Artifact: org.openmrs.module:reportingrest-omod:1.12.0:jar
02-Aug-2021 21:45:56 [INFO] Configured Artifact: org.openmrs.module:owa-omod:1.13.0:jar
02-Aug-2021 21:45:56 [INFO] Configured Artifact: org.openmrs.module:fhir2-omod:1.2.2:jar
02-Aug-2021 21:45:56 [INFO] Configured Artifact: org.openmrs.module:serialization.xstream-omod:0.2.15:omod
02-Aug-2021 21:45:56 [INFO] Configured Artifact: org.openmrs.module:registrationapp-omod:1.24.0:jar
02-Aug-2021 21:45:56 [INFO] Configured Artifact: org.openmrs:event-omod:2.10.0-SNAPSHOT:jar
02-Aug-2021 21:45:56 [INFO] Configured Artifact: org.openmrs.module:uilibrary-omod:2.0.7:jar
02-Aug-2021 21:45:56 [INFO] Configured Artifact: org.openmrs.module:htmlwidgets-omod:1.10.0:jar
02-Aug-2021 21:45:56 [INFO] Configured Artifact: org.openmrs.module:dataexchange-omod:1.3.7:jar
02-Aug-2021 21:45:56 [INFO] Configured Artifact: org.openmrs.module:appui-omod:1.14.0:jar
02-Aug-2021 21:45:56 [INFO] Configured Artifact: org.openmrs.module:allergyui-omod:1.8.4:jar
02-Aug-2021 21:45:56 [INFO] Configured Artifact: org.openmrs.module:providermanagement-omod:2.13.0:jar
02-Aug-2021 21:45:56 [INFO] Configured Artifact: org.openmrs.module:appointmentschedulingui-omod:1.11.0:jar
02-Aug-2021 21:45:56 [INFO] Configured Artifact: org.openmrs.module:attachments-omod:2.5.0:jar
02-Aug-2021 21:45:56 [INFO] Configured Artifact: org.openmrs.module:formentryapp-omod:1.4.2:jar
02-Aug-2021 21:45:56 [INFO] Configured Artifact: org.openmrs.module:idgen-omod:4.7.0:jar
02-Aug-2021 21:45:56 [INFO] Configured Artifact: org.openmrs.module:metadatamapping-omod:1.4.0:jar
02-Aug-2021 21:45:56 [INFO] Configured Artifact: org.openmrs.module:htmlformentryui-omod:2.0.0-SNAPSHOT:jar
02-Aug-2021 21:45:56 [INFO] Configured Artifact: org.openmrs.module:referencedemodata-omod:1.4.7-SNAPSHOT:jar
02-Aug-2021 21:45:56 [INFO] Configured Artifact: org.openmrs.module:emrapi-omod:1.32.0-SNAPSHOT:jar
02-Aug-2021 21:45:56 [INFO] Configured Artifact: org.openmrs.module:referenceapplication-omod:2.12.0-SNAPSHOT:jar
02-Aug-2021 21:45:56 [INFO] Configured Artifact: org.openmrs.module:htmlformentry-omod:4.0.2-SNAPSHOT:jar
02-Aug-2021 21:45:56 [INFO] Configured Artifact: org.openmrs.module:appframework-omod:2.16.0:jar
02-Aug-2021 21:45:56 [INFO] Configured Artifact: org.openmrs.module:referencemetadata-omod:2.12.0-SNAPSHOT:jar
02-Aug-2021 21:45:56 [INFO] Configured Artifact: org.openmrs.module:reportingui-omod:1.8.0:jar
02-Aug-2021 21:45:56 [INFO] Configured Artifact: org.openmrs.module:coreapps-omod:1.33.0-SNAPSHOT:jar
02-Aug-2021 21:45:56 [INFO] Configured Artifact: org.openmrs.module:reportingcompatibility-omod:2.0.8:jar
02-Aug-2021 21:45:56 [INFO] Configured Artifact: org.openmrs.module:reporting-omod:1.23.0:jar
02-Aug-2021 21:45:56 [INFO] Configured Artifact: org.openmrs.module:adminui-omod:1.5.0:jar
02-Aug-2021 21:45:56 [INFO] Configured Artifact: org.openmrs.module:registrationcore-omod:1.11.0:jar
02-Aug-2021 21:45:56 [INFO] Configured Artifact: org.openmrs.module:appointmentscheduling-omod:1.16.0:jar
02-Aug-2021 21:45:56 [INFO] Configured Artifact: org.openmrs.module:atlas-omod:2.2.5:omod
02-Aug-2021 21:45:56 [INFO] Configured Artifact: org.openmrs.module:calculation-omod:1.3.0:jar
02-Aug-2021 21:45:56 [INFO] Configured Artifact: org.openmrs.module:webservices.rest-omod:2.32.0-SNAPSHOT:jar
02-Aug-2021 21:45:56 [INFO] Configured Artifact: org.openmrs.module:spa-omod:1.0.8:jar
02-Aug-2021 21:45:56 [INFO] Configured Artifact: org.openmrs.module:uicommons-omod:2.18.0:jar
02-Aug-2021 21:45:56 [INFO] Configured Artifact: org.openmrs.module:uiframework-omod:3.21.0:jar
02-Aug-2021 21:45:56 [INFO] Configured Artifact: org.openmrs.module:metadatasharing-omod:1.8.0:jar
02-Aug-2021 21:45:56 [INFO] Copying addresshierarchy-omod-2.14.2.jar to /home/bamboo-agent/bamboo-agent/xml-data/build-dir/REFAPP-UI-FRAMEWORK/package/target/bundled-distro/web/WEB-INF/bundledModules/addresshierarchy-2.14.2.omod
02-Aug-2021 21:45:56 [INFO] Copying legacyui-omod-1.8.3.jar to /home/bamboo-agent/bamboo-agent/xml-data/build-dir/REFAPP-UI-FRAMEWORK/package/target/bundled-distro/web/WEB-INF/bundledModules/legacyui-1.8.3.omod
02-Aug-2021 21:45:56 [INFO] Copying openconceptlab-omod-1.2.6.jar to /home/bamboo-agent/bamboo-agent/xml-data/build-dir/REFAPP-UI-FRAMEWORK/package/target/bundled-distro/web/WEB-INF/bundledModules/openconceptlab-1.2.6.omod
02-Aug-2021 21:45:56 [INFO] Copying metadatadeploy-omod-1.13.0.jar to /home/bamboo-agent/bamboo-agent/xml-data/build-dir/REFAPP-UI-FRAMEWORK/package/target/bundled-distro/web/WEB-INF/bundledModules/metadatadeploy-1.13.0.omod
02-Aug-2021 21:45:56 [INFO] Copying reportingrest-omod-1.12.0.jar to /home/bamboo-agent/bamboo-agent/xml-data/build-dir/REFAPP-UI-FRAMEWORK/package/target/bundled-distro/web/WEB-INF/bundledModules/reportingrest-1.12.0.omod
02-Aug-2021 21:45:56 [INFO] Copying owa-omod-1.13.0.jar to /home/bamboo-agent/bamboo-agent/xml-data/build-dir/REFAPP-UI-FRAMEWORK/package/target/bundled-distro/web/WEB-INF/bundledModules/owa-1.13.0.omod
02-Aug-2021 21:45:56 [INFO] Copying fhir2-omod-1.2.2.jar to /home/bamboo-agent/bamboo-agent/xml-data/build-dir/REFAPP-UI-FRAMEWORK/package/target/bundled-distro/web/WEB-INF/bundledModules/fhir2-1.2.2.omod
02-Aug-2021 21:45:56 [INFO] Copying serialization.xstream-omod-0.2.15.omod to /home/bamboo-agent/bamboo-agent/xml-data/build-dir/REFAPP-UI-FRAMEWORK/package/target/bundled-distro/web/WEB-INF/bundledModules/serialization.xstream-0.2.15.omod
02-Aug-2021 21:45:56 [INFO] Copying registrationapp-omod-1.24.0.jar to /home/bamboo-agent/bamboo-agent/xml-data/build-dir/REFAPP-UI-FRAMEWORK/package/target/bundled-distro/web/WEB-INF/bundledModules/registrationapp-1.24.0.omod
02-Aug-2021 21:45:56 [INFO] Copying event-omod-2.10.0-SNAPSHOT.jar to /home/bamboo-agent/bamboo-agent/xml-data/build-dir/REFAPP-UI-FRAMEWORK/package/target/bundled-distro/web/WEB-INF/bundledModules/event-2.10.0-SNAPSHOT.omod
02-Aug-2021 21:45:56 [INFO] Copying uilibrary-omod-2.0.7.jar to /home/bamboo-agent/bamboo-agent/xml-data/build-dir/REFAPP-UI-FRAMEWORK/package/target/bundled-distro/web/WEB-INF/bundledModules/uilibrary-2.0.7.omod
02-Aug-2021 21:45:56 [INFO] Copying htmlwidgets-omod-1.10.0.jar to /home/bamboo-agent/bamboo-agent/xml-data/build-dir/REFAPP-UI-FRAMEWORK/package/target/bundled-distro/web/WEB-INF/bundledModules/htmlwidgets-1.10.0.omod
02-Aug-2021 21:45:56 [INFO] Copying dataexchange-omod-1.3.7.jar to /home/bamboo-agent/bamboo-agent/xml-data/build-dir/REFAPP-UI-FRAMEWORK/package/target/bundled-distro/web/WEB-INF/bundledModules/dataexchange-1.3.7.omod
02-Aug-2021 21:45:56 [INFO] Copying appui-omod-1.14.0.jar to /home/bamboo-agent/bamboo-agent/xml-data/build-dir/REFAPP-UI-FRAMEWORK/package/target/bundled-distro/web/WEB-INF/bundledModules/appui-1.14.0.omod
02-Aug-2021 21:45:56 [INFO] Copying allergyui-omod-1.8.4.jar to /home/bamboo-agent/bamboo-agent/xml-data/build-dir/REFAPP-UI-FRAMEWORK/package/target/bundled-distro/web/WEB-INF/bundledModules/allergyui-1.8.4.omod
02-Aug-2021 21:45:56 [INFO] Copying providermanagement-omod-2.13.0.jar to /home/bamboo-agent/bamboo-agent/xml-data/build-dir/REFAPP-UI-FRAMEWORK/package/target/bundled-distro/web/WEB-INF/bundledModules/providermanagement-2.13.0.omod
02-Aug-2021 21:45:56 [INFO] Copying appointmentschedulingui-omod-1.11.0.jar to /home/bamboo-agent/bamboo-agent/xml-data/build-dir/REFAPP-UI-FRAMEWORK/package/target/bundled-distro/web/WEB-INF/bundledModules/appointmentschedulingui-1.11.0.omod
02-Aug-2021 21:45:56 [INFO] Copying attachments-omod-2.5.0.jar to /home/bamboo-agent/bamboo-agent/xml-data/build-dir/REFAPP-UI-FRAMEWORK/package/target/bundled-distro/web/WEB-INF/bundledModules/attachments-2.5.0.omod
02-Aug-2021 21:45:56 [INFO] Copying formentryapp-omod-1.4.2.jar to /home/bamboo-agent/bamboo-agent/xml-data/build-dir/REFAPP-UI-FRAMEWORK/package/target/bundled-distro/web/WEB-INF/bundledModules/formentryapp-1.4.2.omod
02-Aug-2021 21:45:56 [INFO] Copying idgen-omod-4.7.0.jar to /home/bamboo-agent/bamboo-agent/xml-data/build-dir/REFAPP-UI-FRAMEWORK/package/target/bundled-distro/web/WEB-INF/bundledModules/idgen-4.7.0.omod
02-Aug-2021 21:45:56 [INFO] Copying metadatamapping-omod-1.4.0.jar to /home/bamboo-agent/bamboo-agent/xml-data/build-dir/REFAPP-UI-FRAMEWORK/package/target/bundled-distro/web/WEB-INF/bundledModules/metadatamapping-1.4.0.omod
02-Aug-2021 21:45:56 [INFO] Copying htmlformentryui-omod-2.0.0-SNAPSHOT.jar to /home/bamboo-agent/bamboo-agent/xml-data/build-dir/REFAPP-UI-FRAMEWORK/package/target/bundled-distro/web/WEB-INF/bundledModules/htmlformentryui-2.0.0-SNAPSHOT.omod
02-Aug-2021 21:45:56 [INFO] Copying referencedemodata-omod-1.4.7-SNAPSHOT.jar to /home/bamboo-agent/bamboo-agent/xml-data/build-dir/REFAPP-UI-FRAMEWORK/package/target/bundled-distro/web/WEB-INF/bundledModules/referencedemodata-1.4.7-SNAPSHOT.omod
02-Aug-2021 21:45:56 [INFO] Copying emrapi-omod-1.32.0-SNAPSHOT.jar to /home/bamboo-agent/bamboo-agent/xml-data/build-dir/REFAPP-UI-FRAMEWORK/package/target/bundled-distro/web/WEB-INF/bundledModules/emrapi-1.32.0-SNAPSHOT.omod
02-Aug-2021 21:45:56 [INFO] Copying referenceapplication-omod-2.12.0-SNAPSHOT.jar to /home/bamboo-agent/bamboo-agent/xml-data/build-dir/REFAPP-UI-FRAMEWORK/package/target/bundled-distro/web/WEB-INF/bundledModules/referenceapplication-2.12.0-SNAPSHOT.omod
02-Aug-2021 21:45:56 [INFO] Copying htmlformentry-omod-4.0.2-SNAPSHOT.jar to /home/bamboo-agent/bamboo-agent/xml-data/build-dir/REFAPP-UI-FRAMEWORK/package/target/bundled-distro/web/WEB-INF/bundledModules/htmlformentry-4.0.2-SNAPSHOT.omod
02-Aug-2021 21:45:56 [INFO] Copying appframework-omod-2.16.0.jar to /home/bamboo-agent/bamboo-agent/xml-data/build-dir/REFAPP-UI-FRAMEWORK/package/target/bundled-distro/web/WEB-INF/bundledModules/appframework-2.16.0.omod
02-Aug-2021 21:45:56 [INFO] Copying referencemetadata-omod-2.12.0-SNAPSHOT.jar to /home/bamboo-agent/bamboo-agent/xml-data/build-dir/REFAPP-UI-FRAMEWORK/package/target/bundled-distro/web/WEB-INF/bundledModules/referencemetadata-2.12.0-SNAPSHOT.omod
02-Aug-2021 21:45:56 [INFO] Copying reportingui-omod-1.8.0.jar to /home/bamboo-agent/bamboo-agent/xml-data/build-dir/REFAPP-UI-FRAMEWORK/package/target/bundled-distro/web/WEB-INF/bundledModules/reportingui-1.8.0.omod
02-Aug-2021 21:45:56 [INFO] Copying coreapps-omod-1.33.0-SNAPSHOT.jar to /home/bamboo-agent/bamboo-agent/xml-data/build-dir/REFAPP-UI-FRAMEWORK/package/target/bundled-distro/web/WEB-INF/bundledModules/coreapps-1.33.0-SNAPSHOT.omod
02-Aug-2021 21:45:56 [INFO] Copying reportingcompatibility-omod-2.0.8.jar to /home/bamboo-agent/bamboo-agent/xml-data/build-dir/REFAPP-UI-FRAMEWORK/package/target/bundled-distro/web/WEB-INF/bundledModules/reportingcompatibility-2.0.8.omod
02-Aug-2021 21:45:56 [INFO] Copying reporting-omod-1.23.0.jar to /home/bamboo-agent/bamboo-agent/xml-data/build-dir/REFAPP-UI-FRAMEWORK/package/target/bundled-distro/web/WEB-INF/bundledModules/reporting-1.23.0.omod
02-Aug-2021 21:45:56 [INFO] Copying adminui-omod-1.5.0.jar to /home/bamboo-agent/bamboo-agent/xml-data/build-dir/REFAPP-UI-FRAMEWORK/package/target/bundled-distro/web/WEB-INF/bundledModules/adminui-1.5.0.omod
02-Aug-2021 21:45:56 [INFO] Copying registrationcore-omod-1.11.0.jar to /home/bamboo-agent/bamboo-agent/xml-data/build-dir/REFAPP-UI-FRAMEWORK/package/target/bundled-distro/web/WEB-INF/bundledModules/registrationcore-1.11.0.omod
02-Aug-2021 21:45:56 [INFO] Copying appointmentscheduling-omod-1.16.0.jar to /home/bamboo-agent/bamboo-agent/xml-data/build-dir/REFAPP-UI-FRAMEWORK/package/target/bundled-distro/web/WEB-INF/bundledModules/appointmentscheduling-1.16.0.omod
02-Aug-2021 21:45:56 [INFO] Copying atlas-omod-2.2.5.omod to /home/bamboo-agent/bamboo-agent/xml-data/build-dir/REFAPP-UI-FRAMEWORK/package/target/bundled-distro/web/WEB-INF/bundledModules/atlas-2.2.5.omod
02-Aug-2021 21:45:56 [INFO] Copying calculation-omod-1.3.0.jar to /home/bamboo-agent/bamboo-agent/xml-data/build-dir/REFAPP-UI-FRAMEWORK/package/target/bundled-distro/web/WEB-INF/bundledModules/calculation-1.3.0.omod
02-Aug-2021 21:45:56 [INFO] Copying webservices.rest-omod-2.32.0-SNAPSHOT.jar to /home/bamboo-agent/bamboo-agent/xml-data/build-dir/REFAPP-UI-FRAMEWORK/package/target/bundled-distro/web/WEB-INF/bundledModules/webservices.rest-2.32.0-SNAPSHOT.omod
02-Aug-2021 21:45:56 [INFO] Copying spa-omod-1.0.8.jar to /home/bamboo-agent/bamboo-agent/xml-data/build-dir/REFAPP-UI-FRAMEWORK/package/target/bundled-distro/web/WEB-INF/bundledModules/spa-1.0.8.omod
02-Aug-2021 21:45:56 [INFO] Copying uicommons-omod-2.18.0.jar to /home/bamboo-agent/bamboo-agent/xml-data/build-dir/REFAPP-UI-FRAMEWORK/package/target/bundled-distro/web/WEB-INF/bundledModules/uicommons-2.18.0.omod
02-Aug-2021 21:45:56 [INFO] Copying uiframework-omod-3.21.0.jar to /home/bamboo-agent/bamboo-agent/xml-data/build-dir/REFAPP-UI-FRAMEWORK/package/target/bundled-distro/web/WEB-INF/bundledModules/uiframework-3.21.0.omod
02-Aug-2021 21:45:56 [INFO] Copying metadatasharing-omod-1.8.0.jar to /home/bamboo-agent/bamboo-agent/xml-data/build-dir/REFAPP-UI-FRAMEWORK/package/target/bundled-distro/web/WEB-INF/bundledModules/metadatasharing-1.8.0.omod
02-Aug-2021 21:45:56
02-Aug-2021 21:45:56 Downloading OWAs...
02-Aug-2021 21:45:56
02-Aug-2021 21:45:56
02-Aug-2021 21:45:56 Downloading OWA: org.openmrs.owa:openmrs-owa-sysadmin:1.2
02-Aug-2021 21:45:56 [INFO] Configured Artifact: org.openmrs.owa:sysadmin:1.2:zip
02-Aug-2021 21:45:56 [INFO] Copying sysadmin-1.2.zip to /home/bamboo-agent/bamboo-agent/xml-data/build-dir/REFAPP-UI-FRAMEWORK/package/target/bundled-distro/web/WEB-INF/bundledOwas/sysadmin-1.2.zip
02-Aug-2021 21:45:58
02-Aug-2021 21:45:58 Creating Docker Compose configuration...
02-Aug-2021 21:45:58
02-Aug-2021 21:45:59
02-Aug-2021 21:45:59 The 'referenceapplication' distribution created! To start up the server run 'docker-compose up' from /home/bamboo-agent/bamboo-agent/xml-data/build-dir/REFAPP-UI-FRAMEWORK/package/target/bundled-distro
02-Aug-2021 21:45:59
02-Aug-2021 21:45:59 [INFO]
02-Aug-2021 21:45:59 [INFO] --- maven-compiler-plugin:3.1:compile (default-compile) @ referenceapplication-package ---
02-Aug-2021 21:45:59 [INFO] No sources to compile
02-Aug-2021 21:45:59 [INFO]
02-Aug-2021 21:45:59 [INFO] --- maven-resources-plugin:2.6:testResources (default-testResources) @ referenceapplication-package ---
02-Aug-2021 21:45:59 [INFO] Using 'UTF-8' encoding to copy filtered resources.
02-Aug-2021 21:45:59 [INFO] skip non existing resourceDirectory /home/bamboo-agent/bamboo-agent/xml-data/build-dir/REFAPP-UI-FRAMEWORK/package/src/test/resources
02-Aug-2021 21:45:59 [INFO] skip non existing resourceDirectory /home/bamboo-agent/bamboo-agent/xml-data/build-dir/REFAPP-UI-FRAMEWORK/package/src/test/resources
02-Aug-2021 21:45:59 [INFO]
02-Aug-2021 21:45:59 [INFO] --- maven-compiler-plugin:3.1:testCompile (default-testCompile) @ referenceapplication-package ---
02-Aug-2021 21:45:59 [INFO] No sources to compile
02-Aug-2021 21:45:59 [INFO]
02-Aug-2021 21:45:59 [INFO] --- maven-surefire-plugin:2.12:test (default-test) @ referenceapplication-package ---
02-Aug-2021 21:46:00 [INFO] No tests to run.
02-Aug-2021 21:46:00 [INFO] Surefire report directory: /home/bamboo-agent/bamboo-agent/xml-data/build-dir/REFAPP-UI-FRAMEWORK/package/target/surefire-reports
02-Aug-2021 21:46:00
02-Aug-2021 21:46:00 -------------------------------------------------------
02-Aug-2021 21:46:00 T E S T S
02-Aug-2021 21:46:00 -------------------------------------------------------
02-Aug-2021 21:46:03
02-Aug-2021 21:46:03 Results :
02-Aug-2021 21:46:03
02-Aug-2021 21:46:03 Tests run: 0, Failures: 0, Errors: 0, Skipped: 0
02-Aug-2021 21:46:03
02-Aug-2021 21:46:03 [INFO]
02-Aug-2021 21:46:03 [INFO] --- maven-jar-plugin:2.4:jar (default-jar) @ referenceapplication-package ---
02-Aug-2021 21:46:03 [INFO] Building jar: /home/bamboo-agent/bamboo-agent/xml-data/build-dir/REFAPP-UI-FRAMEWORK/package/target/referenceapplication-package-2.12.0-SNAPSHOT.jar
02-Aug-2021 21:46:03 [INFO]
02-Aug-2021 21:46:03 [INFO] --- maven-assembly-plugin:2.3:single (make-assembly) @ referenceapplication-package ---
02-Aug-2021 21:46:04 [INFO] Reading assembly descriptor: /home/bamboo-agent/bamboo-agent/xml-data/build-dir/REFAPP-UI-FRAMEWORK/package/src/main/assembly/assembly.xml
02-Aug-2021 21:46:04 [INFO] Building zip: /home/bamboo-agent/bamboo-agent/xml-data/build-dir/REFAPP-UI-FRAMEWORK/package/target/referenceapplication-package-2.12.0-SNAPSHOT-addons.zip
02-Aug-2021 21:46:08 [INFO]
02-Aug-2021 21:46:08 [INFO] --- build-helper-maven-plugin:3.0.0:attach-artifact (attach-artifacts) @ referenceapplication-package ---
02-Aug-2021 21:46:09 [INFO]
02-Aug-2021 21:46:09 [INFO] --- maven-jar-plugin:2.4:test-jar (default) @ referenceapplication-package ---
02-Aug-2021 21:46:09 [WARNING] JAR will be empty - no content was marked for inclusion!
02-Aug-2021 21:46:09 [INFO] Building jar: /home/bamboo-agent/bamboo-agent/xml-data/build-dir/REFAPP-UI-FRAMEWORK/package/target/referenceapplication-package-2.12.0-SNAPSHOT-tests.jar
02-Aug-2021 21:46:09 [INFO]
02-Aug-2021 21:46:09 [INFO] --- maven-install-plugin:2.4:install (default-install) @ referenceapplication-package ---
02-Aug-2021 21:46:09 [INFO] Installing /home/bamboo-agent/bamboo-agent/xml-data/build-dir/REFAPP-UI-FRAMEWORK/package/target/referenceapplication-package-2.12.0-SNAPSHOT.jar to /home/bamboo-agent/.m2/repository/org/openmrs/distro/referenceapplication-package/2.12.0-SNAPSHOT/referenceapplication-package-2.12.0-SNAPSHOT.jar
02-Aug-2021 21:46:09 [INFO] Installing /home/bamboo-agent/bamboo-agent/xml-data/build-dir/REFAPP-UI-FRAMEWORK/package/pom.xml to /home/bamboo-agent/.m2/repository/org/openmrs/distro/referenceapplication-package/2.12.0-SNAPSHOT/referenceapplication-package-2.12.0-SNAPSHOT.pom
02-Aug-2021 21:46:09 [INFO] Installing /home/bamboo-agent/bamboo-agent/xml-data/build-dir/REFAPP-UI-FRAMEWORK/package/target/referenceapplication-package-2.12.0-SNAPSHOT-addons.zip to /home/bamboo-agent/.m2/repository/org/openmrs/distro/referenceapplication-package/2.12.0-SNAPSHOT/referenceapplication-package-2.12.0-SNAPSHOT-addons.zip
02-Aug-2021 21:46:09 [INFO] Installing /home/bamboo-agent/bamboo-agent/xml-data/build-dir/REFAPP-UI-FRAMEWORK/package/target/bundled-distro/web/openmrs.war to /home/bamboo-agent/.m2/repository/org/openmrs/distro/referenceapplication-package/2.12.0-SNAPSHOT/referenceapplication-package-2.12.0-SNAPSHOT.war
02-Aug-2021 21:46:09 [INFO] Installing /home/bamboo-agent/bamboo-agent/xml-data/build-dir/REFAPP-UI-FRAMEWORK/package/target/referenceapplication-package-2.12.0-SNAPSHOT-tests.jar to /home/bamboo-agent/.m2/repository/org/openmrs/distro/referenceapplication-package/2.12.0-SNAPSHOT/referenceapplication-package-2.12.0-SNAPSHOT-tests.jar
02-Aug-2021 21:46:09 [INFO]                                                                         
02-Aug-2021 21:46:09 [INFO] ------------------------------------------------------------------------
02-Aug-2021 21:46:09 [INFO] Building Reference Application Distribution UI Tests 2.12.0-SNAPSHOT
02-Aug-2021 21:46:09 [INFO] ------------------------------------------------------------------------
02-Aug-2021 21:46:10 [INFO]
02-Aug-2021 21:46:10 [INFO] --- maven-clean-plugin:2.5:clean (default-clean) @ referenceapplication-ui-tests ---
02-Aug-2021 21:46:10 [INFO]
02-Aug-2021 21:46:10 [INFO] --- maven-resources-plugin:2.6:resources (default-resources) @ referenceapplication-ui-tests ---
02-Aug-2021 21:46:10 [INFO] Using 'UTF-8' encoding to copy filtered resources.
02-Aug-2021 21:46:10 [INFO] skip non existing resourceDirectory /home/bamboo-agent/bamboo-agent/xml-data/build-dir/REFAPP-UI-FRAMEWORK/ui-tests/src/main/resources
02-Aug-2021 21:46:10 [INFO]
02-Aug-2021 21:46:10 [INFO] --- maven-compiler-plugin:3.1:compile (default-compile) @ referenceapplication-ui-tests ---
02-Aug-2021 21:46:10 [INFO] No sources to compile
02-Aug-2021 21:46:10 [INFO]
02-Aug-2021 21:46:10 [INFO] --- maven-resources-plugin:2.6:testResources (default-testResources) @ referenceapplication-ui-tests ---
02-Aug-2021 21:46:10 [INFO] Using 'UTF-8' encoding to copy filtered resources.
02-Aug-2021 21:46:10 [INFO] Copying 2 resources
02-Aug-2021 21:46:10 [INFO] Copying 2 resources
02-Aug-2021 21:46:10 [INFO]
02-Aug-2021 21:46:10 [INFO] --- maven-compiler-plugin:3.1:testCompile (default-testCompile) @ referenceapplication-ui-tests ---
02-Aug-2021 21:46:10 [INFO] Changes detected - recompiling the module!
02-Aug-2021 21:46:10 [INFO] Compiling 116 source files to /home/bamboo-agent/bamboo-agent/xml-data/build-dir/REFAPP-UI-FRAMEWORK/ui-tests/target/test-classes
02-Aug-2021 21:46:13 [WARNING] /home/bamboo-agent/bamboo-agent/xml-data/build-dir/REFAPP-UI-FRAMEWORK/ui-tests/src/test/java/org/openmrs/reference/AddDeleteLocationTest.java: Some input files use or override a deprecated API.
02-Aug-2021 21:46:13 [WARNING] /home/bamboo-agent/bamboo-agent/xml-data/build-dir/REFAPP-UI-FRAMEWORK/ui-tests/src/test/java/org/openmrs/reference/AddDeleteLocationTest.java: Recompile with -Xlint:deprecation for details.
02-Aug-2021 21:46:13 [WARNING] /home/bamboo-agent/bamboo-agent/xml-data/build-dir/REFAPP-UI-FRAMEWORK/ui-tests/src/test/java/org/openmrs/reference/AddRolesToUserTest.java: /home/bamboo-agent/bamboo-agent/xml-data/build-dir/REFAPP-UI-FRAMEWORK/ui-tests/src/test/java/org/openmrs/reference/AddRolesToUserTest.java uses unchecked or unsafe operations.
02-Aug-2021 21:46:13 [WARNING] /home/bamboo-agent/bamboo-agent/xml-data/build-dir/REFAPP-UI-FRAMEWORK/ui-tests/src/test/java/org/openmrs/reference/AddRolesToUserTest.java: Recompile with -Xlint:unchecked for details.
02-Aug-2021 21:46:13 [INFO]
02-Aug-2021 21:46:13 [INFO] --- maven-antrun-plugin:1.8:run (make-mac-chromedriver-executable) @ referenceapplication-ui-tests ---
02-Aug-2021 21:46:14 [INFO] Executing tasks
02-Aug-2021 21:46:14
02-Aug-2021 21:46:14 main:
02-Aug-2021 21:46:14 [INFO] An Ant BuildException has occured: /home/bamboo-agent/bamboo-agent/xml-data/build-dir/REFAPP-UI-FRAMEWORK/ui-tests/target/test-classes/chromedriver/mac does not exist.
02-Aug-2021 21:46:14 around Ant part ...<chmod file="target/test-classes/chromedriver/mac/chromedriver" perm="755"/>... @ 4:79 in /home/bamboo-agent/bamboo-agent/xml-data/build-dir/REFAPP-UI-FRAMEWORK/ui-tests/target/antrun/build-main.xml
02-Aug-2021 21:46:14 /home/bamboo-agent/bamboo-agent/xml-data/build-dir/REFAPP-UI-FRAMEWORK/ui-tests/target/antrun/build-main.xml:4: /home/bamboo-agent/bamboo-agent/xml-data/build-dir/REFAPP-UI-FRAMEWORK/ui-tests/target/test-classes/chromedriver/mac does not exist.
02-Aug-2021 21:46:14         at org.apache.tools.ant.types.AbstractFileSet.getDirectoryScanner(AbstractFileSet.java:484)
02-Aug-2021 21:46:14         at org.apache.tools.ant.taskdefs.ExecuteOn.runExec(ExecuteOn.java:369)
02-Aug-2021 21:46:14         at org.apache.tools.ant.taskdefs.ExecTask.execute(ExecTask.java:495)
02-Aug-2021 21:46:14         at org.apache.tools.ant.taskdefs.Chmod.execute(Chmod.java:181)
02-Aug-2021 21:46:14         at org.apache.tools.ant.UnknownElement.execute(UnknownElement.java:292)
02-Aug-2021 21:46:14         at sun.reflect.NativeMethodAccessorImpl.invoke0(Native Method)
02-Aug-2021 21:46:14         at sun.reflect.NativeMethodAccessorImpl.invoke(NativeMethodAccessorImpl.java:62)
02-Aug-2021 21:46:14         at sun.reflect.DelegatingMethodAccessorImpl.invoke(DelegatingMethodAccessorImpl.java:43)
02-Aug-2021 21:46:14         at java.lang.reflect.Method.invoke(Method.java:498)
02-Aug-2021 21:46:14         at org.apache.tools.ant.dispatch.DispatchUtils.execute(DispatchUtils.java:106)
02-Aug-2021 21:46:14         at org.apache.tools.ant.Task.perform(Task.java:348)
02-Aug-2021 21:46:14         at org.apache.tools.ant.Target.execute(Target.java:435)
02-Aug-2021 21:46:14         at org.apache.tools.ant.Target.performTasks(Target.java:456)
02-Aug-2021 21:46:14         at org.apache.tools.ant.Project.executeSortedTargets(Project.java:1393)
02-Aug-2021 21:46:14         at org.apache.tools.ant.Project.executeTarget(Project.java:1364)
02-Aug-2021 21:46:14         at org.apache.maven.plugin.antrun.AntRunMojo.execute(AntRunMojo.java:313)
02-Aug-2021 21:46:14         at org.apache.maven.plugin.DefaultBuildPluginManager.executeMojo(DefaultBuildPluginManager.java:134)
02-Aug-2021 21:46:14         at org.apache.maven.lifecycle.internal.MojoExecutor.execute(MojoExecutor.java:207)
02-Aug-2021 21:46:14         at org.apache.maven.lifecycle.internal.MojoExecutor.execute(MojoExecutor.java:153)
02-Aug-2021 21:46:14         at org.apache.maven.lifecycle.internal.MojoExecutor.execute(MojoExecutor.java:145)
02-Aug-2021 21:46:14         at org.apache.maven.lifecycle.internal.LifecycleModuleBuilder.buildProject(LifecycleModuleBuilder.java:116)
02-Aug-2021 21:46:14         at org.apache.maven.lifecycle.internal.LifecycleModuleBuilder.buildProject(LifecycleModuleBuilder.java:80)
02-Aug-2021 21:46:14         at org.apache.maven.lifecycle.internal.builder.singlethreaded.SingleThreadedBuilder.build(SingleThreadedBuilder.java:51)
02-Aug-2021 21:46:14         at org.apache.maven.lifecycle.internal.LifecycleStarter.execute(LifecycleStarter.java:128)
02-Aug-2021 21:46:14         at org.apache.maven.DefaultMaven.doExecute(DefaultMaven.java:307)
02-Aug-2021 21:46:14         at org.apache.maven.DefaultMaven.doExecute(DefaultMaven.java:193)
02-Aug-2021 21:46:14         at org.apache.maven.DefaultMaven.execute(DefaultMaven.java:106)
02-Aug-2021 21:46:14         at org.apache.maven.cli.MavenCli.execute(MavenCli.java:863)
02-Aug-2021 21:46:14         at org.apache.maven.cli.MavenCli.doMain(MavenCli.java:288)
02-Aug-2021 21:46:14         at org.apache.maven.cli.MavenCli.main(MavenCli.java:199)
02-Aug-2021 21:46:14         at sun.reflect.NativeMethodAccessorImpl.invoke0(Native Method)
02-Aug-2021 21:46:14         at sun.reflect.NativeMethodAccessorImpl.invoke(NativeMethodAccessorImpl.java:62)
02-Aug-2021 21:46:14         at sun.reflect.DelegatingMethodAccessorImpl.invoke(DelegatingMethodAccessorImpl.java:43)
02-Aug-2021 21:46:14         at java.lang.reflect.Method.invoke(Method.java:498)
02-Aug-2021 21:46:14         at org.codehaus.plexus.classworlds.launcher.Launcher.launchEnhanced(Launcher.java:289)
02-Aug-2021 21:46:14         at org.codehaus.plexus.classworlds.launcher.Launcher.launch(Launcher.java:229)
02-Aug-2021 21:46:14         at org.codehaus.plexus.classworlds.launcher.Launcher.mainWithExitCode(Launcher.java:415)
02-Aug-2021 21:46:14         at org.codehaus.plexus.classworlds.launcher.Launcher.main(Launcher.java:356)
02-Aug-2021 21:46:14 [INFO]
02-Aug-2021 21:46:14 [INFO] --- maven-antrun-plugin:1.8:run (make-linux-chromedriver-executable) @ referenceapplication-ui-tests ---
02-Aug-2021 21:46:14 [INFO] Executing tasks
02-Aug-2021 21:46:14
02-Aug-2021 21:46:14 main:
02-Aug-2021 21:46:14 [INFO] Executed tasks
02-Aug-2021 21:46:14 [INFO]
02-Aug-2021 21:46:14 [INFO] --- maven-antrun-plugin:1.8:run (make-mac-firefoxdriver-executable) @ referenceapplication-ui-tests ---
02-Aug-2021 21:46:14 [INFO] Executing tasks
02-Aug-2021 21:46:14
02-Aug-2021 21:46:14 main:
02-Aug-2021 21:46:14 [INFO] An Ant BuildException has occured: /home/bamboo-agent/bamboo-agent/xml-data/build-dir/REFAPP-UI-FRAMEWORK/ui-tests/target/test-classes/firefoxdriver/mac does not exist.
02-Aug-2021 21:46:14 around Ant part ...<chmod file="target/test-classes/firefoxdriver/mac/geckodriver" perm="755"/>... @ 4:79 in /home/bamboo-agent/bamboo-agent/xml-data/build-dir/REFAPP-UI-FRAMEWORK/ui-tests/target/antrun/build-main.xml
02-Aug-2021 21:46:14 /home/bamboo-agent/bamboo-agent/xml-data/build-dir/REFAPP-UI-FRAMEWORK/ui-tests/target/antrun/build-main.xml:4: /home/bamboo-agent/bamboo-agent/xml-data/build-dir/REFAPP-UI-FRAMEWORK/ui-tests/target/test-classes/firefoxdriver/mac does not exist.
02-Aug-2021 21:46:14         at org.apache.tools.ant.types.AbstractFileSet.getDirectoryScanner(AbstractFileSet.java:484)
02-Aug-2021 21:46:14         at org.apache.tools.ant.taskdefs.ExecuteOn.runExec(ExecuteOn.java:369)
02-Aug-2021 21:46:14         at org.apache.tools.ant.taskdefs.ExecTask.execute(ExecTask.java:495)
02-Aug-2021 21:46:14         at org.apache.tools.ant.taskdefs.Chmod.execute(Chmod.java:181)
02-Aug-2021 21:46:14         at org.apache.tools.ant.UnknownElement.execute(UnknownElement.java:292)
02-Aug-2021 21:46:14         at sun.reflect.NativeMethodAccessorImpl.invoke0(Native Method)
02-Aug-2021 21:46:14         at sun.reflect.NativeMethodAccessorImpl.invoke(NativeMethodAccessorImpl.java:62)
02-Aug-2021 21:46:14         at sun.reflect.DelegatingMethodAccessorImpl.invoke(DelegatingMethodAccessorImpl.java:43)
02-Aug-2021 21:46:14         at java.lang.reflect.Method.invoke(Method.java:498)
02-Aug-2021 21:46:14         at org.apache.tools.ant.dispatch.DispatchUtils.execute(DispatchUtils.java:106)
02-Aug-2021 21:46:14         at org.apache.tools.ant.Task.perform(Task.java:348)
02-Aug-2021 21:46:14         at org.apache.tools.ant.Target.execute(Target.java:435)
02-Aug-2021 21:46:14         at org.apache.tools.ant.Target.performTasks(Target.java:456)
02-Aug-2021 21:46:14         at org.apache.tools.ant.Project.executeSortedTargets(Project.java:1393)
02-Aug-2021 21:46:14         at org.apache.tools.ant.Project.executeTarget(Project.java:1364)
02-Aug-2021 21:46:14         at org.apache.maven.plugin.antrun.AntRunMojo.execute(AntRunMojo.java:313)
02-Aug-2021 21:46:14         at org.apache.maven.plugin.DefaultBuildPluginManager.executeMojo(DefaultBuildPluginManager.java:134)
02-Aug-2021 21:46:14         at org.apache.maven.lifecycle.internal.MojoExecutor.execute(MojoExecutor.java:207)
02-Aug-2021 21:46:14         at org.apache.maven.lifecycle.internal.MojoExecutor.execute(MojoExecutor.java:153)
02-Aug-2021 21:46:14         at org.apache.maven.lifecycle.internal.MojoExecutor.execute(MojoExecutor.java:145)
02-Aug-2021 21:46:14         at org.apache.maven.lifecycle.internal.LifecycleModuleBuilder.buildProject(LifecycleModuleBuilder.java:116)
02-Aug-2021 21:46:14         at org.apache.maven.lifecycle.internal.LifecycleModuleBuilder.buildProject(LifecycleModuleBuilder.java:80)
02-Aug-2021 21:46:14         at org.apache.maven.lifecycle.internal.builder.singlethreaded.SingleThreadedBuilder.build(SingleThreadedBuilder.java:51)
02-Aug-2021 21:46:14         at org.apache.maven.lifecycle.internal.LifecycleStarter.execute(LifecycleStarter.java:128)
02-Aug-2021 21:46:14         at org.apache.maven.DefaultMaven.doExecute(DefaultMaven.java:307)
02-Aug-2021 21:46:14         at org.apache.maven.DefaultMaven.doExecute(DefaultMaven.java:193)
02-Aug-2021 21:46:14         at org.apache.maven.DefaultMaven.execute(DefaultMaven.java:106)
02-Aug-2021 21:46:14         at org.apache.maven.cli.MavenCli.execute(MavenCli.java:863)
02-Aug-2021 21:46:14         at org.apache.maven.cli.MavenCli.doMain(MavenCli.java:288)
02-Aug-2021 21:46:14         at org.apache.maven.cli.MavenCli.main(MavenCli.java:199)
02-Aug-2021 21:46:14         at sun.reflect.NativeMethodAccessorImpl.invoke0(Native Method)
02-Aug-2021 21:46:14         at sun.reflect.NativeMethodAccessorImpl.invoke(NativeMethodAccessorImpl.java:62)
02-Aug-2021 21:46:14         at sun.reflect.DelegatingMethodAccessorImpl.invoke(DelegatingMethodAccessorImpl.java:43)
02-Aug-2021 21:46:14         at java.lang.reflect.Method.invoke(Method.java:498)
02-Aug-2021 21:46:14         at org.codehaus.plexus.classworlds.launcher.Launcher.launchEnhanced(Launcher.java:289)
02-Aug-2021 21:46:14         at org.codehaus.plexus.classworlds.launcher.Launcher.launch(Launcher.java:229)
02-Aug-2021 21:46:14         at org.codehaus.plexus.classworlds.launcher.Launcher.mainWithExitCode(Launcher.java:415)
02-Aug-2021 21:46:14         at org.codehaus.plexus.classworlds.launcher.Launcher.main(Launcher.java:356)
02-Aug-2021 21:46:14 [INFO]
02-Aug-2021 21:46:14 [INFO] --- maven-antrun-plugin:1.8:run (make-linux-firefoxdriver-executable) @ referenceapplication-ui-tests ---
02-Aug-2021 21:46:14 [INFO] Executing tasks
02-Aug-2021 21:46:14
02-Aug-2021 21:46:14 main:
02-Aug-2021 21:46:14 [INFO] Executed tasks
02-Aug-2021 21:46:14 [INFO]
02-Aug-2021 21:46:14 [INFO] --- maven-surefire-plugin:2.12:test (default-test) @ referenceapplication-ui-tests ---
02-Aug-2021 21:46:14 [INFO] Surefire report directory: /home/bamboo-agent/bamboo-agent/xml-data/build-dir/REFAPP-UI-FRAMEWORK/ui-tests/target/surefire-reports
02-Aug-2021 21:46:14
02-Aug-2021 21:46:14 -------------------------------------------------------
02-Aug-2021 21:46:14 T E S T S
02-Aug-2021 21:46:14 -------------------------------------------------------
02-Aug-2021 21:46:15 Running org.openmrs.reference.UnidentifiedPatientKeyboardTest
02-Aug-2021 21:46:15 Running locally...
02-Aug-2021 21:46:18 Starting ChromeDriver 90.0.4430.24 (4c6d850f087da467d926e8eddb76550aed655991-refs/branch-heads/4430@{#429}) on port 26883
02-Aug-2021 21:46:18 Only local connections are allowed.
02-Aug-2021 21:46:18 Please see https://chromedriver.chromium.org/security-considerations for suggestions on keeping ChromeDriver safe.
02-Aug-2021 21:46:18 ChromeDriver was started successfully.
02-Aug-2021 21:46:32 Aug 02, 2021 9:46:32 PM org.openqa.selenium.remote.ProtocolHandshake createSession
02-Aug-2021 21:46:32 INFO: Detected dialect: W3C
02-Aug-2021 21:46:43 Tests run: 1, Failures: 0, Errors: 0, Skipped: 0, Time elapsed: 28.041 sec
02-Aug-2021 21:46:43 Running org.openmrs.reference.DeleteAllergyTest
02-Aug-2021 21:46:43 Running locally...
02-Aug-2021 21:46:43 Starting ChromeDriver 90.0.4430.24 (4c6d850f087da467d926e8eddb76550aed655991-refs/branch-heads/4430@{#429}) on port 12685
02-Aug-2021 21:46:43 Only local connections are allowed.
02-Aug-2021 21:46:43 Please see https://chromedriver.chromium.org/security-considerations for suggestions on keeping ChromeDriver safe.
02-Aug-2021 21:46:43 ChromeDriver was started successfully.
02-Aug-2021 21:46:43 Aug 02, 2021 9:46:43 PM org.openqa.selenium.remote.ProtocolHandshake createSession
02-Aug-2021 21:46:43 INFO: Detected dialect: W3C
02-Aug-2021 21:46:52 Tests run: 1, Failures: 0, Errors: 0, Skipped: 0, Time elapsed: 9.828 sec
02-Aug-2021 21:46:52 Running org.openmrs.reference.SearchActiveVisitsTest
02-Aug-2021 21:46:52 Running locally...
02-Aug-2021 21:46:52 Starting ChromeDriver 90.0.4430.24 (4c6d850f087da467d926e8eddb76550aed655991-refs/branch-heads/4430@{#429}) on port 10542
02-Aug-2021 21:46:52 Only local connections are allowed.
02-Aug-2021 21:46:52 Please see https://chromedriver.chromium.org/security-considerations for suggestions on keeping ChromeDriver safe.
02-Aug-2021 21:46:52 ChromeDriver was started successfully.
02-Aug-2021 21:46:53 Aug 02, 2021 9:46:53 PM org.openqa.selenium.remote.ProtocolHandshake createSession
02-Aug-2021 21:46:53 INFO: Detected dialect: W3C
02-Aug-2021 21:46:58 Tests run: 1, Failures: 0, Errors: 0, Skipped: 0, Time elapsed: 5.378 sec
02-Aug-2021 21:46:58 Running org.openmrs.reference.AddVisitTypeTest
02-Aug-2021 21:46:58 Running locally...
02-Aug-2021 21:46:58 Starting ChromeDriver 90.0.4430.24 (4c6d850f087da467d926e8eddb76550aed655991-refs/branch-heads/4430@{#429}) on port 23856
02-Aug-2021 21:46:58 Only local connections are allowed.
02-Aug-2021 21:46:58 Please see https://chromedriver.chromium.org/security-considerations for suggestions on keeping ChromeDriver safe.
02-Aug-2021 21:46:58 ChromeDriver was started successfully.
02-Aug-2021 21:46:58 Aug 02, 2021 9:46:58 PM org.openqa.selenium.remote.ProtocolHandshake createSession
02-Aug-2021 21:46:58 INFO: Detected dialect: W3C
02-Aug-2021 21:47:03 Tests run: 1, Failures: 0, Errors: 0, Skipped: 0, Time elapsed: 5.402 sec
02-Aug-2021 21:47:03 Running org.openmrs.reference.FindPatientRecordTest
02-Aug-2021 21:47:03 Running locally...
02-Aug-2021 21:47:03 Starting ChromeDriver 90.0.4430.24 (4c6d850f087da467d926e8eddb76550aed655991-refs/branch-heads/4430@{#429}) on port 27210
02-Aug-2021 21:47:03 Only local connections are allowed.
02-Aug-2021 21:47:03 Please see https://chromedriver.chromium.org/security-considerations for suggestions on keeping ChromeDriver safe.
02-Aug-2021 21:47:03 ChromeDriver was started successfully.
02-Aug-2021 21:47:04 Aug 02, 2021 9:47:04 PM org.openqa.selenium.remote.ProtocolHandshake createSession
02-Aug-2021 21:47:04 INFO: Detected dialect: W3C
02-Aug-2021 21:47:09 Tests run: 1, Failures: 0, Errors: 0, Skipped: 0, Time elapsed: 5.341 sec
02-Aug-2021 21:47:09 Running org.openmrs.reference.EditPersonTest
02-Aug-2021 21:47:09 Running locally...
02-Aug-2021 21:47:09 Starting ChromeDriver 90.0.4430.24 (4c6d850f087da467d926e8eddb76550aed655991-refs/branch-heads/4430@{#429}) on port 21119
02-Aug-2021 21:47:09 Only local connections are allowed.
02-Aug-2021 21:47:09 Please see https://chromedriver.chromium.org/security-considerations for suggestions on keeping ChromeDriver safe.
02-Aug-2021 21:47:09 ChromeDriver was started successfully.
02-Aug-2021 21:47:09 Aug 02, 2021 9:47:09 PM org.openqa.selenium.remote.ProtocolHandshake createSession
02-Aug-2021 21:47:09 INFO: Detected dialect: W3C
02-Aug-2021 21:47:14 Tests run: 1, Failures: 0, Errors: 0, Skipped: 0, Time elapsed: 5.628 sec
02-Aug-2021 21:47:14 Running org.openmrs.reference.RetireLocationTest
02-Aug-2021 21:47:14 Running locally...
02-Aug-2021 21:47:14 Starting ChromeDriver 90.0.4430.24 (4c6d850f087da467d926e8eddb76550aed655991-refs/branch-heads/4430@{#429}) on port 12346
02-Aug-2021 21:47:14 Only local connections are allowed.
02-Aug-2021 21:47:14 Please see https://chromedriver.chromium.org/security-considerations for suggestions on keeping ChromeDriver safe.
02-Aug-2021 21:47:14 ChromeDriver was started successfully.
02-Aug-2021 21:47:15 Aug 02, 2021 9:47:14 PM org.openqa.selenium.remote.ProtocolHandshake createSession
02-Aug-2021 21:47:15 INFO: Detected dialect: W3C
02-Aug-2021 21:47:18 Tests run: 1, Failures: 0, Errors: 0, Skipped: 0, Time elapsed: 3.522 sec
02-Aug-2021 21:47:18 Running org.openmrs.reference.XSSOnPhoneNumberFieldTest
02-Aug-2021 21:47:18 Tests run: 1, Failures: 0, Errors: 0, Skipped: 1, Time elapsed: 0.005 sec
02-Aug-2021 21:47:18 Running org.openmrs.reference.TransferToWardServiceTest
02-Aug-2021 21:47:18 Running locally...
02-Aug-2021 21:47:18 Starting ChromeDriver 90.0.4430.24 (4c6d850f087da467d926e8eddb76550aed655991-refs/branch-heads/4430@{#429}) on port 13259
02-Aug-2021 21:47:18 Only local connections are allowed.
02-Aug-2021 21:47:18 Please see https://chromedriver.chromium.org/security-considerations for suggestions on keeping ChromeDriver safe.
02-Aug-2021 21:47:18 ChromeDriver was started successfully.
02-Aug-2021 21:47:18 Aug 02, 2021 9:47:18 PM org.openqa.selenium.remote.ProtocolHandshake createSession
02-Aug-2021 21:47:18 INFO: Detected dialect: W3C
02-Aug-2021 21:47:34 Tests run: 1, Failures: 0, Errors: 0, Skipped: 0, Time elapsed: 16.298 sec
02-Aug-2021 21:47:34 Running org.openmrs.reference.EditVisitTypeTest
02-Aug-2021 21:47:34 Running locally...
02-Aug-2021 21:47:34 Starting ChromeDriver 90.0.4430.24 (4c6d850f087da467d926e8eddb76550aed655991-refs/branch-heads/4430@{#429}) on port 17177
02-Aug-2021 21:47:34 Only local connections are allowed.
02-Aug-2021 21:47:34 Please see https://chromedriver.chromium.org/security-considerations for suggestions on keeping ChromeDriver safe.
02-Aug-2021 21:47:34 ChromeDriver was started successfully.
02-Aug-2021 21:47:34 Aug 02, 2021 9:47:34 PM org.openqa.selenium.remote.ProtocolHandshake createSession
02-Aug-2021 21:47:34 INFO: Detected dialect: W3C
02-Aug-2021 21:47:39 Tests run: 1, Failures: 0, Errors: 0, Skipped: 0, Time elapsed: 4.469 sec
02-Aug-2021 21:47:39 Running org.openmrs.reference.ComeBackToApplicationAfterLogoutTest
02-Aug-2021 21:47:39 Running locally...
02-Aug-2021 21:47:39 Starting ChromeDriver 90.0.4430.24 (4c6d850f087da467d926e8eddb76550aed655991-refs/branch-heads/4430@{#429}) on port 16297
02-Aug-2021 21:47:39 Only local connections are allowed.
02-Aug-2021 21:47:39 Please see https://chromedriver.chromium.org/security-considerations for suggestions on keeping ChromeDriver safe.
02-Aug-2021 21:47:39 ChromeDriver was started successfully.
02-Aug-2021 21:47:39 Aug 02, 2021 9:47:39 PM org.openqa.selenium.remote.ProtocolHandshake createSession
02-Aug-2021 21:47:39 INFO: Detected dialect: W3C
02-Aug-2021 21:47:41 Tests run: 1, Failures: 0, Errors: 0, Skipped: 0, Time elapsed: 2.285 sec
02-Aug-2021 21:47:41 Running org.openmrs.reference.EditDemographicTest
02-Aug-2021 21:47:41 Running locally...
02-Aug-2021 21:47:41 Starting ChromeDriver 90.0.4430.24 (4c6d850f087da467d926e8eddb76550aed655991-refs/branch-heads/4430@{#429}) on port 30989
02-Aug-2021 21:47:41 Only local connections are allowed.
02-Aug-2021 21:47:41 Please see https://chromedriver.chromium.org/security-considerations for suggestions on keeping ChromeDriver safe.
02-Aug-2021 21:47:41 ChromeDriver was started successfully.
02-Aug-2021 21:47:41 Aug 02, 2021 9:47:41 PM org.openqa.selenium.remote.ProtocolHandshake createSession
02-Aug-2021 21:47:41 INFO: Detected dialect: W3C
02-Aug-2021 21:47:43 POST person failed
02-Aug-2021 21:47:43 jakarta.ws.rs.ServerErrorException: HTTP 502 Bad Gateway
02-Aug-2021 21:47:43         at org.glassfish.jersey.client.JerseyInvocation.createExceptionForFamily(JerseyInvocation.java:941)
02-Aug-2021 21:47:43         at org.glassfish.jersey.client.JerseyInvocation.convertToException(JerseyInvocation.java:921)
02-Aug-2021 21:47:43         at org.glassfish.jersey.client.JerseyInvocation.translate(JerseyInvocation.java:712)
02-Aug-2021 21:47:43         at org.glassfish.jersey.client.JerseyInvocation.lambda$invoke$1(JerseyInvocation.java:632)
02-Aug-2021 21:47:43         at org.glassfish.jersey.client.JerseyInvocation.call(JerseyInvocation.java:654)
02-Aug-2021 21:47:43         at org.glassfish.jersey.client.JerseyInvocation.lambda$runInScope$3(JerseyInvocation.java:648)
02-Aug-2021 21:47:43         at org.glassfish.jersey.internal.Errors.process(Errors.java:292)
02-Aug-2021 21:47:43         at org.glassfish.jersey.internal.Errors.process(Errors.java:274)
02-Aug-2021 21:47:43         at org.glassfish.jersey.internal.Errors.process(Errors.java:205)
02-Aug-2021 21:47:43         at org.glassfish.jersey.process.internal.RequestScope.runInScope(RequestScope.java:390)
02-Aug-2021 21:47:43         at org.glassfish.jersey.client.JerseyInvocation.runInScope(JerseyInvocation.java:648)
02-Aug-2021 21:47:43         at org.glassfish.jersey.client.JerseyInvocation.invoke(JerseyInvocation.java:631)
02-Aug-2021 21:47:43         at org.glassfish.jersey.client.JerseyInvocation$Builder.method(JerseyInvocation.java:434)
02-Aug-2021 21:47:43         at org.glassfish.jersey.client.JerseyInvocation$Builder.post(JerseyInvocation.java:335)
02-Aug-2021 21:47:43         at org.openmrs.uitestframework.test.RestClient.post(RestClient.java:75)
02-Aug-2021 21:47:43         at org.openmrs.uitestframework.test.TestData$JsonTestClass.create(TestData.java:268)
02-Aug-2021 21:47:43         at org.openmrs.uitestframework.test.TestData$JsonTestClass.create(TestData.java:264)
02-Aug-2021 21:47:43         at org.openmrs.uitestframework.test.TestData.createPerson(TestData.java:144)
02-Aug-2021 21:47:43         at org.openmrs.uitestframework.test.TestBase.createTestPatient(TestBase.java:366)
02-Aug-2021 21:47:43         at org.openmrs.uitestframework.test.TestBase.createTestPatient(TestBase.java:372)
02-Aug-2021 21:47:43         at org.openmrs.reference.EditDemographicTest.setUp(EditDemographicTest.java:33)
02-Aug-2021 21:47:43         at sun.reflect.NativeMethodAccessorImpl.invoke0(Native Method)
02-Aug-2021 21:47:43         at sun.reflect.NativeMethodAccessorImpl.invoke(NativeMethodAccessorImpl.java:62)
02-Aug-2021 21:47:43         at sun.reflect.DelegatingMethodAccessorImpl.invoke(DelegatingMethodAccessorImpl.java:43)
02-Aug-2021 21:47:43         at java.lang.reflect.Method.invoke(Method.java:498)
02-Aug-2021 21:47:43         at org.junit.runners.model.FrameworkMethod$1.runReflectiveCall(FrameworkMethod.java:59)
02-Aug-2021 21:47:43         at org.junit.internal.runners.model.ReflectiveCallable.run(ReflectiveCallable.java:12)
02-Aug-2021 21:47:43         at org.junit.runners.model.FrameworkMethod.invokeExplosively(FrameworkMethod.java:56)
02-Aug-2021 21:47:43         at org.junit.internal.runners.statements.RunBefores.invokeMethod(RunBefores.java:33)
02-Aug-2021 21:47:43         at org.junit.internal.runners.statements.RunBefores.evaluate(RunBefores.java:24)
02-Aug-2021 21:47:43         at org.junit.internal.runners.statements.RunAfters.evaluate(RunAfters.java:27)
02-Aug-2021 21:47:43         at org.junit.rules.TestWatcher$1.evaluate(TestWatcher.java:61)
02-Aug-2021 21:47:43         at org.junit.rules.TestWatcher$1.evaluate(TestWatcher.java:61)
02-Aug-2021 21:47:43         at org.junit.runners.ParentRunner$3.evaluate(ParentRunner.java:306)
02-Aug-2021 21:47:43         at org.junit.runners.BlockJUnit4ClassRunner$1.evaluate(BlockJUnit4ClassRunner.java:100)
02-Aug-2021 21:47:43         at org.junit.runners.ParentRunner.runLeaf(ParentRunner.java:366)
02-Aug-2021 21:47:43         at org.junit.runners.BlockJUnit4ClassRunner.runChild(BlockJUnit4ClassRunner.java:103)
02-Aug-2021 21:47:43         at org.junit.runners.BlockJUnit4ClassRunner.runChild(BlockJUnit4ClassRunner.java:63)
02-Aug-2021 21:47:43         at org.junit.runners.ParentRunner$4.run(ParentRunner.java:331)
02-Aug-2021 21:47:43         at org.junit.runners.ParentRunner$1.schedule(ParentRunner.java:79)
02-Aug-2021 21:47:43         at org.junit.runners.ParentRunner.runChildren(ParentRunner.java:329)
02-Aug-2021 21:47:43         at org.junit.runners.ParentRunner.access$100(ParentRunner.java:66)
02-Aug-2021 21:47:43         at org.junit.runners.ParentRunner$2.evaluate(ParentRunner.java:293)
02-Aug-2021 21:47:43         at org.junit.runners.ParentRunner$3.evaluate(ParentRunner.java:306)
02-Aug-2021 21:47:43         at org.junit.runners.ParentRunner.run(ParentRunner.java:413)
02-Aug-2021 21:47:43         at org.apache.maven.surefire.junit4.JUnit4Provider.execute(JUnit4Provider.java:236)
02-Aug-2021 21:47:43         at org.apache.maven.surefire.junit4.JUnit4Provider.executeTestSet(JUnit4Provider.java:134)
02-Aug-2021 21:47:43         at org.apache.maven.surefire.junit4.JUnit4Provider.invoke(JUnit4Provider.java:113)
02-Aug-2021 21:47:43         at sun.reflect.NativeMethodAccessorImpl.invoke0(Native Method)
02-Aug-2021 21:47:43         at sun.reflect.NativeMethodAccessorImpl.invoke(NativeMethodAccessorImpl.java:62)
02-Aug-2021 21:47:43         at sun.reflect.DelegatingMethodAccessorImpl.invoke(DelegatingMethodAccessorImpl.java:43)
02-Aug-2021 21:47:43         at java.lang.reflect.Method.invoke(Method.java:498)
02-Aug-2021 21:47:43         at org.apache.maven.surefire.util.ReflectionUtils.invokeMethodWithArray(ReflectionUtils.java:189)
02-Aug-2021 21:47:43         at org.apache.maven.surefire.booter.ProviderFactory$ProviderProxy.invoke(ProviderFactory.java:165)
02-Aug-2021 21:47:43         at org.apache.maven.surefire.booter.ProviderFactory.invokeProvider(ProviderFactory.java:85)
02-Aug-2021 21:47:43         at org.apache.maven.surefire.booter.ForkedBooter.runSuitesInProcess(ForkedBooter.java:103)
02-Aug-2021 21:47:43         at org.apache.maven.surefire.booter.ForkedBooter.main(ForkedBooter.java:74)
02-Aug-2021 21:47:43 Tests run: 2, Failures: 0, Errors: 2, Skipped: 0, Time elapsed: 2.146 sec <<< FAILURE!
02-Aug-2021 21:47:43 Running org.openmrs.reference.DeleteVisitTypeTest
02-Aug-2021 21:47:43 Running locally...
02-Aug-2021 21:47:43 Starting ChromeDriver 90.0.4430.24 (4c6d850f087da467d926e8eddb76550aed655991-refs/branch-heads/4430@{#429}) on port 29589
02-Aug-2021 21:47:43 Only local connections are allowed.
02-Aug-2021 21:47:43 Please see https://chromedriver.chromium.org/security-considerations for suggestions on keeping ChromeDriver safe.
02-Aug-2021 21:47:43 ChromeDriver was started successfully.
02-Aug-2021 21:47:43 Aug 02, 2021 9:47:43 PM org.openqa.selenium.remote.ProtocolHandshake createSession
02-Aug-2021 21:47:43 INFO: Detected dialect: W3C
02-Aug-2021 21:47:43 Test killed due to server failure in DeleteVisitTypeTest.deleteVisitTypeTest
02-Aug-2021 21:47:43 jakarta.ws.rs.ServerErrorException: Bad Gateway
02-Aug-2021 21:47:43         at org.openmrs.uitestframework.test.TestBase.goToLoginPage(TestBase.java:245)
02-Aug-2021 21:47:43         at org.openmrs.uitestframework.test.TestBase.login(TestBase.java:231)
02-Aug-2021 21:47:43         at org.openmrs.uitestframework.test.TestBase.launchBrowser(TestBase.java:191)
02-Aug-2021 21:47:43         at org.openmrs.uitestframework.test.TestBase.startWebDriver(TestBase.java:130)
02-Aug-2021 21:47:43         at sun.reflect.NativeMethodAccessorImpl.invoke0(Native Method)
02-Aug-2021 21:47:43         at sun.reflect.NativeMethodAccessorImpl.invoke(NativeMethodAccessorImpl.java:62)
02-Aug-2021 21:47:43         at sun.reflect.DelegatingMethodAccessorImpl.invoke(DelegatingMethodAccessorImpl.java:43)
02-Aug-2021 21:47:43         at java.lang.reflect.Method.invoke(Method.java:498)
02-Aug-2021 21:47:43         at org.junit.runners.model.FrameworkMethod$1.runReflectiveCall(FrameworkMethod.java:59)
02-Aug-2021 21:47:43         at org.junit.internal.runners.model.ReflectiveCallable.run(ReflectiveCallable.java:12)
02-Aug-2021 21:47:43         at org.junit.runners.model.FrameworkMethod.invokeExplosively(FrameworkMethod.java:56)
02-Aug-2021 21:47:43         at org.junit.internal.runners.statements.RunBefores.invokeMethod(RunBefores.java:33)
02-Aug-2021 21:47:43         at org.junit.internal.runners.statements.RunBefores.evaluate(RunBefores.java:24)
02-Aug-2021 21:47:43         at org.junit.internal.runners.statements.RunAfters.evaluate(RunAfters.java:27)
02-Aug-2021 21:47:43         at org.junit.rules.TestWatcher$1.evaluate(TestWatcher.java:61)
02-Aug-2021 21:47:43         at org.junit.rules.TestWatcher$1.evaluate(TestWatcher.java:61)
02-Aug-2021 21:47:43         at org.junit.runners.ParentRunner$3.evaluate(ParentRunner.java:306)
02-Aug-2021 21:47:43         at org.junit.runners.BlockJUnit4ClassRunner$1.evaluate(BlockJUnit4ClassRunner.java:100)
02-Aug-2021 21:47:43         at org.junit.runners.ParentRunner.runLeaf(ParentRunner.java:366)
02-Aug-2021 21:47:43         at org.junit.runners.BlockJUnit4ClassRunner.runChild(BlockJUnit4ClassRunner.java:103)
02-Aug-2021 21:47:43         at org.junit.runners.BlockJUnit4ClassRunner.runChild(BlockJUnit4ClassRunner.java:63)
02-Aug-2021 21:47:43         at org.junit.runners.ParentRunner$4.run(ParentRunner.java:331)
02-Aug-2021 21:47:43         at org.junit.runners.ParentRunner$1.schedule(ParentRunner.java:79)
02-Aug-2021 21:47:43         at org.junit.runners.ParentRunner.runChildren(ParentRunner.java:329)
02-Aug-2021 21:47:43         at org.junit.runners.ParentRunner.access$100(ParentRunner.java:66)
02-Aug-2021 21:47:43         at org.junit.runners.ParentRunner$2.evaluate(ParentRunner.java:293)
02-Aug-2021 21:47:43         at org.junit.runners.ParentRunner$3.evaluate(ParentRunner.java:306)
02-Aug-2021 21:47:43         at org.junit.runners.ParentRunner.run(ParentRunner.java:413)
02-Aug-2021 21:47:43         at org.apache.maven.surefire.junit4.JUnit4Provider.execute(JUnit4Provider.java:236)
02-Aug-2021 21:47:43         at org.apache.maven.surefire.junit4.JUnit4Provider.executeTestSet(JUnit4Provider.java:134)
02-Aug-2021 21:47:43         at org.apache.maven.surefire.junit4.JUnit4Provider.invoke(JUnit4Provider.java:113)
02-Aug-2021 21:47:43         at sun.reflect.NativeMethodAccessorImpl.invoke0(Native Method)
02-Aug-2021 21:47:43         at sun.reflect.NativeMethodAccessorImpl.invoke(NativeMethodAccessorImpl.java:62)
02-Aug-2021 21:47:43         at sun.reflect.DelegatingMethodAccessorImpl.invoke(DelegatingMethodAccessorImpl.java:43)
02-Aug-2021 21:47:43         at java.lang.reflect.Method.invoke(Method.java:498)
02-Aug-2021 21:47:43         at org.apache.maven.surefire.util.ReflectionUtils.invokeMethodWithArray(ReflectionUtils.java:189)
02-Aug-2021 21:47:43         at org.apache.maven.surefire.booter.ProviderFactory$ProviderProxy.invoke(ProviderFactory.java:165)
02-Aug-2021 21:47:43         at org.apache.maven.surefire.booter.ProviderFactory.invokeProvider(ProviderFactory.java:85)
02-Aug-2021 21:47:43         at org.apache.maven.surefire.booter.ForkedBooter.runSuitesInProcess(ForkedBooter.java:103)
02-Aug-2021 21:47:43         at org.apache.maven.surefire.booter.ForkedBooter.main(ForkedBooter.java:74)
02-Aug-2021 21:47:43 Tests run: 3, Failures: 1, Errors: 2, Skipped: 0, Time elapsed: 0.527 sec <<< FAILURE!
02-Aug-2021 21:47:43 Running org.openmrs.reference.FormTest
02-Aug-2021 21:47:43 Tests run: 1, Failures: 0, Errors: 0, Skipped: 1, Time elapsed: 0.003 sec
02-Aug-2021 21:47:43 Running org.openmrs.reference.RegisterUnidentifiedPatientTest
02-Aug-2021 21:47:43 Tests run: 2, Failures: 1, Errors: 1, Skipped: 0, Time elapsed: 0.004 sec <<< FAILURE!
02-Aug-2021 21:47:44 Running org.openmrs.reference.AddPatientAppointmentTest
02-Aug-2021 21:47:44 Tests run: 1, Failures: 0, Errors: 0, Skipped: 1, Time elapsed: 0.001 sec
02-Aug-2021 21:47:44 Running org.openmrs.reference.AdmitExitInpatientTest
02-Aug-2021 21:47:44 Tests run: 1, Failures: 1, Errors: 0, Skipped: 0, Time elapsed: 0.003 sec <<< FAILURE!
02-Aug-2021 21:47:44 Running org.openmrs.reference.DeleteRequestAppointmentTest
02-Aug-2021 21:47:44 Tests run: 1, Failures: 1, Errors: 0, Skipped: 0, Time elapsed: 0.024 sec <<< FAILURE!
02-Aug-2021 21:47:44 Running org.openmrs.reference.EditAllergyTest
02-Aug-2021 21:47:44 Tests run: 1, Failures: 1, Errors: 0, Skipped: 0, Time elapsed: 0 sec <<< FAILURE!
02-Aug-2021 21:47:44 Running org.openmrs.reference.VisitNoteTest
02-Aug-2021 21:47:44 Tests run: 1, Failures: 0, Errors: 0, Skipped: 1, Time elapsed: 0 sec
02-Aug-2021 21:47:44 Running org.openmrs.reference.CreatePersonTest
02-Aug-2021 21:47:44 Tests run: 1, Failures: 1, Errors: 0, Skipped: 0, Time elapsed: 0.013 sec <<< FAILURE!
02-Aug-2021 21:47:44 Running org.openmrs.reference.FindPatientByNameTest
02-Aug-2021 21:47:44 Tests run: 2, Failures: 1, Errors: 1, Skipped: 0, Time elapsed: 0 sec <<< FAILURE!
02-Aug-2021 21:47:44 Running org.openmrs.reference.AddUserTest
02-Aug-2021 21:47:44 Tests run: 1, Failures: 1, Errors: 0, Skipped: 0, Time elapsed: 0 sec <<< FAILURE!
02-Aug-2021 21:47:44 Running org.openmrs.reference.AddProviderTest
02-Aug-2021 21:47:44 Tests run: 2, Failures: 1, Errors: 1, Skipped: 0, Time elapsed: 0.061 sec <<< FAILURE!
02-Aug-2021 21:47:44 Running org.openmrs.reference.AddPastVisitTest
02-Aug-2021 21:47:44 Tests run: 1, Failures: 1, Errors: 0, Skipped: 0, Time elapsed: 0 sec <<< FAILURE!
02-Aug-2021 21:47:44 Running org.openmrs.reference.RecordMergeIssueTest
02-Aug-2021 21:47:44 Tests run: 2, Failures: 1, Errors: 1, Skipped: 0, Time elapsed: 0.018 sec <<< FAILURE!
02-Aug-2021 21:47:44 Running org.openmrs.reference.CaptureVitalsTest
02-Aug-2021 21:47:44 Tests run: 1, Failures: 1, Errors: 0, Skipped: 0, Time elapsed: 0 sec <<< FAILURE!
02-Aug-2021 21:47:44 Running org.openmrs.reference.NamePatientAccentedLetterTest
02-Aug-2021 21:47:44 Tests run: 2, Failures: 1, Errors: 1, Skipped: 0, Time elapsed: 0.001 sec <<< FAILURE!
02-Aug-2021 21:47:44 Running org.openmrs.reference.RetirePersonTest
02-Aug-2021 21:47:44 Tests run: 2, Failures: 1, Errors: 1, Skipped: 0, Time elapsed: 0.048 sec <<< FAILURE!
02-Aug-2021 21:47:44 Running org.openmrs.reference.EndVisitTest
02-Aug-2021 21:47:44 Tests run: 1, Failures: 1, Errors: 0, Skipped: 0, Time elapsed: 0 sec <<< FAILURE!
02-Aug-2021 21:47:44 Running org.openmrs.reference.DeleteAppointmentBlockTest
02-Aug-2021 21:47:44 Tests run: 1, Failures: 1, Errors: 0, Skipped: 0, Time elapsed: 0.014 sec <<< FAILURE!
02-Aug-2021 21:47:44 Running org.openmrs.reference.BookRequestAppointmentTest
02-Aug-2021 21:47:44 Tests run: 1, Failures: 0, Errors: 0, Skipped: 1, Time elapsed: 0.001 sec
02-Aug-2021 21:47:44 Running org.openmrs.reference.AddDeleteServiceTest
02-Aug-2021 21:47:44 Tests run: 1, Failures: 1, Errors: 0, Skipped: 0, Time elapsed: 0.003 sec <<< FAILURE!
02-Aug-2021 21:47:44 Running org.openmrs.reference.AddEditAppointmentBlockTest
02-Aug-2021 21:47:44 Tests run: 1, Failures: 1, Errors: 0, Skipped: 0, Time elapsed: 0.003 sec <<< FAILURE!
02-Aug-2021 21:47:44 Running org.openmrs.reference.RetireProviderTest
02-Aug-2021 21:47:44 Tests run: 2, Failures: 1, Errors: 1, Skipped: 0, Time elapsed: 0.037 sec <<< FAILURE!
02-Aug-2021 21:47:44 Running org.openmrs.reference.MergePatientTest
02-Aug-2021 21:47:44 Tests run: 1, Failures: 1, Errors: 0, Skipped: 0, Time elapsed: 0.002 sec <<< FAILURE!
02-Aug-2021 21:47:44 Running org.openmrs.reference.AddDeleteLocationTest
02-Aug-2021 21:47:44 Tests run: 2, Failures: 1, Errors: 1, Skipped: 0, Time elapsed: 0.035 sec <<< FAILURE!
02-Aug-2021 21:47:44 Running org.openmrs.reference.DuplicatePatientRegisterTest
02-Aug-2021 21:47:44 Tests run: 2, Failures: 1, Errors: 1, Skipped: 0, Time elapsed: 0.002 sec <<< FAILURE!
02-Aug-2021 21:47:44 Running org.openmrs.reference.UsingBackButtonInMergePatientTest
02-Aug-2021 21:47:44 Tests run: 2, Failures: 1, Errors: 1, Skipped: 0, Time elapsed: 0.003 sec <<< FAILURE!
02-Aug-2021 21:47:44 Running org.openmrs.reference.AddDiagnosisToVisitNoteTest
02-Aug-2021 21:47:44 Tests run: 1, Failures: 1, Errors: 0, Skipped: 0, Time elapsed: 0.002 sec <<< FAILURE!
02-Aug-2021 21:47:44 Running org.openmrs.reference.MergeVisitsTest
02-Aug-2021 21:47:44 Tests run: 2, Failures: 1, Errors: 1, Skipped: 0, Time elapsed: 0.003 sec <<< FAILURE!
02-Aug-2021 21:47:44 Running org.openmrs.reference.EditServiceTest
02-Aug-2021 21:47:44 Tests run: 1, Failures: 1, Errors: 0, Skipped: 0, Time elapsed: 0.002 sec <<< FAILURE!
02-Aug-2021 21:47:44 Running org.openmrs.reference.AddNewAllergyTest
02-Aug-2021 21:47:44 Tests run: 1, Failures: 1, Errors: 0, Skipped: 0, Time elapsed: 0.002 sec <<< FAILURE!
02-Aug-2021 21:47:44 Running org.openmrs.reference.LoginTest
02-Aug-2021 21:47:44 Tests run: 5, Failures: 5, Errors: 0, Skipped: 0, Time elapsed: 0.005 sec <<< FAILURE!
02-Aug-2021 21:47:44 Running org.openmrs.reference.DeleteProviderTest
02-Aug-2021 21:47:44 Tests run: 2, Failures: 1, Errors: 1, Skipped: 0, Time elapsed: 0.032 sec <<< FAILURE!
02-Aug-2021 21:47:44 Running org.openmrs.reference.RegisterPatientTest
02-Aug-2021 21:47:44 Tests run: 2, Failures: 1, Errors: 1, Skipped: 0, Time elapsed: 0 sec <<< FAILURE!
02-Aug-2021 21:47:44 Running org.openmrs.reference.ContactInfoTest
02-Aug-2021 21:47:44 Tests run: 1, Failures: 0, Errors: 0, Skipped: 1, Time elapsed: 0.001 sec
02-Aug-2021 21:47:44 Running org.openmrs.reference.StartVisitTest
02-Aug-2021 21:47:44 Tests run: 1, Failures: 1, Errors: 0, Skipped: 0, Time elapsed: 0.008 sec <<< FAILURE!
02-Aug-2021 21:47:44 Running org.openmrs.reference.DeletePersonTest
02-Aug-2021 21:47:44 Tests run: 2, Failures: 1, Errors: 1, Skipped: 0, Time elapsed: 0.036 sec <<< FAILURE!
02-Aug-2021 21:47:44 Running org.openmrs.reference.EditProviderTest
02-Aug-2021 21:47:44 Tests run: 2, Failures: 1, Errors: 1, Skipped: 0, Time elapsed: 0.034 sec <<< FAILURE!
02-Aug-2021 21:47:44 Running org.openmrs.reference.RetireVisitTypeTest
02-Aug-2021 21:47:44 Tests run: 2, Failures: 1, Errors: 1, Skipped: 0, Time elapsed: 0.031 sec <<< FAILURE!
02-Aug-2021 21:47:44
02-Aug-2021 21:47:44 Results :
02-Aug-2021 21:47:44
02-Aug-2021 21:47:44 Failed tests:   deleteVisitTypeTest(org.openmrs.reference.DeleteVisitTypeTest): Test killed due to server failure
02-Aug-2021 21:47:44   registerUnidentifiedPatientTest(org.openmrs.reference.RegisterUnidentifiedPatientTest): Test killed due to server failure
02-Aug-2021 21:47:44   admitExitInpatientTest(org.openmrs.reference.AdmitExitInpatientTest): Test killed due to server failure
02-Aug-2021 21:47:44   deleteRequestAppointmentTest(org.openmrs.reference.DeleteRequestAppointmentTest): Test killed due to server failure
02-Aug-2021 21:47:44   editAllergyTest(org.openmrs.reference.EditAllergyTest): Test killed due to server failure
02-Aug-2021 21:47:44   createPersonTest(org.openmrs.reference.CreatePersonTest): Test killed due to server failure
02-Aug-2021 21:47:44   findPatientByNameTest(org.openmrs.reference.FindPatientByNameTest): Test killed due to server failure
02-Aug-2021 21:47:44   addUserTest(org.openmrs.reference.AddUserTest): Test killed due to server failure
02-Aug-2021 21:47:44   addProviderTest(org.openmrs.reference.AddProviderTest): Test killed due to server failure
02-Aug-2021 21:47:44   addPastVisitTest(org.openmrs.reference.AddPastVisitTest): Test killed due to server failure
02-Aug-2021 21:47:44   recordMergeIssueTest(org.openmrs.reference.RecordMergeIssueTest): Test killed due to server failure
02-Aug-2021 21:47:44   captureVitalsTest(org.openmrs.reference.CaptureVitalsTest): Test killed due to server failure
02-Aug-2021 21:47:44   namePatientAccentedLetterTest(org.openmrs.reference.NamePatientAccentedLetterTest): Test killed due to server failure
02-Aug-2021 21:47:44   retirePersonTest(org.openmrs.reference.RetirePersonTest): Test killed due to server failure
02-Aug-2021 21:47:44   endVisitTest(org.openmrs.reference.EndVisitTest): Test killed due to server failure
02-Aug-2021 21:47:44   deleteAppointmentBlockTest(org.openmrs.reference.DeleteAppointmentBlockTest): Test killed due to server failure
02-Aug-2021 21:47:44   addDeleteServiceTest(org.openmrs.reference.AddDeleteServiceTest): Test killed due to server failure
02-Aug-2021 21:47:44   addEditAppointmentBlockTest(org.openmrs.reference.AddEditAppointmentBlockTest): Test killed due to server failure
02-Aug-2021 21:47:44   retireProviderTest(org.openmrs.reference.RetireProviderTest): Test killed due to server failure
02-Aug-2021 21:47:44   mergePatientTest(org.openmrs.reference.MergePatientTest): Test killed due to server failure
02-Aug-2021 21:47:44   addLocationTest(org.openmrs.reference.AddDeleteLocationTest): Test killed due to server failure
02-Aug-2021 21:47:44   duplicatePatientRegisterTest(org.openmrs.reference.DuplicatePatientRegisterTest): Test killed due to server failure
02-Aug-2021 21:47:44   usingBackButtonInMergePatientTest(org.openmrs.reference.UsingBackButtonInMergePatientTest): Test killed due to server failure
02-Aug-2021 21:47:44   addDiagnosisToVisitNoteTest(org.openmrs.reference.AddDiagnosisToVisitNoteTest): Test killed due to server failure
02-Aug-2021 21:47:44   mergeVisitsTest(org.openmrs.reference.MergeVisitsTest): Test killed due to server failure
02-Aug-2021 21:47:44   editServiceTest(org.openmrs.reference.EditServiceTest): Test killed due to server failure
02-Aug-2021 21:47:44   addNewAllergyTest(org.openmrs.reference.AddNewAllergyTest): Test killed due to server failure
02-Aug-2021 21:47:44   verifyNurseModulesAvailableOnHomePage(org.openmrs.reference.LoginTest): Test killed due to server failure
02-Aug-2021 21:47:44   verifyModulesAvailableOnHomePage(org.openmrs.reference.LoginTest): Test killed due to server failure
02-Aug-2021 21:47:44   verifySysadminModulesAvailableOnHomePage(org.openmrs.reference.LoginTest): Test killed due to server failure
02-Aug-2021 21:47:44   verifyClerkModulesAvailableOnHomePage(org.openmrs.reference.LoginTest): Test killed due to server failure
02-Aug-2021 21:47:44   verifyDoctorModulesAvailableOnHomePage(org.openmrs.reference.LoginTest): Test killed due to server failure
02-Aug-2021 21:47:44   deleteProviderTest(org.openmrs.reference.DeleteProviderTest): Test killed due to server failure
02-Aug-2021 21:47:44   registerPatientTest(org.openmrs.reference.RegisterPatientTest): Test killed due to server failure
02-Aug-2021 21:47:44   startVisitTest(org.openmrs.reference.StartVisitTest): Test killed due to server failure
02-Aug-2021 21:47:44   deletePersonTest(org.openmrs.reference.DeletePersonTest): Test killed due to server failure
02-Aug-2021 21:47:44   editProviderTest(org.openmrs.reference.EditProviderTest): Test killed due to server failure
02-Aug-2021 21:47:44   retireVisitTypeTest(org.openmrs.reference.RetireVisitTypeTest): Test killed due to server failure
02-Aug-2021 21:47:44
02-Aug-2021 21:47:44 Tests in error:
02-Aug-2021 21:47:44   editDemographicTest(org.openmrs.reference.EditDemographicTest)
02-Aug-2021 21:47:44   editDemographicTest(org.openmrs.reference.EditDemographicTest): Session ID is null. Using WebDriver after calling quit()?(..)
02-Aug-2021 21:47:44   deleteVisitTypeTest(org.openmrs.reference.DeleteVisitTypeTest): Delete request failed: https://qa-refapp.openmrs.org/openmrs/ws/rest/v1/visittype/null?purge=true
02-Aug-2021 21:47:44   deleteVisitTypeTest(org.openmrs.reference.DeleteVisitTypeTest): Session ID is null. Using WebDriver after calling quit()?(..)
02-Aug-2021 21:47:44   registerUnidentifiedPatientTest(org.openmrs.reference.RegisterUnidentifiedPatientTest)
02-Aug-2021 21:47:44   findPatientByNameTest(org.openmrs.reference.FindPatientByNameTest)
02-Aug-2021 21:47:44   addProviderTest(org.openmrs.reference.AddProviderTest): Delete request failed: https://qa-refapp.openmrs.org/openmrs/ws/rest/v1/person/null?purge=true
02-Aug-2021 21:47:44   recordMergeIssueTest(org.openmrs.reference.RecordMergeIssueTest)
02-Aug-2021 21:47:44   namePatientAccentedLetterTest(org.openmrs.reference.NamePatientAccentedLetterTest)
02-Aug-2021 21:47:44   retirePersonTest(org.openmrs.reference.RetirePersonTest): Delete request failed: https://qa-refapp.openmrs.org/openmrs/ws/rest/v1/person/null?purge=true
02-Aug-2021 21:47:44   retireProviderTest(org.openmrs.reference.RetireProviderTest): Delete request failed: https://qa-refapp.openmrs.org/openmrs/ws/rest/v1/provider/null?purge=true
02-Aug-2021 21:47:44   addLocationTest(org.openmrs.reference.AddDeleteLocationTest): Delete request failed: https://qa-refapp.openmrs.org/openmrs/ws/rest/v1//locationtag/null?purge=true
02-Aug-2021 21:47:44   duplicatePatientRegisterTest(org.openmrs.reference.DuplicatePatientRegisterTest)
02-Aug-2021 21:47:44   usingBackButtonInMergePatientTest(org.openmrs.reference.UsingBackButtonInMergePatientTest)
02-Aug-2021 21:47:44   mergeVisitsTest(org.openmrs.reference.MergeVisitsTest)
02-Aug-2021 21:47:44   deleteProviderTest(org.openmrs.reference.DeleteProviderTest): Delete request failed: https://qa-refapp.openmrs.org/openmrs/ws/rest/v1/provider/null?purge=true
02-Aug-2021 21:47:44   registerPatientTest(org.openmrs.reference.RegisterPatientTest)
02-Aug-2021 21:47:44   deletePersonTest(org.openmrs.reference.DeletePersonTest): Delete request failed: https://qa-refapp.openmrs.org/openmrs/ws/rest/v1/person/null?purge=true
02-Aug-2021 21:47:44   editProviderTest(org.openmrs.reference.EditProviderTest): Delete request failed: https://qa-refapp.openmrs.org/openmrs/ws/rest/v1/provider/null?purge=true
02-Aug-2021 21:47:44   retireVisitTypeTest(org.openmrs.reference.RetireVisitTypeTest): Delete request failed: https://qa-refapp.openmrs.org/openmrs/ws/rest/v1/visittype/null?purge=true
02-Aug-2021 21:47:44
02-Aug-2021 21:47:44 Tests run: 74, Failures: 38, Errors: 20, Skipped: 6
02-Aug-2021 21:47:44
02-Aug-2021 21:47:44 [INFO] ------------------------------------------------------------------------
02-Aug-2021 21:47:44 [INFO] Reactor Summary:
02-Aug-2021 21:47:44 [INFO]
02-Aug-2021 21:47:44 [INFO] Reference Application Distribution ................. SUCCESS [  0.316 s]
02-Aug-2021 21:47:44 [INFO] Reference Application Distribution Package ......... SUCCESS [01:08 min]
02-Aug-2021 21:47:44 [INFO] Reference Application Distribution UI Tests ........ FAILURE [01:34 min]
02-Aug-2021 21:47:44 [INFO] ------------------------------------------------------------------------
02-Aug-2021 21:47:44 [INFO] BUILD FAILURE
02-Aug-2021 21:47:44 [INFO] ------------------------------------------------------------------------
02-Aug-2021 21:47:44 [INFO] Total time: 02:44 min
02-Aug-2021 21:47:44 [INFO] Finished at: 2021-08-02T21:47:44+00:00
02-Aug-2021 21:47:45 [INFO] Final Memory: 63M/362M
02-Aug-2021 21:47:45 [INFO] ------------------------------------------------------------------------
02-Aug-2021 21:47:45 [ERROR] Failed to execute goal org.apache.maven.plugins:maven-surefire-plugin:2.12:test (default-test) on project referenceapplication-ui-tests: There are test failures.
02-Aug-2021 21:47:45 [ERROR]
02-Aug-2021 21:47:45 [ERROR] Please refer to /home/bamboo-agent/bamboo-agent/xml-data/build-dir/REFAPP-UI-FRAMEWORK/ui-tests/target/surefire-reports for the individual test results.
02-Aug-2021 21:47:45 [ERROR] -> [Help 1]
02-Aug-2021 21:47:45 [ERROR]
02-Aug-2021 21:47:45 [ERROR] To see the full stack trace of the errors, re-run Maven with the -e switch.
02-Aug-2021 21:47:45 [ERROR] Re-run Maven using the -X switch to enable full debug logging.
02-Aug-2021 21:47:45 [ERROR]
02-Aug-2021 21:47:45 [ERROR] For more information about the errors and possible solutions, please read the following articles:
02-Aug-2021 21:47:45 [ERROR] [Help 1] http://cwiki.apache.org/confluence/display/MAVEN/MojoFailureException
02-Aug-2021 21:47:45 [ERROR]
02-Aug-2021 21:47:45 [ERROR] After correcting the problems, you can resume the build with the command
02-Aug-2021 21:47:45 [ERROR]   mvn <goals> -rf :referenceapplication-ui-tests
02-Aug-2021 21:47:45 Failing task since return code of [/usr/share/apache-maven-3.3.9/bin/mvn --batch-mode -Djava.io.tmpdir=/home/bamboo-agent/bamboo-agent/.agent_tmp/REFAPP-UI-FRAMEWORK clean install -DskipTests=false] was 1 while expected 0
02-Aug-2021 21:47:45 Parsing test results under /home/bamboo-agent/bamboo-agent/xml-data/build-dir/REFAPP-UI-FRAMEWORK...
02-Aug-2021 21:47:46 Finished task 'Build distribution' with result: Failed
02-Aug-2021 21:47:46 Running post build plugin 'Docker Container Cleanup'
02-Aug-2021 21:47:46 Running post build plugin 'NCover Results Collector'
02-Aug-2021 21:47:46 Running post build plugin 'Clover Results Collector'
02-Aug-2021 21:47:46 Running post build plugin 'Sauce OnDemand Post Runner'
02-Aug-2021 21:47:46 Running post build plugin 'npm Cache Cleanup'
02-Aug-2021 21:47:46 Running post build plugin 'Artifact Copier'
02-Aug-2021 21:47:46 Finalising the build...
02-Aug-2021 21:47:46 Stopping timer.
02-Aug-2021 21:47:46 Build REFAPP-UI-FRAMEWORK-399 completed.
02-Aug-2021 21:47:46 Running on server: post build plugin 'NCover Results Collector'
02-Aug-2021 21:47:46 Running on server: post build plugin 'Build Hanging Detection Configuration'
02-Aug-2021 21:47:46 Running on server: post build plugin 'Clover Delta Calculator'
02-Aug-2021 21:47:46 Running on server: post build plugin 'Maven Dependencies Postprocessor'
02-Aug-2021 21:47:46 All post build plugins have finished
02-Aug-2021 21:47:46 Generating build results summary...
02-Aug-2021 21:47:46 Saving build results to disk...
02-Aug-2021 21:47:46 Logging substituted variables...
02-Aug-2021 21:47:46 Indexing build results...
02-Aug-2021 21:47:46 Finished building REFAPP-UI-FRAMEWORK-399.