UI tests for the reference application

Build: #434 failed

Job: Run QA UI Tests failed

Stages & jobs

  1. Ref App UI Testing

Job result summary

Completed
Duration
13 minutes
Revisions
Distribution
15df605e3581ec7f79494764e1f75a7115ee9fd2 15df605e3581ec7f79494764e1f75a7115ee9fd2
UI Test Framework
53261933a53762e3aa2703469b8abd666b6c5184 53261933a53762e3aa2703469b8abd666b6c5184
Total tests
55
Fixed in
#435 (Manual run by Kakumirizi Daud)

Tests

  • 55 tests in total
  • 2 tests failed
  • 2 failures are new
  • 5 tests were quarantined / skipped
  • 12 minutes taken in total.
New test failures 2
Status Test Duration
Collapse Failed AddUserTest addUserTest History
2 mins
org.openqa.selenium.remote.UnreachableBrowserException: Error communicating with the remote browser. It may have died. Build info: version: '4.0.0-alpha-6', revision: '5f43a29cfc' System info: host: 'yokobue', ip: '127.0.0.1', os.name: 'Linux', os.arch: 'amd64', os.version: '4.4.0-210-generic', java.version: '1.8.0_292' Driver info: driver.version: RemoteWebDriver Capabilities {acceptInsecureCerts: false, browserName: chrome, browserVersion: 90.0.4430.72, chrome: {chromedriverVersion: 90.0.4430.24 (4c6d850f087da..., userDataDir: /tmp/.com.google.Chrome.JFUwnJ}, goog:chromeOptions: {debuggerAddress: localhost:41779}, javascriptEnabled: true, networkConnectionEnabled: false, pageLoadStrategy: normal, platform: LINUX, platformName: LINUX, proxy: Proxy(), setWindowRect: true, strictFileInteractability: false, timeouts: {implicit: 0, pageLoad: 300000, script: 30000}, unhandledPromptBehavior: dismiss and notify, webauthn:extension:largeBlob: true, webauthn:virtualAuthenticators: true} Session ID: 0ad18cef8c9153de9c6ca83a5d46c743
org.openqa.selenium.remote.UnreachableBrowserException: Error communicating with the remote browser. It may have died.
Build info: version: '4.0.0-alpha-6', revision: '5f43a29cfc'
System info: host: 'yokobue', ip: '127.0.0.1', os.name: 'Linux', os.arch: 'amd64', os.version: '4.4.0-210-generic', java.version: '1.8.0_292'
Driver info: driver.version: RemoteWebDriver
Capabilities {acceptInsecureCerts: false, browserName: chrome, browserVersion: 90.0.4430.72, chrome: {chromedriverVersion: 90.0.4430.24 (4c6d850f087da..., userDataDir: /tmp/.com.google.Chrome.JFUwnJ}, goog:chromeOptions: {debuggerAddress: localhost:41779}, javascriptEnabled: true, networkConnectionEnabled: false, pageLoadStrategy: normal, platform: LINUX, platformName: LINUX, proxy: Proxy(), setWindowRect: true, strictFileInteractability: false, timeouts: {implicit: 0, pageLoad: 300000, script: 30000}, unhandledPromptBehavior: dismiss and notify, webauthn:extension:largeBlob: true, webauthn:virtualAuthenticators: true}
Session ID: 0ad18cef8c9153de9c6ca83a5d46c743
	at org.openqa.selenium.remote.RemoteWebDriver.execute(RemoteWebDriver.java:603)
(35 more lines...)
Collapse Failed UsingBackButtonInMergePatientTest usingBackButtonInMergePatientTest History
4 mins
org.openqa.selenium.TimeoutException: Expected condition failed: waiting for org.openmrs.uitestframework.page.Page$1@1ab466d4 (tried for 120 second(s) with 500 milliseconds interval) Build info: version: '4.0.0-alpha-6', revision: '5f43a29cfc' System info: host: 'yokobue', ip: '127.0.0.1', os.name: 'Linux', os.arch: 'amd64', os.version: '4.4.0-210-generic', java.version: '1.8.0_292' Driver info: org.openqa.selenium.chrome.ChromeDriver Capabilities {acceptInsecureCerts: false, browserName: chrome, browserVersion: 90.0.4430.72, chrome: {chromedriverVersion: 90.0.4430.24 (4c6d850f087da..., userDataDir: /tmp/.com.google.Chrome.VYb57w}, goog:chromeOptions: {debuggerAddress: localhost:44945}, javascriptEnabled: true, networkConnectionEnabled: false, pageLoadStrategy: normal, platform: LINUX, platformName: LINUX, proxy: Proxy(), setWindowRect: true, strictFileInteractability: false, timeouts: {implicit: 0, pageLoad: 300000, script: 30000}, unhandledPromptBehavior: dismiss and notify, webauthn:extension:largeBlob: true, webauthn:virtualAuthenticators: true} Session ID: 4c15779f34719203205e53c1907d3ad1
org.openqa.selenium.TimeoutException: Expected condition failed: waiting for org.openmrs.uitestframework.page.Page$1@1ab466d4 (tried for 120 second(s) with 500 milliseconds interval)
Build info: version: '4.0.0-alpha-6', revision: '5f43a29cfc'
System info: host: 'yokobue', ip: '127.0.0.1', os.name: 'Linux', os.arch: 'amd64', os.version: '4.4.0-210-generic', java.version: '1.8.0_292'
Driver info: org.openqa.selenium.chrome.ChromeDriver
Capabilities {acceptInsecureCerts: false, browserName: chrome, browserVersion: 90.0.4430.72, chrome: {chromedriverVersion: 90.0.4430.24 (4c6d850f087da..., userDataDir: /tmp/.com.google.Chrome.VYb57w}, goog:chromeOptions: {debuggerAddress: localhost:44945}, javascriptEnabled: true, networkConnectionEnabled: false, pageLoadStrategy: normal, platform: LINUX, platformName: LINUX, proxy: Proxy(), setWindowRect: true, strictFileInteractability: false, timeouts: {implicit: 0, pageLoad: 300000, script: 30000}, unhandledPromptBehavior: dismiss and notify, webauthn:extension:largeBlob: true, webauthn:virtualAuthenticators: true}
Session ID: 4c15779f34719203205e53c1907d3ad1
	at org.openqa.selenium.support.ui.WebDriverWait.timeoutException(WebDriverWait.java:138)
(3 more lines...)