UI tests for the reference application

Build: #552 failed

Job: Run QA UI Tests failed

Stages & jobs

  1. Ref App UI Testing

Build log

The build generated 1,202 lines of output.The output is too long and has been truncated to the last 1,000 lines. Download or view full build log

14-Sep-2021 02:00:36 [INFO] Configured Artifact: org.openmrs.module:metadatadeploy-omod:1.13.0:jar
14-Sep-2021 02:00:36 [INFO] Configured Artifact: org.openmrs.module:reportingrest-omod:1.12.0:jar
14-Sep-2021 02:00:36 [INFO] Configured Artifact: org.openmrs.module:owa-omod:1.13.0:jar
14-Sep-2021 02:00:36 [INFO] Configured Artifact: org.openmrs.module:fhir2-omod:1.2.2:jar
14-Sep-2021 02:00:36 [INFO] Configured Artifact: org.openmrs.module:serialization.xstream-omod:0.2.15:omod
14-Sep-2021 02:00:36 [INFO] Configured Artifact: org.openmrs.module:registrationapp-omod:1.24.0:jar
14-Sep-2021 02:00:36 [INFO] Configured Artifact: org.openmrs:event-omod:2.10.0-SNAPSHOT:jar
14-Sep-2021 02:00:36 [INFO] Downloading: http://mavenrepo.openmrs.org/nexus/content/repositories/public/org/openmrs/event-omod/2.10.0-SNAPSHOT/maven-metadata.xml
14-Sep-2021 02:00:37 [INFO] Downloaded: http://mavenrepo.openmrs.org/nexus/content/repositories/public/org/openmrs/event-omod/2.10.0-SNAPSHOT/maven-metadata.xml (987 B at 0.9 KB/sec)
14-Sep-2021 02:00:37 [INFO] Downloading: http://mavenrepo.openmrs.org/nexus/content/repositories/public/org/openmrs/event-omod/2.10.0-SNAPSHOT/event-omod-2.10.0-20210702.124301-3.jar
14-Sep-2021 02:00:39 [INFO] Downloaded: http://mavenrepo.openmrs.org/nexus/content/repositories/public/org/openmrs/event-omod/2.10.0-SNAPSHOT/event-omod-2.10.0-20210702.124301-3.jar (4666 KB at 2499.0 KB/sec)
14-Sep-2021 02:00:39 [INFO] Configured Artifact: org.openmrs.module:uilibrary-omod:2.0.7:jar
14-Sep-2021 02:00:39 [INFO] Configured Artifact: org.openmrs.module:htmlwidgets-omod:1.10.0:jar
14-Sep-2021 02:00:39 [INFO] Configured Artifact: org.openmrs.module:dataexchange-omod:1.3.7:jar
14-Sep-2021 02:00:39 [INFO] Configured Artifact: org.openmrs.module:appui-omod:1.14.0:jar
14-Sep-2021 02:00:39 [INFO] Configured Artifact: org.openmrs.module:allergyui-omod:1.8.4:jar
14-Sep-2021 02:00:39 [INFO] Configured Artifact: org.openmrs.module:providermanagement-omod:2.13.0:jar
14-Sep-2021 02:00:39 [INFO] Configured Artifact: org.openmrs.module:appointmentschedulingui-omod:1.12.0:jar
14-Sep-2021 02:00:39 [INFO] Configured Artifact: org.openmrs.module:attachments-omod:2.5.0:jar
14-Sep-2021 02:00:39 [INFO] Configured Artifact: org.openmrs.module:formentryapp-omod:1.4.2:jar
14-Sep-2021 02:00:39 [INFO] Configured Artifact: org.openmrs.module:idgen-omod:4.7.0:jar
14-Sep-2021 02:00:39 [INFO] Configured Artifact: org.openmrs.module:metadatamapping-omod:1.4.0:jar
14-Sep-2021 02:00:39 [INFO] Configured Artifact: org.openmrs.module:htmlformentryui-omod:2.0.0:jar
14-Sep-2021 02:00:39 [INFO] Configured Artifact: org.openmrs.module:referencedemodata-omod:1.4.7-SNAPSHOT:jar
14-Sep-2021 02:00:39 [INFO] Downloading: http://mavenrepo.openmrs.org/nexus/content/repositories/public/org/openmrs/module/referencedemodata-omod/1.4.7-SNAPSHOT/maven-metadata.xml
14-Sep-2021 02:00:40 [INFO] Downloaded: http://mavenrepo.openmrs.org/nexus/content/repositories/public/org/openmrs/module/referencedemodata-omod/1.4.7-SNAPSHOT/maven-metadata.xml (796 B at 3.0 KB/sec)
14-Sep-2021 02:00:40 [INFO] Downloading: http://mavenrepo.openmrs.org/nexus/content/repositories/public/org/openmrs/module/referencedemodata-omod/1.4.7-SNAPSHOT/referencedemodata-omod-1.4.7-20210913.210516-246.jar
14-Sep-2021 02:00:40 [INFO] Downloaded: http://mavenrepo.openmrs.org/nexus/content/repositories/public/org/openmrs/module/referencedemodata-omod/1.4.7-SNAPSHOT/referencedemodata-omod-1.4.7-20210913.210516-246.jar (56 KB at 117.2 KB/sec)
14-Sep-2021 02:00:40 [INFO] Configured Artifact: org.openmrs.module:emrapi-omod:1.32.0:jar
14-Sep-2021 02:00:40 [INFO] Configured Artifact: org.openmrs.module:referenceapplication-omod:2.12.0-SNAPSHOT:jar
14-Sep-2021 02:00:40 [INFO] Downloading: http://mavenrepo.openmrs.org/nexus/content/repositories/public/org/openmrs/module/referenceapplication-omod/2.12.0-SNAPSHOT/maven-metadata.xml
14-Sep-2021 02:00:40 [INFO] Downloaded: http://mavenrepo.openmrs.org/nexus/content/repositories/public/org/openmrs/module/referenceapplication-omod/2.12.0-SNAPSHOT/maven-metadata.xml (802 B at 2.9 KB/sec)
14-Sep-2021 02:00:40 [INFO] Downloading: http://mavenrepo.openmrs.org/nexus/content/repositories/public/org/openmrs/module/referenceapplication-omod/2.12.0-SNAPSHOT/referenceapplication-omod-2.12.0-20210914.011629-264.jar
14-Sep-2021 02:00:41 [INFO] Downloaded: http://mavenrepo.openmrs.org/nexus/content/repositories/public/org/openmrs/module/referenceapplication-omod/2.12.0-SNAPSHOT/referenceapplication-omod-2.12.0-20210914.011629-264.jar (1902 KB at 2418.7 KB/sec)
14-Sep-2021 02:00:41 [INFO] Configured Artifact: org.openmrs.module:htmlformentry-omod:4.1.0:jar
14-Sep-2021 02:00:41 [INFO] Configured Artifact: org.openmrs.module:appframework-omod:2.16.0:jar
14-Sep-2021 02:00:41 [INFO] Configured Artifact: org.openmrs.module:referencemetadata-omod:2.12.0-SNAPSHOT:jar
14-Sep-2021 02:00:41 [INFO] Downloading: http://mavenrepo.openmrs.org/nexus/content/repositories/public/org/openmrs/module/referencemetadata-omod/2.12.0-SNAPSHOT/maven-metadata.xml
14-Sep-2021 02:00:42 [INFO] Downloaded: http://mavenrepo.openmrs.org/nexus/content/repositories/public/org/openmrs/module/referencemetadata-omod/2.12.0-SNAPSHOT/maven-metadata.xml (799 B at 2.8 KB/sec)
14-Sep-2021 02:00:42 [INFO] Downloading: http://mavenrepo.openmrs.org/nexus/content/repositories/public/org/openmrs/module/referencemetadata-omod/2.12.0-SNAPSHOT/referencemetadata-omod-2.12.0-20210913.210002-251.jar
14-Sep-2021 02:00:42 [INFO] Downloaded: http://mavenrepo.openmrs.org/nexus/content/repositories/public/org/openmrs/module/referencemetadata-omod/2.12.0-SNAPSHOT/referencemetadata-omod-2.12.0-20210913.210002-251.jar (532 KB at 1171.6 KB/sec)
14-Sep-2021 02:00:42 [INFO] Configured Artifact: org.openmrs.module:reportingui-omod:1.8.0:jar
14-Sep-2021 02:00:42 [INFO] Configured Artifact: org.openmrs.module:coreapps-omod:1.33.0:jar
14-Sep-2021 02:00:42 [INFO] Configured Artifact: org.openmrs.module:reportingcompatibility-omod:2.0.8:jar
14-Sep-2021 02:00:42 [INFO] Configured Artifact: org.openmrs.module:reporting-omod:1.23.0:jar
14-Sep-2021 02:00:42 [INFO] Configured Artifact: org.openmrs.module:adminui-omod:1.5.0:jar
14-Sep-2021 02:00:42 [INFO] Configured Artifact: org.openmrs.module:registrationcore-omod:1.11.0:jar
14-Sep-2021 02:00:42 [INFO] Configured Artifact: org.openmrs.module:appointmentscheduling-omod:1.16.0:jar
14-Sep-2021 02:00:42 [INFO] Configured Artifact: org.openmrs.module:atlas-omod:2.2.5:omod
14-Sep-2021 02:00:42 [INFO] Configured Artifact: org.openmrs.module:calculation-omod:1.3.0:jar
14-Sep-2021 02:00:42 [INFO] Configured Artifact: org.openmrs.module:webservices.rest-omod:2.32.0-SNAPSHOT:jar
14-Sep-2021 02:00:42 [INFO] Downloading: http://mavenrepo.openmrs.org/nexus/content/repositories/public/org/openmrs/module/webservices.rest-omod/2.32.0-SNAPSHOT/maven-metadata.xml
14-Sep-2021 02:00:42 [INFO] Downloaded: http://mavenrepo.openmrs.org/nexus/content/repositories/public/org/openmrs/module/webservices.rest-omod/2.32.0-SNAPSHOT/maven-metadata.xml (1009 B at 3.9 KB/sec)
14-Sep-2021 02:00:42 [INFO] Downloading: http://mavenrepo.openmrs.org/nexus/content/repositories/public/org/openmrs/module/webservices.rest-omod/2.32.0-SNAPSHOT/webservices.rest-omod-2.32.0-20210913.230809-64.jar
14-Sep-2021 02:00:43 [INFO] Downloaded: http://mavenrepo.openmrs.org/nexus/content/repositories/public/org/openmrs/module/webservices.rest-omod/2.32.0-SNAPSHOT/webservices.rest-omod-2.32.0-20210913.230809-64.jar (6750 KB at 7258.0 KB/sec)
14-Sep-2021 02:00:43 [INFO] Configured Artifact: org.openmrs.module:spa-omod:1.0.8:jar
14-Sep-2021 02:00:43 [INFO] Configured Artifact: org.openmrs.module:uicommons-omod:2.18.0:jar
14-Sep-2021 02:00:43 [INFO] Configured Artifact: org.openmrs.module:uiframework-omod:3.21.0:jar
14-Sep-2021 02:00:43 [INFO] Configured Artifact: org.openmrs.module:metadatasharing-omod:1.8.0:jar
14-Sep-2021 02:00:43 [INFO] Copying addresshierarchy-omod-2.14.2.jar to /home/bamboo-agent/bamboo-agent/xml-data/build-dir/REFAPP-UI-FRAMEWORK/package/target/distro/web/modules/addresshierarchy-2.14.2.omod
14-Sep-2021 02:00:43 [INFO] Copying legacyui-omod-1.8.3.jar to /home/bamboo-agent/bamboo-agent/xml-data/build-dir/REFAPP-UI-FRAMEWORK/package/target/distro/web/modules/legacyui-1.8.3.omod
14-Sep-2021 02:00:44 [INFO] Copying openconceptlab-omod-1.2.6.jar to /home/bamboo-agent/bamboo-agent/xml-data/build-dir/REFAPP-UI-FRAMEWORK/package/target/distro/web/modules/openconceptlab-1.2.6.omod
14-Sep-2021 02:00:44 [INFO] Copying metadatadeploy-omod-1.13.0.jar to /home/bamboo-agent/bamboo-agent/xml-data/build-dir/REFAPP-UI-FRAMEWORK/package/target/distro/web/modules/metadatadeploy-1.13.0.omod
14-Sep-2021 02:00:44 [INFO] Copying reportingrest-omod-1.12.0.jar to /home/bamboo-agent/bamboo-agent/xml-data/build-dir/REFAPP-UI-FRAMEWORK/package/target/distro/web/modules/reportingrest-1.12.0.omod
14-Sep-2021 02:00:44 [INFO] Copying owa-omod-1.13.0.jar to /home/bamboo-agent/bamboo-agent/xml-data/build-dir/REFAPP-UI-FRAMEWORK/package/target/distro/web/modules/owa-1.13.0.omod
14-Sep-2021 02:00:44 [INFO] Copying fhir2-omod-1.2.2.jar to /home/bamboo-agent/bamboo-agent/xml-data/build-dir/REFAPP-UI-FRAMEWORK/package/target/distro/web/modules/fhir2-1.2.2.omod
14-Sep-2021 02:00:44 [INFO] Copying serialization.xstream-omod-0.2.15.omod to /home/bamboo-agent/bamboo-agent/xml-data/build-dir/REFAPP-UI-FRAMEWORK/package/target/distro/web/modules/serialization.xstream-0.2.15.omod
14-Sep-2021 02:00:44 [INFO] Copying registrationapp-omod-1.24.0.jar to /home/bamboo-agent/bamboo-agent/xml-data/build-dir/REFAPP-UI-FRAMEWORK/package/target/distro/web/modules/registrationapp-1.24.0.omod
14-Sep-2021 02:00:44 [INFO] Copying event-omod-2.10.0-SNAPSHOT.jar to /home/bamboo-agent/bamboo-agent/xml-data/build-dir/REFAPP-UI-FRAMEWORK/package/target/distro/web/modules/event-2.10.0-SNAPSHOT.omod
14-Sep-2021 02:00:44 [INFO] Copying uilibrary-omod-2.0.7.jar to /home/bamboo-agent/bamboo-agent/xml-data/build-dir/REFAPP-UI-FRAMEWORK/package/target/distro/web/modules/uilibrary-2.0.7.omod
14-Sep-2021 02:00:44 [INFO] Copying htmlwidgets-omod-1.10.0.jar to /home/bamboo-agent/bamboo-agent/xml-data/build-dir/REFAPP-UI-FRAMEWORK/package/target/distro/web/modules/htmlwidgets-1.10.0.omod
14-Sep-2021 02:00:44 [INFO] Copying dataexchange-omod-1.3.7.jar to /home/bamboo-agent/bamboo-agent/xml-data/build-dir/REFAPP-UI-FRAMEWORK/package/target/distro/web/modules/dataexchange-1.3.7.omod
14-Sep-2021 02:00:44 [INFO] Copying appui-omod-1.14.0.jar to /home/bamboo-agent/bamboo-agent/xml-data/build-dir/REFAPP-UI-FRAMEWORK/package/target/distro/web/modules/appui-1.14.0.omod
14-Sep-2021 02:00:44 [INFO] Copying allergyui-omod-1.8.4.jar to /home/bamboo-agent/bamboo-agent/xml-data/build-dir/REFAPP-UI-FRAMEWORK/package/target/distro/web/modules/allergyui-1.8.4.omod
14-Sep-2021 02:00:44 [INFO] Copying providermanagement-omod-2.13.0.jar to /home/bamboo-agent/bamboo-agent/xml-data/build-dir/REFAPP-UI-FRAMEWORK/package/target/distro/web/modules/providermanagement-2.13.0.omod
14-Sep-2021 02:00:44 [INFO] Copying appointmentschedulingui-omod-1.12.0.jar to /home/bamboo-agent/bamboo-agent/xml-data/build-dir/REFAPP-UI-FRAMEWORK/package/target/distro/web/modules/appointmentschedulingui-1.12.0.omod
14-Sep-2021 02:00:44 [INFO] Copying attachments-omod-2.5.0.jar to /home/bamboo-agent/bamboo-agent/xml-data/build-dir/REFAPP-UI-FRAMEWORK/package/target/distro/web/modules/attachments-2.5.0.omod
14-Sep-2021 02:00:44 [INFO] Copying formentryapp-omod-1.4.2.jar to /home/bamboo-agent/bamboo-agent/xml-data/build-dir/REFAPP-UI-FRAMEWORK/package/target/distro/web/modules/formentryapp-1.4.2.omod
14-Sep-2021 02:00:44 [INFO] Copying idgen-omod-4.7.0.jar to /home/bamboo-agent/bamboo-agent/xml-data/build-dir/REFAPP-UI-FRAMEWORK/package/target/distro/web/modules/idgen-4.7.0.omod
14-Sep-2021 02:00:44 [INFO] Copying metadatamapping-omod-1.4.0.jar to /home/bamboo-agent/bamboo-agent/xml-data/build-dir/REFAPP-UI-FRAMEWORK/package/target/distro/web/modules/metadatamapping-1.4.0.omod
14-Sep-2021 02:00:44 [INFO] Copying htmlformentryui-omod-2.0.0.jar to /home/bamboo-agent/bamboo-agent/xml-data/build-dir/REFAPP-UI-FRAMEWORK/package/target/distro/web/modules/htmlformentryui-2.0.0.omod
14-Sep-2021 02:00:44 [INFO] Copying referencedemodata-omod-1.4.7-SNAPSHOT.jar to /home/bamboo-agent/bamboo-agent/xml-data/build-dir/REFAPP-UI-FRAMEWORK/package/target/distro/web/modules/referencedemodata-1.4.7-SNAPSHOT.omod
14-Sep-2021 02:00:44 [INFO] Copying emrapi-omod-1.32.0.jar to /home/bamboo-agent/bamboo-agent/xml-data/build-dir/REFAPP-UI-FRAMEWORK/package/target/distro/web/modules/emrapi-1.32.0.omod
14-Sep-2021 02:00:44 [INFO] Copying referenceapplication-omod-2.12.0-SNAPSHOT.jar to /home/bamboo-agent/bamboo-agent/xml-data/build-dir/REFAPP-UI-FRAMEWORK/package/target/distro/web/modules/referenceapplication-2.12.0-SNAPSHOT.omod
14-Sep-2021 02:00:44 [INFO] Copying htmlformentry-omod-4.1.0.jar to /home/bamboo-agent/bamboo-agent/xml-data/build-dir/REFAPP-UI-FRAMEWORK/package/target/distro/web/modules/htmlformentry-4.1.0.omod
14-Sep-2021 02:00:44 [INFO] Copying appframework-omod-2.16.0.jar to /home/bamboo-agent/bamboo-agent/xml-data/build-dir/REFAPP-UI-FRAMEWORK/package/target/distro/web/modules/appframework-2.16.0.omod
14-Sep-2021 02:00:44 [INFO] Copying referencemetadata-omod-2.12.0-SNAPSHOT.jar to /home/bamboo-agent/bamboo-agent/xml-data/build-dir/REFAPP-UI-FRAMEWORK/package/target/distro/web/modules/referencemetadata-2.12.0-SNAPSHOT.omod
14-Sep-2021 02:00:44 [INFO] Copying reportingui-omod-1.8.0.jar to /home/bamboo-agent/bamboo-agent/xml-data/build-dir/REFAPP-UI-FRAMEWORK/package/target/distro/web/modules/reportingui-1.8.0.omod
14-Sep-2021 02:00:44 [INFO] Copying coreapps-omod-1.33.0.jar to /home/bamboo-agent/bamboo-agent/xml-data/build-dir/REFAPP-UI-FRAMEWORK/package/target/distro/web/modules/coreapps-1.33.0.omod
14-Sep-2021 02:00:44 [INFO] Copying reportingcompatibility-omod-2.0.8.jar to /home/bamboo-agent/bamboo-agent/xml-data/build-dir/REFAPP-UI-FRAMEWORK/package/target/distro/web/modules/reportingcompatibility-2.0.8.omod
14-Sep-2021 02:00:44 [INFO] Copying reporting-omod-1.23.0.jar to /home/bamboo-agent/bamboo-agent/xml-data/build-dir/REFAPP-UI-FRAMEWORK/package/target/distro/web/modules/reporting-1.23.0.omod
14-Sep-2021 02:00:45 [INFO] Copying adminui-omod-1.5.0.jar to /home/bamboo-agent/bamboo-agent/xml-data/build-dir/REFAPP-UI-FRAMEWORK/package/target/distro/web/modules/adminui-1.5.0.omod
14-Sep-2021 02:00:45 [INFO] Copying registrationcore-omod-1.11.0.jar to /home/bamboo-agent/bamboo-agent/xml-data/build-dir/REFAPP-UI-FRAMEWORK/package/target/distro/web/modules/registrationcore-1.11.0.omod
14-Sep-2021 02:00:45 [INFO] Copying appointmentscheduling-omod-1.16.0.jar to /home/bamboo-agent/bamboo-agent/xml-data/build-dir/REFAPP-UI-FRAMEWORK/package/target/distro/web/modules/appointmentscheduling-1.16.0.omod
14-Sep-2021 02:00:45 [INFO] Copying atlas-omod-2.2.5.omod to /home/bamboo-agent/bamboo-agent/xml-data/build-dir/REFAPP-UI-FRAMEWORK/package/target/distro/web/modules/atlas-2.2.5.omod
14-Sep-2021 02:00:45 [INFO] Copying calculation-omod-1.3.0.jar to /home/bamboo-agent/bamboo-agent/xml-data/build-dir/REFAPP-UI-FRAMEWORK/package/target/distro/web/modules/calculation-1.3.0.omod
14-Sep-2021 02:00:45 [INFO] Copying webservices.rest-omod-2.32.0-SNAPSHOT.jar to /home/bamboo-agent/bamboo-agent/xml-data/build-dir/REFAPP-UI-FRAMEWORK/package/target/distro/web/modules/webservices.rest-2.32.0-SNAPSHOT.omod
14-Sep-2021 02:00:45 [INFO] Copying spa-omod-1.0.8.jar to /home/bamboo-agent/bamboo-agent/xml-data/build-dir/REFAPP-UI-FRAMEWORK/package/target/distro/web/modules/spa-1.0.8.omod
14-Sep-2021 02:00:45 [INFO] Copying uicommons-omod-2.18.0.jar to /home/bamboo-agent/bamboo-agent/xml-data/build-dir/REFAPP-UI-FRAMEWORK/package/target/distro/web/modules/uicommons-2.18.0.omod
14-Sep-2021 02:00:45 [INFO] Copying uiframework-omod-3.21.0.jar to /home/bamboo-agent/bamboo-agent/xml-data/build-dir/REFAPP-UI-FRAMEWORK/package/target/distro/web/modules/uiframework-3.21.0.omod
14-Sep-2021 02:00:45 [INFO] Copying metadatasharing-omod-1.8.0.jar to /home/bamboo-agent/bamboo-agent/xml-data/build-dir/REFAPP-UI-FRAMEWORK/package/target/distro/web/modules/metadatasharing-1.8.0.omod
14-Sep-2021 02:00:45
14-Sep-2021 02:00:45 Downloading OWAs...
14-Sep-2021 02:00:45
14-Sep-2021 02:00:45
14-Sep-2021 02:00:45 Downloading OWA: org.openmrs.owa:openmrs-owa-sysadmin:1.2
14-Sep-2021 02:00:45 [INFO] Configured Artifact: org.openmrs.owa:sysadmin:1.2:zip
14-Sep-2021 02:00:45 [INFO] Copying sysadmin-1.2.zip to /home/bamboo-agent/bamboo-agent/xml-data/build-dir/REFAPP-UI-FRAMEWORK/package/target/distro/web/owa/sysadmin-1.2.zip
14-Sep-2021 02:00:45
14-Sep-2021 02:00:45 Creating Docker Compose configuration...
14-Sep-2021 02:00:45
14-Sep-2021 02:00:46
14-Sep-2021 02:00:46 The 'referenceapplication' distribution created! To start up the server run 'docker-compose up' from /home/bamboo-agent/bamboo-agent/xml-data/build-dir/REFAPP-UI-FRAMEWORK/package/target/distro
14-Sep-2021 02:00:46
14-Sep-2021 02:00:46 [INFO]
14-Sep-2021 02:00:46 [INFO] --- openmrs-sdk-maven-plugin:4.0.0:build-distro (build-bundled-distro) @ referenceapplication-package ---
14-Sep-2021 02:00:46
14-Sep-2021 02:00:46 Downloading modules...
14-Sep-2021 02:00:46
14-Sep-2021 02:00:46 [INFO] Configured Artifact: org.openmrs.web:openmrs-webapp:2.4.0:war
14-Sep-2021 02:00:46 [INFO] Copying openmrs-webapp-2.4.0.war to /home/bamboo-agent/bamboo-agent/xml-data/build-dir/REFAPP-UI-FRAMEWORK/package/target/bundled-distro/web/openmrs-2.4.0.war
14-Sep-2021 02:00:47 file:/home/bamboo-agent/bamboo-agent/xml-data/build-dir/REFAPP-UI-FRAMEWORK/package/target/bundled-distro/web/openmrs-2.4.0.war
14-Sep-2021 02:00:47 target:/home/bamboo-agent/bamboo-agent/xml-data/build-dir/REFAPP-UI-FRAMEWORK/package/target/bundled-distro/web
14-Sep-2021 02:00:47 [INFO] Configured Artifact: org.openmrs.module:addresshierarchy-omod:2.14.2:jar
14-Sep-2021 02:00:47 [INFO] Configured Artifact: org.openmrs.module:legacyui-omod:1.8.3:jar
14-Sep-2021 02:00:47 [INFO] Configured Artifact: org.openmrs.module:openconceptlab-omod:1.2.6:jar
14-Sep-2021 02:00:47 [INFO] Configured Artifact: org.openmrs.module:metadatadeploy-omod:1.13.0:jar
14-Sep-2021 02:00:47 [INFO] Configured Artifact: org.openmrs.module:reportingrest-omod:1.12.0:jar
14-Sep-2021 02:00:47 [INFO] Configured Artifact: org.openmrs.module:owa-omod:1.13.0:jar
14-Sep-2021 02:00:47 [INFO] Configured Artifact: org.openmrs.module:fhir2-omod:1.2.2:jar
14-Sep-2021 02:00:47 [INFO] Configured Artifact: org.openmrs.module:serialization.xstream-omod:0.2.15:omod
14-Sep-2021 02:00:47 [INFO] Configured Artifact: org.openmrs.module:registrationapp-omod:1.24.0:jar
14-Sep-2021 02:00:47 [INFO] Configured Artifact: org.openmrs:event-omod:2.10.0-SNAPSHOT:jar
14-Sep-2021 02:00:47 [INFO] Configured Artifact: org.openmrs.module:uilibrary-omod:2.0.7:jar
14-Sep-2021 02:00:47 [INFO] Configured Artifact: org.openmrs.module:htmlwidgets-omod:1.10.0:jar
14-Sep-2021 02:00:47 [INFO] Configured Artifact: org.openmrs.module:dataexchange-omod:1.3.7:jar
14-Sep-2021 02:00:47 [INFO] Configured Artifact: org.openmrs.module:appui-omod:1.14.0:jar
14-Sep-2021 02:00:47 [INFO] Configured Artifact: org.openmrs.module:allergyui-omod:1.8.4:jar
14-Sep-2021 02:00:47 [INFO] Configured Artifact: org.openmrs.module:providermanagement-omod:2.13.0:jar
14-Sep-2021 02:00:47 [INFO] Configured Artifact: org.openmrs.module:appointmentschedulingui-omod:1.12.0:jar
14-Sep-2021 02:00:47 [INFO] Configured Artifact: org.openmrs.module:attachments-omod:2.5.0:jar
14-Sep-2021 02:00:47 [INFO] Configured Artifact: org.openmrs.module:formentryapp-omod:1.4.2:jar
14-Sep-2021 02:00:47 [INFO] Configured Artifact: org.openmrs.module:idgen-omod:4.7.0:jar
14-Sep-2021 02:00:47 [INFO] Configured Artifact: org.openmrs.module:metadatamapping-omod:1.4.0:jar
14-Sep-2021 02:00:47 [INFO] Configured Artifact: org.openmrs.module:htmlformentryui-omod:2.0.0:jar
14-Sep-2021 02:00:47 [INFO] Configured Artifact: org.openmrs.module:referencedemodata-omod:1.4.7-SNAPSHOT:jar
14-Sep-2021 02:00:47 [INFO] Configured Artifact: org.openmrs.module:emrapi-omod:1.32.0:jar
14-Sep-2021 02:00:47 [INFO] Configured Artifact: org.openmrs.module:referenceapplication-omod:2.12.0-SNAPSHOT:jar
14-Sep-2021 02:00:47 [INFO] Configured Artifact: org.openmrs.module:htmlformentry-omod:4.1.0:jar
14-Sep-2021 02:00:47 [INFO] Configured Artifact: org.openmrs.module:appframework-omod:2.16.0:jar
14-Sep-2021 02:00:47 [INFO] Configured Artifact: org.openmrs.module:referencemetadata-omod:2.12.0-SNAPSHOT:jar
14-Sep-2021 02:00:47 [INFO] Configured Artifact: org.openmrs.module:reportingui-omod:1.8.0:jar
14-Sep-2021 02:00:47 [INFO] Configured Artifact: org.openmrs.module:coreapps-omod:1.33.0:jar
14-Sep-2021 02:00:47 [INFO] Configured Artifact: org.openmrs.module:reportingcompatibility-omod:2.0.8:jar
14-Sep-2021 02:00:47 [INFO] Configured Artifact: org.openmrs.module:reporting-omod:1.23.0:jar
14-Sep-2021 02:00:47 [INFO] Configured Artifact: org.openmrs.module:adminui-omod:1.5.0:jar
14-Sep-2021 02:00:47 [INFO] Configured Artifact: org.openmrs.module:registrationcore-omod:1.11.0:jar
14-Sep-2021 02:00:47 [INFO] Configured Artifact: org.openmrs.module:appointmentscheduling-omod:1.16.0:jar
14-Sep-2021 02:00:47 [INFO] Configured Artifact: org.openmrs.module:atlas-omod:2.2.5:omod
14-Sep-2021 02:00:47 [INFO] Configured Artifact: org.openmrs.module:calculation-omod:1.3.0:jar
14-Sep-2021 02:00:47 [INFO] Configured Artifact: org.openmrs.module:webservices.rest-omod:2.32.0-SNAPSHOT:jar
14-Sep-2021 02:00:47 [INFO] Configured Artifact: org.openmrs.module:spa-omod:1.0.8:jar
14-Sep-2021 02:00:47 [INFO] Configured Artifact: org.openmrs.module:uicommons-omod:2.18.0:jar
14-Sep-2021 02:00:47 [INFO] Configured Artifact: org.openmrs.module:uiframework-omod:3.21.0:jar
14-Sep-2021 02:00:47 [INFO] Configured Artifact: org.openmrs.module:metadatasharing-omod:1.8.0:jar
14-Sep-2021 02:00:47 [INFO] Copying addresshierarchy-omod-2.14.2.jar to /home/bamboo-agent/bamboo-agent/xml-data/build-dir/REFAPP-UI-FRAMEWORK/package/target/bundled-distro/web/WEB-INF/bundledModules/addresshierarchy-2.14.2.omod
14-Sep-2021 02:00:47 [INFO] Copying legacyui-omod-1.8.3.jar to /home/bamboo-agent/bamboo-agent/xml-data/build-dir/REFAPP-UI-FRAMEWORK/package/target/bundled-distro/web/WEB-INF/bundledModules/legacyui-1.8.3.omod
14-Sep-2021 02:00:47 [INFO] Copying openconceptlab-omod-1.2.6.jar to /home/bamboo-agent/bamboo-agent/xml-data/build-dir/REFAPP-UI-FRAMEWORK/package/target/bundled-distro/web/WEB-INF/bundledModules/openconceptlab-1.2.6.omod
14-Sep-2021 02:00:47 [INFO] Copying metadatadeploy-omod-1.13.0.jar to /home/bamboo-agent/bamboo-agent/xml-data/build-dir/REFAPP-UI-FRAMEWORK/package/target/bundled-distro/web/WEB-INF/bundledModules/metadatadeploy-1.13.0.omod
14-Sep-2021 02:00:47 [INFO] Copying reportingrest-omod-1.12.0.jar to /home/bamboo-agent/bamboo-agent/xml-data/build-dir/REFAPP-UI-FRAMEWORK/package/target/bundled-distro/web/WEB-INF/bundledModules/reportingrest-1.12.0.omod
14-Sep-2021 02:00:47 [INFO] Copying owa-omod-1.13.0.jar to /home/bamboo-agent/bamboo-agent/xml-data/build-dir/REFAPP-UI-FRAMEWORK/package/target/bundled-distro/web/WEB-INF/bundledModules/owa-1.13.0.omod
14-Sep-2021 02:00:47 [INFO] Copying fhir2-omod-1.2.2.jar to /home/bamboo-agent/bamboo-agent/xml-data/build-dir/REFAPP-UI-FRAMEWORK/package/target/bundled-distro/web/WEB-INF/bundledModules/fhir2-1.2.2.omod
14-Sep-2021 02:00:47 [INFO] Copying serialization.xstream-omod-0.2.15.omod to /home/bamboo-agent/bamboo-agent/xml-data/build-dir/REFAPP-UI-FRAMEWORK/package/target/bundled-distro/web/WEB-INF/bundledModules/serialization.xstream-0.2.15.omod
14-Sep-2021 02:00:47 [INFO] Copying registrationapp-omod-1.24.0.jar to /home/bamboo-agent/bamboo-agent/xml-data/build-dir/REFAPP-UI-FRAMEWORK/package/target/bundled-distro/web/WEB-INF/bundledModules/registrationapp-1.24.0.omod
14-Sep-2021 02:00:47 [INFO] Copying event-omod-2.10.0-SNAPSHOT.jar to /home/bamboo-agent/bamboo-agent/xml-data/build-dir/REFAPP-UI-FRAMEWORK/package/target/bundled-distro/web/WEB-INF/bundledModules/event-2.10.0-SNAPSHOT.omod
14-Sep-2021 02:00:47 [INFO] Copying uilibrary-omod-2.0.7.jar to /home/bamboo-agent/bamboo-agent/xml-data/build-dir/REFAPP-UI-FRAMEWORK/package/target/bundled-distro/web/WEB-INF/bundledModules/uilibrary-2.0.7.omod
14-Sep-2021 02:00:47 [INFO] Copying htmlwidgets-omod-1.10.0.jar to /home/bamboo-agent/bamboo-agent/xml-data/build-dir/REFAPP-UI-FRAMEWORK/package/target/bundled-distro/web/WEB-INF/bundledModules/htmlwidgets-1.10.0.omod
14-Sep-2021 02:00:47 [INFO] Copying dataexchange-omod-1.3.7.jar to /home/bamboo-agent/bamboo-agent/xml-data/build-dir/REFAPP-UI-FRAMEWORK/package/target/bundled-distro/web/WEB-INF/bundledModules/dataexchange-1.3.7.omod
14-Sep-2021 02:00:47 [INFO] Copying appui-omod-1.14.0.jar to /home/bamboo-agent/bamboo-agent/xml-data/build-dir/REFAPP-UI-FRAMEWORK/package/target/bundled-distro/web/WEB-INF/bundledModules/appui-1.14.0.omod
14-Sep-2021 02:00:47 [INFO] Copying allergyui-omod-1.8.4.jar to /home/bamboo-agent/bamboo-agent/xml-data/build-dir/REFAPP-UI-FRAMEWORK/package/target/bundled-distro/web/WEB-INF/bundledModules/allergyui-1.8.4.omod
14-Sep-2021 02:00:47 [INFO] Copying providermanagement-omod-2.13.0.jar to /home/bamboo-agent/bamboo-agent/xml-data/build-dir/REFAPP-UI-FRAMEWORK/package/target/bundled-distro/web/WEB-INF/bundledModules/providermanagement-2.13.0.omod
14-Sep-2021 02:00:47 [INFO] Copying appointmentschedulingui-omod-1.12.0.jar to /home/bamboo-agent/bamboo-agent/xml-data/build-dir/REFAPP-UI-FRAMEWORK/package/target/bundled-distro/web/WEB-INF/bundledModules/appointmentschedulingui-1.12.0.omod
14-Sep-2021 02:00:47 [INFO] Copying attachments-omod-2.5.0.jar to /home/bamboo-agent/bamboo-agent/xml-data/build-dir/REFAPP-UI-FRAMEWORK/package/target/bundled-distro/web/WEB-INF/bundledModules/attachments-2.5.0.omod
14-Sep-2021 02:00:47 [INFO] Copying formentryapp-omod-1.4.2.jar to /home/bamboo-agent/bamboo-agent/xml-data/build-dir/REFAPP-UI-FRAMEWORK/package/target/bundled-distro/web/WEB-INF/bundledModules/formentryapp-1.4.2.omod
14-Sep-2021 02:00:47 [INFO] Copying idgen-omod-4.7.0.jar to /home/bamboo-agent/bamboo-agent/xml-data/build-dir/REFAPP-UI-FRAMEWORK/package/target/bundled-distro/web/WEB-INF/bundledModules/idgen-4.7.0.omod
14-Sep-2021 02:00:47 [INFO] Copying metadatamapping-omod-1.4.0.jar to /home/bamboo-agent/bamboo-agent/xml-data/build-dir/REFAPP-UI-FRAMEWORK/package/target/bundled-distro/web/WEB-INF/bundledModules/metadatamapping-1.4.0.omod
14-Sep-2021 02:00:47 [INFO] Copying htmlformentryui-omod-2.0.0.jar to /home/bamboo-agent/bamboo-agent/xml-data/build-dir/REFAPP-UI-FRAMEWORK/package/target/bundled-distro/web/WEB-INF/bundledModules/htmlformentryui-2.0.0.omod
14-Sep-2021 02:00:47 [INFO] Copying referencedemodata-omod-1.4.7-SNAPSHOT.jar to /home/bamboo-agent/bamboo-agent/xml-data/build-dir/REFAPP-UI-FRAMEWORK/package/target/bundled-distro/web/WEB-INF/bundledModules/referencedemodata-1.4.7-SNAPSHOT.omod
14-Sep-2021 02:00:47 [INFO] Copying emrapi-omod-1.32.0.jar to /home/bamboo-agent/bamboo-agent/xml-data/build-dir/REFAPP-UI-FRAMEWORK/package/target/bundled-distro/web/WEB-INF/bundledModules/emrapi-1.32.0.omod
14-Sep-2021 02:00:47 [INFO] Copying referenceapplication-omod-2.12.0-SNAPSHOT.jar to /home/bamboo-agent/bamboo-agent/xml-data/build-dir/REFAPP-UI-FRAMEWORK/package/target/bundled-distro/web/WEB-INF/bundledModules/referenceapplication-2.12.0-SNAPSHOT.omod
14-Sep-2021 02:00:47 [INFO] Copying htmlformentry-omod-4.1.0.jar to /home/bamboo-agent/bamboo-agent/xml-data/build-dir/REFAPP-UI-FRAMEWORK/package/target/bundled-distro/web/WEB-INF/bundledModules/htmlformentry-4.1.0.omod
14-Sep-2021 02:00:47 [INFO] Copying appframework-omod-2.16.0.jar to /home/bamboo-agent/bamboo-agent/xml-data/build-dir/REFAPP-UI-FRAMEWORK/package/target/bundled-distro/web/WEB-INF/bundledModules/appframework-2.16.0.omod
14-Sep-2021 02:00:47 [INFO] Copying referencemetadata-omod-2.12.0-SNAPSHOT.jar to /home/bamboo-agent/bamboo-agent/xml-data/build-dir/REFAPP-UI-FRAMEWORK/package/target/bundled-distro/web/WEB-INF/bundledModules/referencemetadata-2.12.0-SNAPSHOT.omod
14-Sep-2021 02:00:47 [INFO] Copying reportingui-omod-1.8.0.jar to /home/bamboo-agent/bamboo-agent/xml-data/build-dir/REFAPP-UI-FRAMEWORK/package/target/bundled-distro/web/WEB-INF/bundledModules/reportingui-1.8.0.omod
14-Sep-2021 02:00:47 [INFO] Copying coreapps-omod-1.33.0.jar to /home/bamboo-agent/bamboo-agent/xml-data/build-dir/REFAPP-UI-FRAMEWORK/package/target/bundled-distro/web/WEB-INF/bundledModules/coreapps-1.33.0.omod
14-Sep-2021 02:00:47 [INFO] Copying reportingcompatibility-omod-2.0.8.jar to /home/bamboo-agent/bamboo-agent/xml-data/build-dir/REFAPP-UI-FRAMEWORK/package/target/bundled-distro/web/WEB-INF/bundledModules/reportingcompatibility-2.0.8.omod
14-Sep-2021 02:00:47 [INFO] Copying reporting-omod-1.23.0.jar to /home/bamboo-agent/bamboo-agent/xml-data/build-dir/REFAPP-UI-FRAMEWORK/package/target/bundled-distro/web/WEB-INF/bundledModules/reporting-1.23.0.omod
14-Sep-2021 02:00:47 [INFO] Copying adminui-omod-1.5.0.jar to /home/bamboo-agent/bamboo-agent/xml-data/build-dir/REFAPP-UI-FRAMEWORK/package/target/bundled-distro/web/WEB-INF/bundledModules/adminui-1.5.0.omod
14-Sep-2021 02:00:47 [INFO] Copying registrationcore-omod-1.11.0.jar to /home/bamboo-agent/bamboo-agent/xml-data/build-dir/REFAPP-UI-FRAMEWORK/package/target/bundled-distro/web/WEB-INF/bundledModules/registrationcore-1.11.0.omod
14-Sep-2021 02:00:47 [INFO] Copying appointmentscheduling-omod-1.16.0.jar to /home/bamboo-agent/bamboo-agent/xml-data/build-dir/REFAPP-UI-FRAMEWORK/package/target/bundled-distro/web/WEB-INF/bundledModules/appointmentscheduling-1.16.0.omod
14-Sep-2021 02:00:47 [INFO] Copying atlas-omod-2.2.5.omod to /home/bamboo-agent/bamboo-agent/xml-data/build-dir/REFAPP-UI-FRAMEWORK/package/target/bundled-distro/web/WEB-INF/bundledModules/atlas-2.2.5.omod
14-Sep-2021 02:00:47 [INFO] Copying calculation-omod-1.3.0.jar to /home/bamboo-agent/bamboo-agent/xml-data/build-dir/REFAPP-UI-FRAMEWORK/package/target/bundled-distro/web/WEB-INF/bundledModules/calculation-1.3.0.omod
14-Sep-2021 02:00:47 [INFO] Copying webservices.rest-omod-2.32.0-SNAPSHOT.jar to /home/bamboo-agent/bamboo-agent/xml-data/build-dir/REFAPP-UI-FRAMEWORK/package/target/bundled-distro/web/WEB-INF/bundledModules/webservices.rest-2.32.0-SNAPSHOT.omod
14-Sep-2021 02:00:47 [INFO] Copying spa-omod-1.0.8.jar to /home/bamboo-agent/bamboo-agent/xml-data/build-dir/REFAPP-UI-FRAMEWORK/package/target/bundled-distro/web/WEB-INF/bundledModules/spa-1.0.8.omod
14-Sep-2021 02:00:47 [INFO] Copying uicommons-omod-2.18.0.jar to /home/bamboo-agent/bamboo-agent/xml-data/build-dir/REFAPP-UI-FRAMEWORK/package/target/bundled-distro/web/WEB-INF/bundledModules/uicommons-2.18.0.omod
14-Sep-2021 02:00:47 [INFO] Copying uiframework-omod-3.21.0.jar to /home/bamboo-agent/bamboo-agent/xml-data/build-dir/REFAPP-UI-FRAMEWORK/package/target/bundled-distro/web/WEB-INF/bundledModules/uiframework-3.21.0.omod
14-Sep-2021 02:00:47 [INFO] Copying metadatasharing-omod-1.8.0.jar to /home/bamboo-agent/bamboo-agent/xml-data/build-dir/REFAPP-UI-FRAMEWORK/package/target/bundled-distro/web/WEB-INF/bundledModules/metadatasharing-1.8.0.omod
14-Sep-2021 02:00:47
14-Sep-2021 02:00:47 Downloading OWAs...
14-Sep-2021 02:00:47
14-Sep-2021 02:00:47
14-Sep-2021 02:00:47 Downloading OWA: org.openmrs.owa:openmrs-owa-sysadmin:1.2
14-Sep-2021 02:00:47 [INFO] Configured Artifact: org.openmrs.owa:sysadmin:1.2:zip
14-Sep-2021 02:00:47 [INFO] Copying sysadmin-1.2.zip to /home/bamboo-agent/bamboo-agent/xml-data/build-dir/REFAPP-UI-FRAMEWORK/package/target/bundled-distro/web/WEB-INF/bundledOwas/sysadmin-1.2.zip
14-Sep-2021 02:00:49
14-Sep-2021 02:00:49 Creating Docker Compose configuration...
14-Sep-2021 02:00:49
14-Sep-2021 02:00:50
14-Sep-2021 02:00:50 The 'referenceapplication' distribution created! To start up the server run 'docker-compose up' from /home/bamboo-agent/bamboo-agent/xml-data/build-dir/REFAPP-UI-FRAMEWORK/package/target/bundled-distro
14-Sep-2021 02:00:50
14-Sep-2021 02:00:50 [INFO]
14-Sep-2021 02:00:50 [INFO] --- maven-compiler-plugin:3.1:compile (default-compile) @ referenceapplication-package ---
14-Sep-2021 02:00:50 [INFO] No sources to compile
14-Sep-2021 02:00:50 [INFO]
14-Sep-2021 02:00:50 [INFO] --- maven-resources-plugin:2.6:testResources (default-testResources) @ referenceapplication-package ---
14-Sep-2021 02:00:50 [INFO] Using 'UTF-8' encoding to copy filtered resources.
14-Sep-2021 02:00:50 [INFO] skip non existing resourceDirectory /home/bamboo-agent/bamboo-agent/xml-data/build-dir/REFAPP-UI-FRAMEWORK/package/src/test/resources
14-Sep-2021 02:00:50 [INFO] skip non existing resourceDirectory /home/bamboo-agent/bamboo-agent/xml-data/build-dir/REFAPP-UI-FRAMEWORK/package/src/test/resources
14-Sep-2021 02:00:50 [INFO]
14-Sep-2021 02:00:50 [INFO] --- maven-compiler-plugin:3.1:testCompile (default-testCompile) @ referenceapplication-package ---
14-Sep-2021 02:00:50 [INFO] No sources to compile
14-Sep-2021 02:00:50 [INFO]
14-Sep-2021 02:00:50 [INFO] --- maven-surefire-plugin:2.12:test (default-test) @ referenceapplication-package ---
14-Sep-2021 02:00:50 [INFO] No tests to run.
14-Sep-2021 02:00:50 [INFO] Surefire report directory: /home/bamboo-agent/bamboo-agent/xml-data/build-dir/REFAPP-UI-FRAMEWORK/package/target/surefire-reports
14-Sep-2021 02:00:50
14-Sep-2021 02:00:50 -------------------------------------------------------
14-Sep-2021 02:00:50 T E S T S
14-Sep-2021 02:00:50 -------------------------------------------------------
14-Sep-2021 02:00:51
14-Sep-2021 02:00:51 Results :
14-Sep-2021 02:00:51
14-Sep-2021 02:00:51 Tests run: 0, Failures: 0, Errors: 0, Skipped: 0
14-Sep-2021 02:00:51
14-Sep-2021 02:00:51 [INFO]
14-Sep-2021 02:00:51 [INFO] --- maven-jar-plugin:2.4:jar (default-jar) @ referenceapplication-package ---
14-Sep-2021 02:00:51 [INFO] Building jar: /home/bamboo-agent/bamboo-agent/xml-data/build-dir/REFAPP-UI-FRAMEWORK/package/target/referenceapplication-package-2.12.0-SNAPSHOT.jar
14-Sep-2021 02:00:51 [INFO]
14-Sep-2021 02:00:51 [INFO] --- maven-assembly-plugin:2.3:single (make-assembly) @ referenceapplication-package ---
14-Sep-2021 02:00:51 [INFO] Reading assembly descriptor: /home/bamboo-agent/bamboo-agent/xml-data/build-dir/REFAPP-UI-FRAMEWORK/package/src/main/assembly/assembly.xml
14-Sep-2021 02:00:51 [INFO] Building zip: /home/bamboo-agent/bamboo-agent/xml-data/build-dir/REFAPP-UI-FRAMEWORK/package/target/referenceapplication-package-2.12.0-SNAPSHOT-addons.zip
14-Sep-2021 02:00:56 [INFO]
14-Sep-2021 02:00:56 [INFO] --- build-helper-maven-plugin:3.0.0:attach-artifact (attach-artifacts) @ referenceapplication-package ---
14-Sep-2021 02:00:57 [INFO]
14-Sep-2021 02:00:57 [INFO] --- maven-jar-plugin:2.4:test-jar (default) @ referenceapplication-package ---
14-Sep-2021 02:00:57 [WARNING] JAR will be empty - no content was marked for inclusion!
14-Sep-2021 02:00:57 [INFO] Building jar: /home/bamboo-agent/bamboo-agent/xml-data/build-dir/REFAPP-UI-FRAMEWORK/package/target/referenceapplication-package-2.12.0-SNAPSHOT-tests.jar
14-Sep-2021 02:00:57 [INFO]
14-Sep-2021 02:00:57 [INFO] --- maven-install-plugin:2.4:install (default-install) @ referenceapplication-package ---
14-Sep-2021 02:00:57 [INFO] Installing /home/bamboo-agent/bamboo-agent/xml-data/build-dir/REFAPP-UI-FRAMEWORK/package/target/referenceapplication-package-2.12.0-SNAPSHOT.jar to /home/bamboo-agent/.m2/repository/org/openmrs/distro/referenceapplication-package/2.12.0-SNAPSHOT/referenceapplication-package-2.12.0-SNAPSHOT.jar
14-Sep-2021 02:00:57 [INFO] Installing /home/bamboo-agent/bamboo-agent/xml-data/build-dir/REFAPP-UI-FRAMEWORK/package/pom.xml to /home/bamboo-agent/.m2/repository/org/openmrs/distro/referenceapplication-package/2.12.0-SNAPSHOT/referenceapplication-package-2.12.0-SNAPSHOT.pom
14-Sep-2021 02:00:57 [INFO] Installing /home/bamboo-agent/bamboo-agent/xml-data/build-dir/REFAPP-UI-FRAMEWORK/package/target/referenceapplication-package-2.12.0-SNAPSHOT-addons.zip to /home/bamboo-agent/.m2/repository/org/openmrs/distro/referenceapplication-package/2.12.0-SNAPSHOT/referenceapplication-package-2.12.0-SNAPSHOT-addons.zip
14-Sep-2021 02:00:57 [INFO] Installing /home/bamboo-agent/bamboo-agent/xml-data/build-dir/REFAPP-UI-FRAMEWORK/package/target/bundled-distro/web/openmrs.war to /home/bamboo-agent/.m2/repository/org/openmrs/distro/referenceapplication-package/2.12.0-SNAPSHOT/referenceapplication-package-2.12.0-SNAPSHOT.war
14-Sep-2021 02:00:58 [INFO] Installing /home/bamboo-agent/bamboo-agent/xml-data/build-dir/REFAPP-UI-FRAMEWORK/package/target/referenceapplication-package-2.12.0-SNAPSHOT-tests.jar to /home/bamboo-agent/.m2/repository/org/openmrs/distro/referenceapplication-package/2.12.0-SNAPSHOT/referenceapplication-package-2.12.0-SNAPSHOT-tests.jar
14-Sep-2021 02:00:58 [INFO]                                                                         
14-Sep-2021 02:00:58 [INFO] ------------------------------------------------------------------------
14-Sep-2021 02:00:58 [INFO] Building Reference Application Distribution UI Tests 2.12.0-SNAPSHOT
14-Sep-2021 02:00:58 [INFO] ------------------------------------------------------------------------
14-Sep-2021 02:00:58 [INFO]
14-Sep-2021 02:00:58 [INFO] --- maven-clean-plugin:2.5:clean (default-clean) @ referenceapplication-ui-tests ---
14-Sep-2021 02:00:58 [INFO]
14-Sep-2021 02:00:58 [INFO] --- maven-resources-plugin:2.6:resources (default-resources) @ referenceapplication-ui-tests ---
14-Sep-2021 02:00:58 [INFO] Using 'UTF-8' encoding to copy filtered resources.
14-Sep-2021 02:00:58 [INFO] skip non existing resourceDirectory /home/bamboo-agent/bamboo-agent/xml-data/build-dir/REFAPP-UI-FRAMEWORK/ui-tests/src/main/resources
14-Sep-2021 02:00:58 [INFO]
14-Sep-2021 02:00:58 [INFO] --- maven-compiler-plugin:3.1:compile (default-compile) @ referenceapplication-ui-tests ---
14-Sep-2021 02:00:58 [INFO] No sources to compile
14-Sep-2021 02:00:58 [INFO]
14-Sep-2021 02:00:58 [INFO] --- maven-resources-plugin:2.6:testResources (default-testResources) @ referenceapplication-ui-tests ---
14-Sep-2021 02:00:58 [INFO] Using 'UTF-8' encoding to copy filtered resources.
14-Sep-2021 02:00:58 [INFO] Copying 2 resources
14-Sep-2021 02:00:58 [INFO] Copying 2 resources
14-Sep-2021 02:00:58 [INFO]
14-Sep-2021 02:00:58 [INFO] --- maven-compiler-plugin:3.1:testCompile (default-testCompile) @ referenceapplication-ui-tests ---
14-Sep-2021 02:00:58 [INFO] Changes detected - recompiling the module!
14-Sep-2021 02:00:58 [INFO] Compiling 119 source files to /home/bamboo-agent/bamboo-agent/xml-data/build-dir/REFAPP-UI-FRAMEWORK/ui-tests/target/test-classes
14-Sep-2021 02:01:01 [WARNING] /home/bamboo-agent/bamboo-agent/xml-data/build-dir/REFAPP-UI-FRAMEWORK/ui-tests/src/test/java/org/openmrs/reference/AddDeleteLocationTest.java: Some input files use or override a deprecated API.
14-Sep-2021 02:01:01 [WARNING] /home/bamboo-agent/bamboo-agent/xml-data/build-dir/REFAPP-UI-FRAMEWORK/ui-tests/src/test/java/org/openmrs/reference/AddDeleteLocationTest.java: Recompile with -Xlint:deprecation for details.
14-Sep-2021 02:01:01 [WARNING] /home/bamboo-agent/bamboo-agent/xml-data/build-dir/REFAPP-UI-FRAMEWORK/ui-tests/src/test/java/org/openmrs/reference/AddRolesToUserTest.java: /home/bamboo-agent/bamboo-agent/xml-data/build-dir/REFAPP-UI-FRAMEWORK/ui-tests/src/test/java/org/openmrs/reference/AddRolesToUserTest.java uses unchecked or unsafe operations.
14-Sep-2021 02:01:01 [WARNING] /home/bamboo-agent/bamboo-agent/xml-data/build-dir/REFAPP-UI-FRAMEWORK/ui-tests/src/test/java/org/openmrs/reference/AddRolesToUserTest.java: Recompile with -Xlint:unchecked for details.
14-Sep-2021 02:01:01 [INFO]
14-Sep-2021 02:01:01 [INFO] --- maven-antrun-plugin:1.8:run (make-mac-chromedriver-executable) @ referenceapplication-ui-tests ---
14-Sep-2021 02:01:02 [INFO] Executing tasks
14-Sep-2021 02:01:02
14-Sep-2021 02:01:02 main:
14-Sep-2021 02:01:02 [INFO] An Ant BuildException has occured: /home/bamboo-agent/bamboo-agent/xml-data/build-dir/REFAPP-UI-FRAMEWORK/ui-tests/target/test-classes/chromedriver/mac does not exist.
14-Sep-2021 02:01:02 around Ant part ...<chmod file="target/test-classes/chromedriver/mac/chromedriver" perm="755"/>... @ 4:79 in /home/bamboo-agent/bamboo-agent/xml-data/build-dir/REFAPP-UI-FRAMEWORK/ui-tests/target/antrun/build-main.xml
14-Sep-2021 02:01:02 /home/bamboo-agent/bamboo-agent/xml-data/build-dir/REFAPP-UI-FRAMEWORK/ui-tests/target/antrun/build-main.xml:4: /home/bamboo-agent/bamboo-agent/xml-data/build-dir/REFAPP-UI-FRAMEWORK/ui-tests/target/test-classes/chromedriver/mac does not exist.
14-Sep-2021 02:01:02         at org.apache.tools.ant.types.AbstractFileSet.getDirectoryScanner(AbstractFileSet.java:484)
14-Sep-2021 02:01:02         at org.apache.tools.ant.taskdefs.ExecuteOn.runExec(ExecuteOn.java:369)
14-Sep-2021 02:01:02         at org.apache.tools.ant.taskdefs.ExecTask.execute(ExecTask.java:495)
14-Sep-2021 02:01:02         at org.apache.tools.ant.taskdefs.Chmod.execute(Chmod.java:181)
14-Sep-2021 02:01:02         at org.apache.tools.ant.UnknownElement.execute(UnknownElement.java:292)
14-Sep-2021 02:01:02         at sun.reflect.NativeMethodAccessorImpl.invoke0(Native Method)
14-Sep-2021 02:01:02         at sun.reflect.NativeMethodAccessorImpl.invoke(NativeMethodAccessorImpl.java:62)
14-Sep-2021 02:01:02         at sun.reflect.DelegatingMethodAccessorImpl.invoke(DelegatingMethodAccessorImpl.java:43)
14-Sep-2021 02:01:02         at java.lang.reflect.Method.invoke(Method.java:498)
14-Sep-2021 02:01:02         at org.apache.tools.ant.dispatch.DispatchUtils.execute(DispatchUtils.java:106)
14-Sep-2021 02:01:02         at org.apache.tools.ant.Task.perform(Task.java:348)
14-Sep-2021 02:01:02         at org.apache.tools.ant.Target.execute(Target.java:435)
14-Sep-2021 02:01:02         at org.apache.tools.ant.Target.performTasks(Target.java:456)
14-Sep-2021 02:01:02         at org.apache.tools.ant.Project.executeSortedTargets(Project.java:1393)
14-Sep-2021 02:01:02         at org.apache.tools.ant.Project.executeTarget(Project.java:1364)
14-Sep-2021 02:01:02         at org.apache.maven.plugin.antrun.AntRunMojo.execute(AntRunMojo.java:313)
14-Sep-2021 02:01:02         at org.apache.maven.plugin.DefaultBuildPluginManager.executeMojo(DefaultBuildPluginManager.java:134)
14-Sep-2021 02:01:02         at org.apache.maven.lifecycle.internal.MojoExecutor.execute(MojoExecutor.java:207)
14-Sep-2021 02:01:02         at org.apache.maven.lifecycle.internal.MojoExecutor.execute(MojoExecutor.java:153)
14-Sep-2021 02:01:02         at org.apache.maven.lifecycle.internal.MojoExecutor.execute(MojoExecutor.java:145)
14-Sep-2021 02:01:02         at org.apache.maven.lifecycle.internal.LifecycleModuleBuilder.buildProject(LifecycleModuleBuilder.java:116)
14-Sep-2021 02:01:02         at org.apache.maven.lifecycle.internal.LifecycleModuleBuilder.buildProject(LifecycleModuleBuilder.java:80)
14-Sep-2021 02:01:02         at org.apache.maven.lifecycle.internal.builder.singlethreaded.SingleThreadedBuilder.build(SingleThreadedBuilder.java:51)
14-Sep-2021 02:01:02         at org.apache.maven.lifecycle.internal.LifecycleStarter.execute(LifecycleStarter.java:128)
14-Sep-2021 02:01:02         at org.apache.maven.DefaultMaven.doExecute(DefaultMaven.java:307)
14-Sep-2021 02:01:02         at org.apache.maven.DefaultMaven.doExecute(DefaultMaven.java:193)
14-Sep-2021 02:01:02         at org.apache.maven.DefaultMaven.execute(DefaultMaven.java:106)
14-Sep-2021 02:01:02         at org.apache.maven.cli.MavenCli.execute(MavenCli.java:863)
14-Sep-2021 02:01:02         at org.apache.maven.cli.MavenCli.doMain(MavenCli.java:288)
14-Sep-2021 02:01:02         at org.apache.maven.cli.MavenCli.main(MavenCli.java:199)
14-Sep-2021 02:01:02         at sun.reflect.NativeMethodAccessorImpl.invoke0(Native Method)
14-Sep-2021 02:01:02         at sun.reflect.NativeMethodAccessorImpl.invoke(NativeMethodAccessorImpl.java:62)
14-Sep-2021 02:01:02         at sun.reflect.DelegatingMethodAccessorImpl.invoke(DelegatingMethodAccessorImpl.java:43)
14-Sep-2021 02:01:02         at java.lang.reflect.Method.invoke(Method.java:498)
14-Sep-2021 02:01:02         at org.codehaus.plexus.classworlds.launcher.Launcher.launchEnhanced(Launcher.java:289)
14-Sep-2021 02:01:02         at org.codehaus.plexus.classworlds.launcher.Launcher.launch(Launcher.java:229)
14-Sep-2021 02:01:02         at org.codehaus.plexus.classworlds.launcher.Launcher.mainWithExitCode(Launcher.java:415)
14-Sep-2021 02:01:02         at org.codehaus.plexus.classworlds.launcher.Launcher.main(Launcher.java:356)
14-Sep-2021 02:01:02 [INFO]
14-Sep-2021 02:01:02 [INFO] --- maven-antrun-plugin:1.8:run (make-linux-chromedriver-executable) @ referenceapplication-ui-tests ---
14-Sep-2021 02:01:02 [INFO] Executing tasks
14-Sep-2021 02:01:02
14-Sep-2021 02:01:02 main:
14-Sep-2021 02:01:02 [INFO] Executed tasks
14-Sep-2021 02:01:02 [INFO]
14-Sep-2021 02:01:02 [INFO] --- maven-antrun-plugin:1.8:run (make-mac-firefoxdriver-executable) @ referenceapplication-ui-tests ---
14-Sep-2021 02:01:02 [INFO] Executing tasks
14-Sep-2021 02:01:02
14-Sep-2021 02:01:02 main:
14-Sep-2021 02:01:02 [INFO] An Ant BuildException has occured: /home/bamboo-agent/bamboo-agent/xml-data/build-dir/REFAPP-UI-FRAMEWORK/ui-tests/target/test-classes/firefoxdriver/mac does not exist.
14-Sep-2021 02:01:02 around Ant part ...<chmod file="target/test-classes/firefoxdriver/mac/geckodriver" perm="755"/>... @ 4:79 in /home/bamboo-agent/bamboo-agent/xml-data/build-dir/REFAPP-UI-FRAMEWORK/ui-tests/target/antrun/build-main.xml
14-Sep-2021 02:01:02 /home/bamboo-agent/bamboo-agent/xml-data/build-dir/REFAPP-UI-FRAMEWORK/ui-tests/target/antrun/build-main.xml:4: /home/bamboo-agent/bamboo-agent/xml-data/build-dir/REFAPP-UI-FRAMEWORK/ui-tests/target/test-classes/firefoxdriver/mac does not exist.
14-Sep-2021 02:01:02         at org.apache.tools.ant.types.AbstractFileSet.getDirectoryScanner(AbstractFileSet.java:484)
14-Sep-2021 02:01:02         at org.apache.tools.ant.taskdefs.ExecuteOn.runExec(ExecuteOn.java:369)
14-Sep-2021 02:01:02         at org.apache.tools.ant.taskdefs.ExecTask.execute(ExecTask.java:495)
14-Sep-2021 02:01:02         at org.apache.tools.ant.taskdefs.Chmod.execute(Chmod.java:181)
14-Sep-2021 02:01:02         at org.apache.tools.ant.UnknownElement.execute(UnknownElement.java:292)
14-Sep-2021 02:01:02         at sun.reflect.NativeMethodAccessorImpl.invoke0(Native Method)
14-Sep-2021 02:01:02         at sun.reflect.NativeMethodAccessorImpl.invoke(NativeMethodAccessorImpl.java:62)
14-Sep-2021 02:01:02         at sun.reflect.DelegatingMethodAccessorImpl.invoke(DelegatingMethodAccessorImpl.java:43)
14-Sep-2021 02:01:02         at java.lang.reflect.Method.invoke(Method.java:498)
14-Sep-2021 02:01:02         at org.apache.tools.ant.dispatch.DispatchUtils.execute(DispatchUtils.java:106)
14-Sep-2021 02:01:02         at org.apache.tools.ant.Task.perform(Task.java:348)
14-Sep-2021 02:01:02         at org.apache.tools.ant.Target.execute(Target.java:435)
14-Sep-2021 02:01:02         at org.apache.tools.ant.Target.performTasks(Target.java:456)
14-Sep-2021 02:01:02         at org.apache.tools.ant.Project.executeSortedTargets(Project.java:1393)
14-Sep-2021 02:01:02         at org.apache.tools.ant.Project.executeTarget(Project.java:1364)
14-Sep-2021 02:01:02         at org.apache.maven.plugin.antrun.AntRunMojo.execute(AntRunMojo.java:313)
14-Sep-2021 02:01:02         at org.apache.maven.plugin.DefaultBuildPluginManager.executeMojo(DefaultBuildPluginManager.java:134)
14-Sep-2021 02:01:02         at org.apache.maven.lifecycle.internal.MojoExecutor.execute(MojoExecutor.java:207)
14-Sep-2021 02:01:02         at org.apache.maven.lifecycle.internal.MojoExecutor.execute(MojoExecutor.java:153)
14-Sep-2021 02:01:02         at org.apache.maven.lifecycle.internal.MojoExecutor.execute(MojoExecutor.java:145)
14-Sep-2021 02:01:02         at org.apache.maven.lifecycle.internal.LifecycleModuleBuilder.buildProject(LifecycleModuleBuilder.java:116)
14-Sep-2021 02:01:02         at org.apache.maven.lifecycle.internal.LifecycleModuleBuilder.buildProject(LifecycleModuleBuilder.java:80)
14-Sep-2021 02:01:02         at org.apache.maven.lifecycle.internal.builder.singlethreaded.SingleThreadedBuilder.build(SingleThreadedBuilder.java:51)
14-Sep-2021 02:01:02         at org.apache.maven.lifecycle.internal.LifecycleStarter.execute(LifecycleStarter.java:128)
14-Sep-2021 02:01:02         at org.apache.maven.DefaultMaven.doExecute(DefaultMaven.java:307)
14-Sep-2021 02:01:02         at org.apache.maven.DefaultMaven.doExecute(DefaultMaven.java:193)
14-Sep-2021 02:01:02         at org.apache.maven.DefaultMaven.execute(DefaultMaven.java:106)
14-Sep-2021 02:01:02         at org.apache.maven.cli.MavenCli.execute(MavenCli.java:863)
14-Sep-2021 02:01:02         at org.apache.maven.cli.MavenCli.doMain(MavenCli.java:288)
14-Sep-2021 02:01:02         at org.apache.maven.cli.MavenCli.main(MavenCli.java:199)
14-Sep-2021 02:01:02         at sun.reflect.NativeMethodAccessorImpl.invoke0(Native Method)
14-Sep-2021 02:01:02         at sun.reflect.NativeMethodAccessorImpl.invoke(NativeMethodAccessorImpl.java:62)
14-Sep-2021 02:01:02         at sun.reflect.DelegatingMethodAccessorImpl.invoke(DelegatingMethodAccessorImpl.java:43)
14-Sep-2021 02:01:02         at java.lang.reflect.Method.invoke(Method.java:498)
14-Sep-2021 02:01:02         at org.codehaus.plexus.classworlds.launcher.Launcher.launchEnhanced(Launcher.java:289)
14-Sep-2021 02:01:02         at org.codehaus.plexus.classworlds.launcher.Launcher.launch(Launcher.java:229)
14-Sep-2021 02:01:02         at org.codehaus.plexus.classworlds.launcher.Launcher.mainWithExitCode(Launcher.java:415)
14-Sep-2021 02:01:02         at org.codehaus.plexus.classworlds.launcher.Launcher.main(Launcher.java:356)
14-Sep-2021 02:01:02 [INFO]
14-Sep-2021 02:01:02 [INFO] --- maven-antrun-plugin:1.8:run (make-linux-firefoxdriver-executable) @ referenceapplication-ui-tests ---
14-Sep-2021 02:01:02 [INFO] Executing tasks
14-Sep-2021 02:01:02
14-Sep-2021 02:01:02 main:
14-Sep-2021 02:01:02 [INFO] Executed tasks
14-Sep-2021 02:01:02 [INFO]
14-Sep-2021 02:01:02 [INFO] --- maven-surefire-plugin:2.12:test (default-test) @ referenceapplication-ui-tests ---
14-Sep-2021 02:01:02 [INFO] Surefire report directory: /home/bamboo-agent/bamboo-agent/xml-data/build-dir/REFAPP-UI-FRAMEWORK/ui-tests/target/surefire-reports
14-Sep-2021 02:01:02
14-Sep-2021 02:01:02 -------------------------------------------------------
14-Sep-2021 02:01:02 T E S T S
14-Sep-2021 02:01:02 -------------------------------------------------------
14-Sep-2021 02:01:02 Running org.openmrs.reference.UnidentifiedPatientKeyboardTest
14-Sep-2021 02:01:03 Running locally...
14-Sep-2021 02:01:05 Starting ChromeDriver 90.0.4430.24 (4c6d850f087da467d926e8eddb76550aed655991-refs/branch-heads/4430@{#429}) on port 9410
14-Sep-2021 02:01:05 Only local connections are allowed.
14-Sep-2021 02:01:05 Please see https://chromedriver.chromium.org/security-considerations for suggestions on keeping ChromeDriver safe.
14-Sep-2021 02:01:05 ChromeDriver was started successfully.
14-Sep-2021 02:01:13 Sep 14, 2021 2:01:13 AM org.openqa.selenium.remote.ProtocolHandshake createSession
14-Sep-2021 02:01:13 INFO: Detected dialect: W3C
14-Sep-2021 02:01:22 Tests run: 1, Failures: 0, Errors: 0, Skipped: 0, Time elapsed: 19.076 sec
14-Sep-2021 02:01:22 Running org.openmrs.reference.DeleteAllergyTest
14-Sep-2021 02:01:22 Running locally...
14-Sep-2021 02:01:22 Starting ChromeDriver 90.0.4430.24 (4c6d850f087da467d926e8eddb76550aed655991-refs/branch-heads/4430@{#429}) on port 29765
14-Sep-2021 02:01:22 Only local connections are allowed.
14-Sep-2021 02:01:22 Please see https://chromedriver.chromium.org/security-considerations for suggestions on keeping ChromeDriver safe.
14-Sep-2021 02:01:22 ChromeDriver was started successfully.
14-Sep-2021 02:01:22 Sep 14, 2021 2:01:22 AM org.openqa.selenium.remote.ProtocolHandshake createSession
14-Sep-2021 02:01:22 INFO: Detected dialect: W3C
14-Sep-2021 02:01:31 Tests run: 1, Failures: 0, Errors: 0, Skipped: 0, Time elapsed: 9.603 sec
14-Sep-2021 02:01:31 Running org.openmrs.reference.SearchActiveVisitsTest
14-Sep-2021 02:01:31 Running locally...
14-Sep-2021 02:01:31 Starting ChromeDriver 90.0.4430.24 (4c6d850f087da467d926e8eddb76550aed655991-refs/branch-heads/4430@{#429}) on port 10455
14-Sep-2021 02:01:31 Only local connections are allowed.
14-Sep-2021 02:01:31 Please see https://chromedriver.chromium.org/security-considerations for suggestions on keeping ChromeDriver safe.
14-Sep-2021 02:01:31 ChromeDriver was started successfully.
14-Sep-2021 02:01:32 Sep 14, 2021 2:01:32 AM org.openqa.selenium.remote.ProtocolHandshake createSession
14-Sep-2021 02:01:32 INFO: Detected dialect: W3C
14-Sep-2021 02:01:37 Tests run: 1, Failures: 0, Errors: 0, Skipped: 0, Time elapsed: 5.775 sec
14-Sep-2021 02:01:37 Running org.openmrs.reference.AddVisitTypeTest
14-Sep-2021 02:01:37 Running locally...
14-Sep-2021 02:01:37 Starting ChromeDriver 90.0.4430.24 (4c6d850f087da467d926e8eddb76550aed655991-refs/branch-heads/4430@{#429}) on port 3296
14-Sep-2021 02:01:37 Only local connections are allowed.
14-Sep-2021 02:01:37 Please see https://chromedriver.chromium.org/security-considerations for suggestions on keeping ChromeDriver safe.
14-Sep-2021 02:01:37 ChromeDriver was started successfully.
14-Sep-2021 02:01:37 Sep 14, 2021 2:01:37 AM org.openqa.selenium.remote.ProtocolHandshake createSession
14-Sep-2021 02:01:37 INFO: Detected dialect: W3C
14-Sep-2021 02:01:53 Tests run: 1, Failures: 0, Errors: 0, Skipped: 0, Time elapsed: 15.894 sec
14-Sep-2021 02:01:53 Running org.openmrs.reference.FindPatientRecordTest
14-Sep-2021 02:01:53 Running locally...
14-Sep-2021 02:01:53 Starting ChromeDriver 90.0.4430.24 (4c6d850f087da467d926e8eddb76550aed655991-refs/branch-heads/4430@{#429}) on port 26527
14-Sep-2021 02:01:53 Only local connections are allowed.
14-Sep-2021 02:01:53 Please see https://chromedriver.chromium.org/security-considerations for suggestions on keeping ChromeDriver safe.
14-Sep-2021 02:01:53 ChromeDriver was started successfully.
14-Sep-2021 02:01:53 Sep 14, 2021 2:01:53 AM org.openqa.selenium.remote.ProtocolHandshake createSession
14-Sep-2021 02:01:53 INFO: Detected dialect: W3C
14-Sep-2021 02:01:58 Tests run: 1, Failures: 0, Errors: 0, Skipped: 0, Time elapsed: 4.848 sec
14-Sep-2021 02:01:58 Running org.openmrs.reference.EditPersonTest
14-Sep-2021 02:01:58 Running locally...
14-Sep-2021 02:01:58 Starting ChromeDriver 90.0.4430.24 (4c6d850f087da467d926e8eddb76550aed655991-refs/branch-heads/4430@{#429}) on port 13850
14-Sep-2021 02:01:58 Only local connections are allowed.
14-Sep-2021 02:01:58 Please see https://chromedriver.chromium.org/security-considerations for suggestions on keeping ChromeDriver safe.
14-Sep-2021 02:01:58 ChromeDriver was started successfully.
14-Sep-2021 02:01:58 Sep 14, 2021 2:01:58 AM org.openqa.selenium.remote.ProtocolHandshake createSession
14-Sep-2021 02:01:58 INFO: Detected dialect: W3C
14-Sep-2021 02:02:11 Tests run: 1, Failures: 0, Errors: 0, Skipped: 0, Time elapsed: 13.212 sec
14-Sep-2021 02:02:11 Running org.openmrs.reference.RetireLocationTest
14-Sep-2021 02:02:11 Running locally...
14-Sep-2021 02:02:11 Starting ChromeDriver 90.0.4430.24 (4c6d850f087da467d926e8eddb76550aed655991-refs/branch-heads/4430@{#429}) on port 22240
14-Sep-2021 02:02:11 Only local connections are allowed.
14-Sep-2021 02:02:11 Please see https://chromedriver.chromium.org/security-considerations for suggestions on keeping ChromeDriver safe.
14-Sep-2021 02:02:11 ChromeDriver was started successfully.
14-Sep-2021 02:02:11 Sep 14, 2021 2:02:11 AM org.openqa.selenium.remote.ProtocolHandshake createSession
14-Sep-2021 02:02:11 INFO: Detected dialect: W3C
14-Sep-2021 02:02:14 Tests run: 1, Failures: 0, Errors: 0, Skipped: 0, Time elapsed: 3.403 sec
14-Sep-2021 02:02:14 Running org.openmrs.reference.XSSOnPhoneNumberFieldTest
14-Sep-2021 02:02:14 Running locally...
14-Sep-2021 02:02:14 Starting ChromeDriver 90.0.4430.24 (4c6d850f087da467d926e8eddb76550aed655991-refs/branch-heads/4430@{#429}) on port 29197
14-Sep-2021 02:02:14 Only local connections are allowed.
14-Sep-2021 02:02:14 Please see https://chromedriver.chromium.org/security-considerations for suggestions on keeping ChromeDriver safe.
14-Sep-2021 02:02:14 ChromeDriver was started successfully.
14-Sep-2021 02:02:15 Sep 14, 2021 2:02:15 AM org.openqa.selenium.remote.ProtocolHandshake createSession
14-Sep-2021 02:02:15 INFO: Detected dialect: W3C
14-Sep-2021 02:02:26 Tests run: 1, Failures: 0, Errors: 0, Skipped: 0, Time elapsed: 11.257 sec
14-Sep-2021 02:02:26 Running org.openmrs.reference.TransferToWardServiceTest
14-Sep-2021 02:02:26 Running locally...
14-Sep-2021 02:02:26 Starting ChromeDriver 90.0.4430.24 (4c6d850f087da467d926e8eddb76550aed655991-refs/branch-heads/4430@{#429}) on port 28331
14-Sep-2021 02:02:26 Only local connections are allowed.
14-Sep-2021 02:02:26 Please see https://chromedriver.chromium.org/security-considerations for suggestions on keeping ChromeDriver safe.
14-Sep-2021 02:02:26 ChromeDriver was started successfully.
14-Sep-2021 02:02:26 Sep 14, 2021 2:02:26 AM org.openqa.selenium.remote.ProtocolHandshake createSession
14-Sep-2021 02:02:26 INFO: Detected dialect: W3C
14-Sep-2021 02:02:40 Tests run: 1, Failures: 0, Errors: 0, Skipped: 0, Time elapsed: 14.638 sec
14-Sep-2021 02:02:40 Running org.openmrs.reference.EditVisitTypeTest
14-Sep-2021 02:02:40 Running locally...
14-Sep-2021 02:02:40 Starting ChromeDriver 90.0.4430.24 (4c6d850f087da467d926e8eddb76550aed655991-refs/branch-heads/4430@{#429}) on port 19474
14-Sep-2021 02:02:40 Only local connections are allowed.
14-Sep-2021 02:02:40 Please see https://chromedriver.chromium.org/security-considerations for suggestions on keeping ChromeDriver safe.
14-Sep-2021 02:02:40 ChromeDriver was started successfully.
14-Sep-2021 02:02:41 Sep 14, 2021 2:02:41 AM org.openqa.selenium.remote.ProtocolHandshake createSession
14-Sep-2021 02:02:41 INFO: Detected dialect: W3C
14-Sep-2021 02:02:44 Tests run: 1, Failures: 0, Errors: 0, Skipped: 0, Time elapsed: 3.928 sec
14-Sep-2021 02:02:44 Running org.openmrs.reference.ComeBackToApplicationAfterLogoutTest
14-Sep-2021 02:02:44 Running locally...
14-Sep-2021 02:02:44 Starting ChromeDriver 90.0.4430.24 (4c6d850f087da467d926e8eddb76550aed655991-refs/branch-heads/4430@{#429}) on port 6500
14-Sep-2021 02:02:44 Only local connections are allowed.
14-Sep-2021 02:02:44 Please see https://chromedriver.chromium.org/security-considerations for suggestions on keeping ChromeDriver safe.
14-Sep-2021 02:02:44 ChromeDriver was started successfully.
14-Sep-2021 02:02:45 Sep 14, 2021 2:02:45 AM org.openqa.selenium.remote.ProtocolHandshake createSession
14-Sep-2021 02:02:45 INFO: Detected dialect: W3C
14-Sep-2021 02:02:46 Tests run: 1, Failures: 0, Errors: 0, Skipped: 0, Time elapsed: 1.851 sec
14-Sep-2021 02:02:46 Running org.openmrs.reference.EditDemographicTest
14-Sep-2021 02:02:46 Running locally...
14-Sep-2021 02:02:46 Starting ChromeDriver 90.0.4430.24 (4c6d850f087da467d926e8eddb76550aed655991-refs/branch-heads/4430@{#429}) on port 30612
14-Sep-2021 02:02:46 Only local connections are allowed.
14-Sep-2021 02:02:46 Please see https://chromedriver.chromium.org/security-considerations for suggestions on keeping ChromeDriver safe.
14-Sep-2021 02:02:46 ChromeDriver was started successfully.
14-Sep-2021 02:02:47 Sep 14, 2021 2:02:47 AM org.openqa.selenium.remote.ProtocolHandshake createSession
14-Sep-2021 02:02:47 INFO: Detected dialect: W3C
14-Sep-2021 02:02:55 Tests run: 1, Failures: 0, Errors: 0, Skipped: 0, Time elapsed: 8.963 sec
14-Sep-2021 02:02:55 Running org.openmrs.reference.DeleteVisitTypeTest
14-Sep-2021 02:02:55 Running locally...
14-Sep-2021 02:02:55 Starting ChromeDriver 90.0.4430.24 (4c6d850f087da467d926e8eddb76550aed655991-refs/branch-heads/4430@{#429}) on port 12603
14-Sep-2021 02:02:55 Only local connections are allowed.
14-Sep-2021 02:02:55 Please see https://chromedriver.chromium.org/security-considerations for suggestions on keeping ChromeDriver safe.
14-Sep-2021 02:02:55 ChromeDriver was started successfully.
14-Sep-2021 02:02:55 Sep 14, 2021 2:02:55 AM org.openqa.selenium.remote.ProtocolHandshake createSession
14-Sep-2021 02:02:55 INFO: Detected dialect: W3C
14-Sep-2021 02:02:59 Tests run: 1, Failures: 0, Errors: 0, Skipped: 0, Time elapsed: 3.58 sec
14-Sep-2021 02:02:59 Running org.openmrs.reference.FormTest
14-Sep-2021 02:02:59 Running locally...
14-Sep-2021 02:02:59 Starting ChromeDriver 90.0.4430.24 (4c6d850f087da467d926e8eddb76550aed655991-refs/branch-heads/4430@{#429}) on port 29258
14-Sep-2021 02:02:59 Only local connections are allowed.
14-Sep-2021 02:02:59 Please see https://chromedriver.chromium.org/security-considerations for suggestions on keeping ChromeDriver safe.
14-Sep-2021 02:02:59 ChromeDriver was started successfully.
14-Sep-2021 02:02:59 Sep 14, 2021 2:02:59 AM org.openqa.selenium.remote.ProtocolHandshake createSession
14-Sep-2021 02:02:59 INFO: Detected dialect: W3C
14-Sep-2021 02:03:09 Running locally...
14-Sep-2021 02:03:09 Starting ChromeDriver 90.0.4430.24 (4c6d850f087da467d926e8eddb76550aed655991-refs/branch-heads/4430@{#429}) on port 27132
14-Sep-2021 02:03:09 Only local connections are allowed.
14-Sep-2021 02:03:09 Please see https://chromedriver.chromium.org/security-considerations for suggestions on keeping ChromeDriver safe.
14-Sep-2021 02:03:09 ChromeDriver was started successfully.
14-Sep-2021 02:03:10 Sep 14, 2021 2:03:10 AM org.openqa.selenium.remote.ProtocolHandshake createSession
14-Sep-2021 02:03:10 INFO: Detected dialect: W3C
14-Sep-2021 02:03:16 Running locally...
14-Sep-2021 02:03:16 Starting ChromeDriver 90.0.4430.24 (4c6d850f087da467d926e8eddb76550aed655991-refs/branch-heads/4430@{#429}) on port 22914
14-Sep-2021 02:03:16 Only local connections are allowed.
14-Sep-2021 02:03:16 Please see https://chromedriver.chromium.org/security-considerations for suggestions on keeping ChromeDriver safe.
14-Sep-2021 02:03:16 ChromeDriver was started successfully.
14-Sep-2021 02:03:17 Sep 14, 2021 2:03:17 AM org.openqa.selenium.remote.ProtocolHandshake createSession
14-Sep-2021 02:03:17 INFO: Detected dialect: W3C
14-Sep-2021 02:03:20 Running locally...
14-Sep-2021 02:03:20 Starting ChromeDriver 90.0.4430.24 (4c6d850f087da467d926e8eddb76550aed655991-refs/branch-heads/4430@{#429}) on port 15145
14-Sep-2021 02:03:20 Only local connections are allowed.
14-Sep-2021 02:03:20 Please see https://chromedriver.chromium.org/security-considerations for suggestions on keeping ChromeDriver safe.
14-Sep-2021 02:03:20 ChromeDriver was started successfully.
14-Sep-2021 02:03:20 Sep 14, 2021 2:03:20 AM org.openqa.selenium.remote.ProtocolHandshake createSession
14-Sep-2021 02:03:20 INFO: Detected dialect: W3C
14-Sep-2021 02:03:25 Tests run: 4, Failures: 0, Errors: 0, Skipped: 0, Time elapsed: 26.156 sec
14-Sep-2021 02:03:25 Running org.openmrs.reference.RegisterUnidentifiedPatientTest
14-Sep-2021 02:03:25 Running locally...
14-Sep-2021 02:03:25 Starting ChromeDriver 90.0.4430.24 (4c6d850f087da467d926e8eddb76550aed655991-refs/branch-heads/4430@{#429}) on port 11546
14-Sep-2021 02:03:25 Only local connections are allowed.
14-Sep-2021 02:03:25 Please see https://chromedriver.chromium.org/security-considerations for suggestions on keeping ChromeDriver safe.
14-Sep-2021 02:03:25 ChromeDriver was started successfully.
14-Sep-2021 02:03:25 Sep 14, 2021 2:03:25 AM org.openqa.selenium.remote.ProtocolHandshake createSession
14-Sep-2021 02:03:25 INFO: Detected dialect: W3C
14-Sep-2021 02:03:31 Tests run: 1, Failures: 0, Errors: 0, Skipped: 0, Time elapsed: 5.776 sec
14-Sep-2021 02:03:31 Running org.openmrs.reference.AddPatientAppointmentTest
14-Sep-2021 02:03:31 Running locally...
14-Sep-2021 02:03:31 Starting ChromeDriver 90.0.4430.24 (4c6d850f087da467d926e8eddb76550aed655991-refs/branch-heads/4430@{#429}) on port 18982
14-Sep-2021 02:03:31 Only local connections are allowed.
14-Sep-2021 02:03:31 Please see https://chromedriver.chromium.org/security-considerations for suggestions on keeping ChromeDriver safe.
14-Sep-2021 02:03:31 ChromeDriver was started successfully.
14-Sep-2021 02:03:31 Sep 14, 2021 2:03:31 AM org.openqa.selenium.remote.ProtocolHandshake createSession
14-Sep-2021 02:03:31 INFO: Detected dialect: W3C
14-Sep-2021 02:03:46 Tests run: 1, Failures: 0, Errors: 0, Skipped: 0, Time elapsed: 15.742 sec
14-Sep-2021 02:03:46 Running org.openmrs.reference.AdmitExitInpatientTest
14-Sep-2021 02:03:46 Running locally...
14-Sep-2021 02:03:46 Starting ChromeDriver 90.0.4430.24 (4c6d850f087da467d926e8eddb76550aed655991-refs/branch-heads/4430@{#429}) on port 16580
14-Sep-2021 02:03:46 Only local connections are allowed.
14-Sep-2021 02:03:46 Please see https://chromedriver.chromium.org/security-considerations for suggestions on keeping ChromeDriver safe.
14-Sep-2021 02:03:46 ChromeDriver was started successfully.
14-Sep-2021 02:03:47 Sep 14, 2021 2:03:47 AM org.openqa.selenium.remote.ProtocolHandshake createSession
14-Sep-2021 02:03:47 INFO: Detected dialect: W3C
14-Sep-2021 02:04:00 Tests run: 1, Failures: 0, Errors: 0, Skipped: 0, Time elapsed: 13.777 sec
14-Sep-2021 02:04:00 Running org.openmrs.reference.DeleteRequestAppointmentTest
14-Sep-2021 02:04:00 Running locally...
14-Sep-2021 02:04:00 Starting ChromeDriver 90.0.4430.24 (4c6d850f087da467d926e8eddb76550aed655991-refs/branch-heads/4430@{#429}) on port 6135
14-Sep-2021 02:04:00 Only local connections are allowed.
14-Sep-2021 02:04:00 Please see https://chromedriver.chromium.org/security-considerations for suggestions on keeping ChromeDriver safe.
14-Sep-2021 02:04:00 ChromeDriver was started successfully.
14-Sep-2021 02:04:01 Sep 14, 2021 2:04:01 AM org.openqa.selenium.remote.ProtocolHandshake createSession
14-Sep-2021 02:04:01 INFO: Detected dialect: W3C
14-Sep-2021 02:04:15 Tests run: 1, Failures: 0, Errors: 0, Skipped: 0, Time elapsed: 14.345 sec
14-Sep-2021 02:04:15 Running org.openmrs.reference.EditAllergyTest
14-Sep-2021 02:04:15 Running locally...
14-Sep-2021 02:04:15 Starting ChromeDriver 90.0.4430.24 (4c6d850f087da467d926e8eddb76550aed655991-refs/branch-heads/4430@{#429}) on port 26337
14-Sep-2021 02:04:15 Only local connections are allowed.
14-Sep-2021 02:04:15 Please see https://chromedriver.chromium.org/security-considerations for suggestions on keeping ChromeDriver safe.
14-Sep-2021 02:04:15 ChromeDriver was started successfully.
14-Sep-2021 02:04:15 Sep 14, 2021 2:04:15 AM org.openqa.selenium.remote.ProtocolHandshake createSession
14-Sep-2021 02:04:15 INFO: Detected dialect: W3C
14-Sep-2021 02:04:24 Tests run: 1, Failures: 0, Errors: 0, Skipped: 0, Time elapsed: 9.529 sec
14-Sep-2021 02:04:24 Running org.openmrs.reference.VisitNoteTest
14-Sep-2021 02:04:24 Running locally...
14-Sep-2021 02:04:24 Starting ChromeDriver 90.0.4430.24 (4c6d850f087da467d926e8eddb76550aed655991-refs/branch-heads/4430@{#429}) on port 24566
14-Sep-2021 02:04:24 Only local connections are allowed.
14-Sep-2021 02:04:24 Please see https://chromedriver.chromium.org/security-considerations for suggestions on keeping ChromeDriver safe.
14-Sep-2021 02:04:24 ChromeDriver was started successfully.
14-Sep-2021 02:04:24 Sep 14, 2021 2:04:24 AM org.openqa.selenium.remote.ProtocolHandshake createSession
14-Sep-2021 02:04:24 INFO: Detected dialect: W3C
14-Sep-2021 02:04:48 Tests run: 1, Failures: 0, Errors: 0, Skipped: 0, Time elapsed: 24.37 sec
14-Sep-2021 02:04:48 Running org.openmrs.reference.CreatePersonTest
14-Sep-2021 02:04:48 Running locally...
14-Sep-2021 02:04:48 Starting ChromeDriver 90.0.4430.24 (4c6d850f087da467d926e8eddb76550aed655991-refs/branch-heads/4430@{#429}) on port 13156
14-Sep-2021 02:04:48 Only local connections are allowed.
14-Sep-2021 02:04:48 Please see https://chromedriver.chromium.org/security-considerations for suggestions on keeping ChromeDriver safe.
14-Sep-2021 02:04:48 ChromeDriver was started successfully.
14-Sep-2021 02:04:49 Sep 14, 2021 2:04:49 AM org.openqa.selenium.remote.ProtocolHandshake createSession
14-Sep-2021 02:04:49 INFO: Detected dialect: W3C
14-Sep-2021 02:04:56 Tests run: 1, Failures: 0, Errors: 0, Skipped: 0, Time elapsed: 7.928 sec
14-Sep-2021 02:04:56 Running org.openmrs.reference.FindPatientByNameTest
14-Sep-2021 02:04:56 Running locally...
14-Sep-2021 02:04:56 Starting ChromeDriver 90.0.4430.24 (4c6d850f087da467d926e8eddb76550aed655991-refs/branch-heads/4430@{#429}) on port 24992
14-Sep-2021 02:04:56 Only local connections are allowed.
14-Sep-2021 02:04:56 Please see https://chromedriver.chromium.org/security-considerations for suggestions on keeping ChromeDriver safe.
14-Sep-2021 02:04:56 ChromeDriver was started successfully.
14-Sep-2021 02:04:57 Sep 14, 2021 2:04:57 AM org.openqa.selenium.remote.ProtocolHandshake createSession
14-Sep-2021 02:04:57 INFO: Detected dialect: W3C
14-Sep-2021 02:05:03 Tests run: 1, Failures: 0, Errors: 0, Skipped: 0, Time elapsed: 6.82 sec
14-Sep-2021 02:05:03 Running org.openmrs.reference.AddUserTest
14-Sep-2021 02:05:03 Running locally...
14-Sep-2021 02:05:03 Starting ChromeDriver 90.0.4430.24 (4c6d850f087da467d926e8eddb76550aed655991-refs/branch-heads/4430@{#429}) on port 22186
14-Sep-2021 02:05:03 Only local connections are allowed.
14-Sep-2021 02:05:03 Please see https://chromedriver.chromium.org/security-considerations for suggestions on keeping ChromeDriver safe.
14-Sep-2021 02:05:03 ChromeDriver was started successfully.
14-Sep-2021 02:05:04 Sep 14, 2021 2:05:04 AM org.openqa.selenium.remote.ProtocolHandshake createSession
14-Sep-2021 02:05:04 INFO: Detected dialect: W3C
14-Sep-2021 02:05:19 Tests run: 1, Failures: 0, Errors: 0, Skipped: 0, Time elapsed: 15.5 sec
14-Sep-2021 02:05:19 Running org.openmrs.reference.AddProviderTest
14-Sep-2021 02:05:19 Running locally...
14-Sep-2021 02:05:19 Starting ChromeDriver 90.0.4430.24 (4c6d850f087da467d926e8eddb76550aed655991-refs/branch-heads/4430@{#429}) on port 11710
14-Sep-2021 02:05:19 Only local connections are allowed.
14-Sep-2021 02:05:19 Please see https://chromedriver.chromium.org/security-considerations for suggestions on keeping ChromeDriver safe.
14-Sep-2021 02:05:19 ChromeDriver was started successfully.
14-Sep-2021 02:05:19 Sep 14, 2021 2:05:19 AM org.openqa.selenium.remote.ProtocolHandshake createSession
14-Sep-2021 02:05:19 INFO: Detected dialect: W3C
14-Sep-2021 02:05:31 Tests run: 1, Failures: 0, Errors: 0, Skipped: 0, Time elapsed: 11.915 sec
14-Sep-2021 02:05:31 Running org.openmrs.reference.AddPastVisitTest
14-Sep-2021 02:05:31 Running locally...
14-Sep-2021 02:05:31 Starting ChromeDriver 90.0.4430.24 (4c6d850f087da467d926e8eddb76550aed655991-refs/branch-heads/4430@{#429}) on port 15870
14-Sep-2021 02:05:31 Only local connections are allowed.
14-Sep-2021 02:05:31 Please see https://chromedriver.chromium.org/security-considerations for suggestions on keeping ChromeDriver safe.
14-Sep-2021 02:05:31 ChromeDriver was started successfully.
14-Sep-2021 02:05:31 Sep 14, 2021 2:05:31 AM org.openqa.selenium.remote.ProtocolHandshake createSession
14-Sep-2021 02:05:31 INFO: Detected dialect: W3C
14-Sep-2021 02:05:40 Tests run: 1, Failures: 0, Errors: 0, Skipped: 0, Time elapsed: 9.575 sec
14-Sep-2021 02:05:40 Running org.openmrs.reference.RecordMergeIssueTest
14-Sep-2021 02:05:40 Running locally...
14-Sep-2021 02:05:40 Starting ChromeDriver 90.0.4430.24 (4c6d850f087da467d926e8eddb76550aed655991-refs/branch-heads/4430@{#429}) on port 32435
14-Sep-2021 02:05:40 Only local connections are allowed.
14-Sep-2021 02:05:40 Please see https://chromedriver.chromium.org/security-considerations for suggestions on keeping ChromeDriver safe.
14-Sep-2021 02:05:40 ChromeDriver was started successfully.
14-Sep-2021 02:05:41 Sep 14, 2021 2:05:41 AM org.openqa.selenium.remote.ProtocolHandshake createSession
14-Sep-2021 02:05:41 INFO: Detected dialect: W3C
14-Sep-2021 02:05:54 Tests run: 1, Failures: 0, Errors: 0, Skipped: 0, Time elapsed: 13.289 sec
14-Sep-2021 02:05:54 Running org.openmrs.reference.CaptureVitalsTest
14-Sep-2021 02:05:54 Running locally...
14-Sep-2021 02:05:54 Starting ChromeDriver 90.0.4430.24 (4c6d850f087da467d926e8eddb76550aed655991-refs/branch-heads/4430@{#429}) on port 17067
14-Sep-2021 02:05:54 Only local connections are allowed.
14-Sep-2021 02:05:54 Please see https://chromedriver.chromium.org/security-considerations for suggestions on keeping ChromeDriver safe.
14-Sep-2021 02:05:54 ChromeDriver was started successfully.
14-Sep-2021 02:05:54 Sep 14, 2021 2:05:54 AM org.openqa.selenium.remote.ProtocolHandshake createSession
14-Sep-2021 02:05:54 INFO: Detected dialect: W3C
14-Sep-2021 02:08:04 Tests run: 2, Failures: 0, Errors: 2, Skipped: 0, Time elapsed: 130.84 sec <<< FAILURE!
14-Sep-2021 02:08:04 Running org.openmrs.reference.NamePatientAccentedLetterTest
14-Sep-2021 02:08:04 Running locally...
14-Sep-2021 02:08:04 Starting ChromeDriver 90.0.4430.24 (4c6d850f087da467d926e8eddb76550aed655991-refs/branch-heads/4430@{#429}) on port 8178
14-Sep-2021 02:08:04 Only local connections are allowed.
14-Sep-2021 02:08:04 Please see https://chromedriver.chromium.org/security-considerations for suggestions on keeping ChromeDriver safe.
14-Sep-2021 02:08:04 ChromeDriver was started successfully.
14-Sep-2021 02:08:05 Sep 14, 2021 2:08:05 AM org.openqa.selenium.remote.ProtocolHandshake createSession
14-Sep-2021 02:08:05 INFO: Detected dialect: W3C
14-Sep-2021 02:08:22 Tests run: 1, Failures: 0, Errors: 0, Skipped: 0, Time elapsed: 17.262 sec
14-Sep-2021 02:08:22 Running org.openmrs.reference.RetirePersonTest
14-Sep-2021 02:08:22 Running locally...
14-Sep-2021 02:08:22 Starting ChromeDriver 90.0.4430.24 (4c6d850f087da467d926e8eddb76550aed655991-refs/branch-heads/4430@{#429}) on port 6720
14-Sep-2021 02:08:22 Only local connections are allowed.
14-Sep-2021 02:08:22 Please see https://chromedriver.chromium.org/security-considerations for suggestions on keeping ChromeDriver safe.
14-Sep-2021 02:08:22 ChromeDriver was started successfully.
14-Sep-2021 02:08:22 Sep 14, 2021 2:08:22 AM org.openqa.selenium.remote.ProtocolHandshake createSession
14-Sep-2021 02:08:22 INFO: Detected dialect: W3C
14-Sep-2021 02:08:28 Tests run: 1, Failures: 0, Errors: 0, Skipped: 0, Time elapsed: 6.336 sec
14-Sep-2021 02:08:28 Running org.openmrs.reference.EndVisitTest
14-Sep-2021 02:08:28 Running locally...
14-Sep-2021 02:08:28 Starting ChromeDriver 90.0.4430.24 (4c6d850f087da467d926e8eddb76550aed655991-refs/branch-heads/4430@{#429}) on port 25641
14-Sep-2021 02:08:28 Only local connections are allowed.
14-Sep-2021 02:08:28 Please see https://chromedriver.chromium.org/security-considerations for suggestions on keeping ChromeDriver safe.
14-Sep-2021 02:08:28 ChromeDriver was started successfully.
14-Sep-2021 02:08:28 Sep 14, 2021 2:08:28 AM org.openqa.selenium.remote.ProtocolHandshake createSession
14-Sep-2021 02:08:28 INFO: Detected dialect: W3C
14-Sep-2021 02:08:41 Tests run: 1, Failures: 0, Errors: 0, Skipped: 0, Time elapsed: 13.522 sec
14-Sep-2021 02:08:41 Running org.openmrs.reference.DeleteAppointmentBlockTest
14-Sep-2021 02:08:42 Running locally...
14-Sep-2021 02:08:42 Starting ChromeDriver 90.0.4430.24 (4c6d850f087da467d926e8eddb76550aed655991-refs/branch-heads/4430@{#429}) on port 12362
14-Sep-2021 02:08:42 Only local connections are allowed.
14-Sep-2021 02:08:42 Please see https://chromedriver.chromium.org/security-considerations for suggestions on keeping ChromeDriver safe.
14-Sep-2021 02:08:42 ChromeDriver was started successfully.
14-Sep-2021 02:08:42 Sep 14, 2021 2:08:42 AM org.openqa.selenium.remote.ProtocolHandshake createSession
14-Sep-2021 02:08:42 INFO: Detected dialect: W3C
14-Sep-2021 02:08:47 Tests run: 1, Failures: 0, Errors: 0, Skipped: 0, Time elapsed: 5.427 sec
14-Sep-2021 02:08:47 Running org.openmrs.reference.BookRequestAppointmentTest
14-Sep-2021 02:08:47 Running locally...
14-Sep-2021 02:08:47 Starting ChromeDriver 90.0.4430.24 (4c6d850f087da467d926e8eddb76550aed655991-refs/branch-heads/4430@{#429}) on port 20688
14-Sep-2021 02:08:47 Only local connections are allowed.
14-Sep-2021 02:08:47 Please see https://chromedriver.chromium.org/security-considerations for suggestions on keeping ChromeDriver safe.
14-Sep-2021 02:08:47 ChromeDriver was started successfully.
14-Sep-2021 02:08:47 Sep 14, 2021 2:08:47 AM org.openqa.selenium.remote.ProtocolHandshake createSession
14-Sep-2021 02:08:47 INFO: Detected dialect: W3C
14-Sep-2021 02:09:06 Tests run: 1, Failures: 0, Errors: 0, Skipped: 0, Time elapsed: 19.111 sec
14-Sep-2021 02:09:06 Running org.openmrs.reference.AddDeleteServiceTest
14-Sep-2021 02:09:06 Running locally...
14-Sep-2021 02:09:06 Starting ChromeDriver 90.0.4430.24 (4c6d850f087da467d926e8eddb76550aed655991-refs/branch-heads/4430@{#429}) on port 21175
14-Sep-2021 02:09:06 Only local connections are allowed.
14-Sep-2021 02:09:06 Please see https://chromedriver.chromium.org/security-considerations for suggestions on keeping ChromeDriver safe.
14-Sep-2021 02:09:06 ChromeDriver was started successfully.
14-Sep-2021 02:09:06 Sep 14, 2021 2:09:06 AM org.openqa.selenium.remote.ProtocolHandshake createSession
14-Sep-2021 02:09:06 INFO: Detected dialect: W3C
14-Sep-2021 02:09:12 Tests run: 1, Failures: 0, Errors: 0, Skipped: 0, Time elapsed: 5.679 sec
14-Sep-2021 02:09:12 Running org.openmrs.reference.AddEditAppointmentBlockTest
14-Sep-2021 02:09:12 Running locally...
14-Sep-2021 02:09:12 Starting ChromeDriver 90.0.4430.24 (4c6d850f087da467d926e8eddb76550aed655991-refs/branch-heads/4430@{#429}) on port 30896
14-Sep-2021 02:09:12 Only local connections are allowed.
14-Sep-2021 02:09:12 Please see https://chromedriver.chromium.org/security-considerations for suggestions on keeping ChromeDriver safe.
14-Sep-2021 02:09:12 ChromeDriver was started successfully.
14-Sep-2021 02:09:12 Sep 14, 2021 2:09:12 AM org.openqa.selenium.remote.ProtocolHandshake createSession
14-Sep-2021 02:09:12 INFO: Detected dialect: W3C
14-Sep-2021 02:09:19 Tests run: 1, Failures: 0, Errors: 0, Skipped: 0, Time elapsed: 6.875 sec
14-Sep-2021 02:09:19 Running org.openmrs.reference.RetireProviderTest
14-Sep-2021 02:09:19 Running locally...
14-Sep-2021 02:09:19 Starting ChromeDriver 90.0.4430.24 (4c6d850f087da467d926e8eddb76550aed655991-refs/branch-heads/4430@{#429}) on port 6660
14-Sep-2021 02:09:19 Only local connections are allowed.
14-Sep-2021 02:09:19 Please see https://chromedriver.chromium.org/security-considerations for suggestions on keeping ChromeDriver safe.
14-Sep-2021 02:09:19 ChromeDriver was started successfully.
14-Sep-2021 02:09:19 Sep 14, 2021 2:09:19 AM org.openqa.selenium.remote.ProtocolHandshake createSession
14-Sep-2021 02:09:19 INFO: Detected dialect: W3C
14-Sep-2021 02:09:24 Tests run: 1, Failures: 0, Errors: 0, Skipped: 0, Time elapsed: 5.179 sec
14-Sep-2021 02:09:24 Running org.openmrs.reference.MergePatientTest
14-Sep-2021 02:09:24 Running locally...
14-Sep-2021 02:09:24 Starting ChromeDriver 90.0.4430.24 (4c6d850f087da467d926e8eddb76550aed655991-refs/branch-heads/4430@{#429}) on port 14117
14-Sep-2021 02:09:24 Only local connections are allowed.
14-Sep-2021 02:09:24 Please see https://chromedriver.chromium.org/security-considerations for suggestions on keeping ChromeDriver safe.
14-Sep-2021 02:09:24 ChromeDriver was started successfully.
14-Sep-2021 02:09:24 Sep 14, 2021 2:09:24 AM org.openqa.selenium.remote.ProtocolHandshake createSession
14-Sep-2021 02:09:24 INFO: Detected dialect: W3C
14-Sep-2021 02:09:31 Tests run: 1, Failures: 0, Errors: 0, Skipped: 0, Time elapsed: 6.964 sec
14-Sep-2021 02:09:31 Running org.openmrs.reference.AddDeleteLocationTest
14-Sep-2021 02:09:31 Running locally...
14-Sep-2021 02:09:31 Starting ChromeDriver 90.0.4430.24 (4c6d850f087da467d926e8eddb76550aed655991-refs/branch-heads/4430@{#429}) on port 20862
14-Sep-2021 02:09:31 Only local connections are allowed.
14-Sep-2021 02:09:31 Please see https://chromedriver.chromium.org/security-considerations for suggestions on keeping ChromeDriver safe.
14-Sep-2021 02:09:31 ChromeDriver was started successfully.
14-Sep-2021 02:09:31 Sep 14, 2021 2:09:31 AM org.openqa.selenium.remote.ProtocolHandshake createSession
14-Sep-2021 02:09:31 INFO: Detected dialect: W3C
14-Sep-2021 02:09:35 Tests run: 1, Failures: 0, Errors: 0, Skipped: 0, Time elapsed: 4.201 sec
14-Sep-2021 02:09:35 Running org.openmrs.reference.DuplicatePatientRegisterTest
14-Sep-2021 02:09:35 Running locally...
14-Sep-2021 02:09:35 Starting ChromeDriver 90.0.4430.24 (4c6d850f087da467d926e8eddb76550aed655991-refs/branch-heads/4430@{#429}) on port 26490
14-Sep-2021 02:09:35 Only local connections are allowed.
14-Sep-2021 02:09:35 Please see https://chromedriver.chromium.org/security-considerations for suggestions on keeping ChromeDriver safe.
14-Sep-2021 02:09:35 ChromeDriver was started successfully.
14-Sep-2021 02:09:35 Sep 14, 2021 2:09:35 AM org.openqa.selenium.remote.ProtocolHandshake createSession
14-Sep-2021 02:09:35 INFO: Detected dialect: W3C
14-Sep-2021 02:09:46 Tests run: 1, Failures: 0, Errors: 0, Skipped: 0, Time elapsed: 11.434 sec
14-Sep-2021 02:09:46 Running org.openmrs.reference.UsingBackButtonInMergePatientTest
14-Sep-2021 02:09:46 Running locally...
14-Sep-2021 02:09:46 Starting ChromeDriver 90.0.4430.24 (4c6d850f087da467d926e8eddb76550aed655991-refs/branch-heads/4430@{#429}) on port 25756
14-Sep-2021 02:09:46 Only local connections are allowed.
14-Sep-2021 02:09:46 Please see https://chromedriver.chromium.org/security-considerations for suggestions on keeping ChromeDriver safe.
14-Sep-2021 02:09:46 ChromeDriver was started successfully.
14-Sep-2021 02:09:47 Sep 14, 2021 2:09:47 AM org.openqa.selenium.remote.ProtocolHandshake createSession
14-Sep-2021 02:09:47 INFO: Detected dialect: W3C
14-Sep-2021 02:09:58 Tests run: 1, Failures: 0, Errors: 0, Skipped: 0, Time elapsed: 11.926 sec
14-Sep-2021 02:09:58 Running org.openmrs.reference.AddDiagnosisToVisitNoteTest
14-Sep-2021 02:09:58 Running locally...
14-Sep-2021 02:09:58 Starting ChromeDriver 90.0.4430.24 (4c6d850f087da467d926e8eddb76550aed655991-refs/branch-heads/4430@{#429}) on port 11081
14-Sep-2021 02:09:58 Only local connections are allowed.
14-Sep-2021 02:09:58 Please see https://chromedriver.chromium.org/security-considerations for suggestions on keeping ChromeDriver safe.
14-Sep-2021 02:09:58 ChromeDriver was started successfully.
14-Sep-2021 02:09:59 Sep 14, 2021 2:09:59 AM org.openqa.selenium.remote.ProtocolHandshake createSession
14-Sep-2021 02:09:59 INFO: Detected dialect: W3C
14-Sep-2021 02:10:10 Tests run: 1, Failures: 0, Errors: 0, Skipped: 0, Time elapsed: 11.301 sec
14-Sep-2021 02:10:10 Running org.openmrs.reference.MergeVisitsTest
14-Sep-2021 02:10:10 Running locally...
14-Sep-2021 02:10:10 Starting ChromeDriver 90.0.4430.24 (4c6d850f087da467d926e8eddb76550aed655991-refs/branch-heads/4430@{#429}) on port 5325
14-Sep-2021 02:10:10 Only local connections are allowed.
14-Sep-2021 02:10:10 Please see https://chromedriver.chromium.org/security-considerations for suggestions on keeping ChromeDriver safe.
14-Sep-2021 02:10:10 ChromeDriver was started successfully.
14-Sep-2021 02:10:10 Sep 14, 2021 2:10:10 AM org.openqa.selenium.remote.ProtocolHandshake createSession
14-Sep-2021 02:10:10 INFO: Detected dialect: W3C
14-Sep-2021 02:10:21 Tests run: 1, Failures: 0, Errors: 0, Skipped: 0, Time elapsed: 11.731 sec
14-Sep-2021 02:10:21 Running org.openmrs.reference.EditServiceTest
14-Sep-2021 02:10:21 Running locally...
14-Sep-2021 02:10:21 Starting ChromeDriver 90.0.4430.24 (4c6d850f087da467d926e8eddb76550aed655991-refs/branch-heads/4430@{#429}) on port 28838
14-Sep-2021 02:10:21 Only local connections are allowed.
14-Sep-2021 02:10:21 Please see https://chromedriver.chromium.org/security-considerations for suggestions on keeping ChromeDriver safe.
14-Sep-2021 02:10:21 ChromeDriver was started successfully.
14-Sep-2021 02:10:22 Sep 14, 2021 2:10:22 AM org.openqa.selenium.remote.ProtocolHandshake createSession
14-Sep-2021 02:10:22 INFO: Detected dialect: W3C
14-Sep-2021 02:10:27 Tests run: 1, Failures: 0, Errors: 0, Skipped: 0, Time elapsed: 5.647 sec
14-Sep-2021 02:10:27 Running org.openmrs.reference.AddNewAllergyTest
14-Sep-2021 02:10:27 Running locally...
14-Sep-2021 02:10:27 Starting ChromeDriver 90.0.4430.24 (4c6d850f087da467d926e8eddb76550aed655991-refs/branch-heads/4430@{#429}) on port 3787
14-Sep-2021 02:10:27 Only local connections are allowed.
14-Sep-2021 02:10:27 Please see https://chromedriver.chromium.org/security-considerations for suggestions on keeping ChromeDriver safe.
14-Sep-2021 02:10:27 ChromeDriver was started successfully.
14-Sep-2021 02:10:27 Sep 14, 2021 2:10:27 AM org.openqa.selenium.remote.ProtocolHandshake createSession
14-Sep-2021 02:10:27 INFO: Detected dialect: W3C
14-Sep-2021 02:10:35 Tests run: 1, Failures: 0, Errors: 0, Skipped: 0, Time elapsed: 7.941 sec
14-Sep-2021 02:10:35 Running org.openmrs.reference.LoginTest
14-Sep-2021 02:10:35 Running locally...
14-Sep-2021 02:10:35 Starting ChromeDriver 90.0.4430.24 (4c6d850f087da467d926e8eddb76550aed655991-refs/branch-heads/4430@{#429}) on port 11945
14-Sep-2021 02:10:35 Only local connections are allowed.
14-Sep-2021 02:10:35 Please see https://chromedriver.chromium.org/security-considerations for suggestions on keeping ChromeDriver safe.
14-Sep-2021 02:10:35 ChromeDriver was started successfully.
14-Sep-2021 02:10:35 Sep 14, 2021 2:10:35 AM org.openqa.selenium.remote.ProtocolHandshake createSession
14-Sep-2021 02:10:35 INFO: Detected dialect: W3C
14-Sep-2021 02:10:37 Running locally...
14-Sep-2021 02:10:37 Starting ChromeDriver 90.0.4430.24 (4c6d850f087da467d926e8eddb76550aed655991-refs/branch-heads/4430@{#429}) on port 20735
14-Sep-2021 02:10:37 Only local connections are allowed.
14-Sep-2021 02:10:37 Please see https://chromedriver.chromium.org/security-considerations for suggestions on keeping ChromeDriver safe.
14-Sep-2021 02:10:37 ChromeDriver was started successfully.
14-Sep-2021 02:10:38 Sep 14, 2021 2:10:38 AM org.openqa.selenium.remote.ProtocolHandshake createSession
14-Sep-2021 02:10:38 INFO: Detected dialect: W3C
14-Sep-2021 02:10:39 Running locally...
14-Sep-2021 02:10:39 Starting ChromeDriver 90.0.4430.24 (4c6d850f087da467d926e8eddb76550aed655991-refs/branch-heads/4430@{#429}) on port 29519
14-Sep-2021 02:10:39 Only local connections are allowed.
14-Sep-2021 02:10:39 Please see https://chromedriver.chromium.org/security-considerations for suggestions on keeping ChromeDriver safe.
14-Sep-2021 02:10:39 ChromeDriver was started successfully.
14-Sep-2021 02:10:39 Sep 14, 2021 2:10:39 AM org.openqa.selenium.remote.ProtocolHandshake createSession
14-Sep-2021 02:10:39 INFO: Detected dialect: W3C
14-Sep-2021 02:10:42 Running locally...
14-Sep-2021 02:10:42 Starting ChromeDriver 90.0.4430.24 (4c6d850f087da467d926e8eddb76550aed655991-refs/branch-heads/4430@{#429}) on port 13401
14-Sep-2021 02:10:42 Only local connections are allowed.
14-Sep-2021 02:10:42 Please see https://chromedriver.chromium.org/security-considerations for suggestions on keeping ChromeDriver safe.
14-Sep-2021 02:10:42 ChromeDriver was started successfully.
14-Sep-2021 02:10:42 Sep 14, 2021 2:10:42 AM org.openqa.selenium.remote.ProtocolHandshake createSession
14-Sep-2021 02:10:42 INFO: Detected dialect: W3C
14-Sep-2021 02:10:44 Running locally...
14-Sep-2021 02:10:44 Starting ChromeDriver 90.0.4430.24 (4c6d850f087da467d926e8eddb76550aed655991-refs/branch-heads/4430@{#429}) on port 29101
14-Sep-2021 02:10:44 Only local connections are allowed.
14-Sep-2021 02:10:44 Please see https://chromedriver.chromium.org/security-considerations for suggestions on keeping ChromeDriver safe.
14-Sep-2021 02:10:44 ChromeDriver was started successfully.
14-Sep-2021 02:10:45 Sep 14, 2021 2:10:45 AM org.openqa.selenium.remote.ProtocolHandshake createSession
14-Sep-2021 02:10:45 INFO: Detected dialect: W3C
14-Sep-2021 02:10:47 Tests run: 5, Failures: 0, Errors: 0, Skipped: 0, Time elapsed: 11.953 sec
14-Sep-2021 02:10:47 Running org.openmrs.reference.DeleteProviderTest
14-Sep-2021 02:10:47 Running locally...
14-Sep-2021 02:10:47 Starting ChromeDriver 90.0.4430.24 (4c6d850f087da467d926e8eddb76550aed655991-refs/branch-heads/4430@{#429}) on port 8802
14-Sep-2021 02:10:47 Only local connections are allowed.
14-Sep-2021 02:10:47 Please see https://chromedriver.chromium.org/security-considerations for suggestions on keeping ChromeDriver safe.
14-Sep-2021 02:10:47 ChromeDriver was started successfully.
14-Sep-2021 02:10:47 Sep 14, 2021 2:10:47 AM org.openqa.selenium.remote.ProtocolHandshake createSession
14-Sep-2021 02:10:47 INFO: Detected dialect: W3C
14-Sep-2021 02:10:52 Tests run: 1, Failures: 0, Errors: 0, Skipped: 0, Time elapsed: 4.886 sec
14-Sep-2021 02:10:52 Running org.openmrs.reference.RegisterPatientTest
14-Sep-2021 02:10:52 Running locally...
14-Sep-2021 02:10:52 Starting ChromeDriver 90.0.4430.24 (4c6d850f087da467d926e8eddb76550aed655991-refs/branch-heads/4430@{#429}) on port 3280
14-Sep-2021 02:10:52 Only local connections are allowed.
14-Sep-2021 02:10:52 Please see https://chromedriver.chromium.org/security-considerations for suggestions on keeping ChromeDriver safe.
14-Sep-2021 02:10:52 ChromeDriver was started successfully.
14-Sep-2021 02:10:52 Sep 14, 2021 2:10:52 AM org.openqa.selenium.remote.ProtocolHandshake createSession
14-Sep-2021 02:10:52 INFO: Detected dialect: W3C
14-Sep-2021 02:11:00 Tests run: 1, Failures: 0, Errors: 0, Skipped: 0, Time elapsed: 7.738 sec
14-Sep-2021 02:11:00 Running org.openmrs.reference.ContactInfoTest
14-Sep-2021 02:11:00 Running locally...
14-Sep-2021 02:11:00 Starting ChromeDriver 90.0.4430.24 (4c6d850f087da467d926e8eddb76550aed655991-refs/branch-heads/4430@{#429}) on port 28582
14-Sep-2021 02:11:00 Only local connections are allowed.
14-Sep-2021 02:11:00 Please see https://chromedriver.chromium.org/security-considerations for suggestions on keeping ChromeDriver safe.
14-Sep-2021 02:11:00 ChromeDriver was started successfully.
14-Sep-2021 02:11:00 Sep 14, 2021 2:11:00 AM org.openqa.selenium.remote.ProtocolHandshake createSession
14-Sep-2021 02:11:00 INFO: Detected dialect: W3C
14-Sep-2021 02:11:11 Tests run: 1, Failures: 0, Errors: 0, Skipped: 0, Time elapsed: 11.939 sec
14-Sep-2021 02:11:11 Running org.openmrs.reference.StartVisitTest
14-Sep-2021 02:11:11 Running locally...
14-Sep-2021 02:11:11 Starting ChromeDriver 90.0.4430.24 (4c6d850f087da467d926e8eddb76550aed655991-refs/branch-heads/4430@{#429}) on port 30492
14-Sep-2021 02:11:11 Only local connections are allowed.
14-Sep-2021 02:11:12 Please see https://chromedriver.chromium.org/security-considerations for suggestions on keeping ChromeDriver safe.
14-Sep-2021 02:11:12 ChromeDriver was started successfully.
14-Sep-2021 02:11:12 Sep 14, 2021 2:11:12 AM org.openqa.selenium.remote.ProtocolHandshake createSession
14-Sep-2021 02:11:12 INFO: Detected dialect: W3C
14-Sep-2021 02:11:20 Tests run: 1, Failures: 0, Errors: 0, Skipped: 0, Time elapsed: 8.329 sec
14-Sep-2021 02:11:20 Running org.openmrs.reference.DeletePersonTest
14-Sep-2021 02:11:20 Running locally...
14-Sep-2021 02:11:20 Starting ChromeDriver 90.0.4430.24 (4c6d850f087da467d926e8eddb76550aed655991-refs/branch-heads/4430@{#429}) on port 6879
14-Sep-2021 02:11:20 Only local connections are allowed.
14-Sep-2021 02:11:20 Please see https://chromedriver.chromium.org/security-considerations for suggestions on keeping ChromeDriver safe.
14-Sep-2021 02:11:20 ChromeDriver was started successfully.
14-Sep-2021 02:11:20 Sep 14, 2021 2:11:20 AM org.openqa.selenium.remote.ProtocolHandshake createSession
14-Sep-2021 02:11:20 INFO: Detected dialect: W3C
14-Sep-2021 02:11:24 Tests run: 1, Failures: 0, Errors: 0, Skipped: 0, Time elapsed: 4.374 sec
14-Sep-2021 02:11:24 Running org.openmrs.reference.EditProviderTest
14-Sep-2021 02:11:24 Running locally...
14-Sep-2021 02:11:24 Starting ChromeDriver 90.0.4430.24 (4c6d850f087da467d926e8eddb76550aed655991-refs/branch-heads/4430@{#429}) on port 16667
14-Sep-2021 02:11:24 Only local connections are allowed.
14-Sep-2021 02:11:24 Please see https://chromedriver.chromium.org/security-considerations for suggestions on keeping ChromeDriver safe.
14-Sep-2021 02:11:24 ChromeDriver was started successfully.
14-Sep-2021 02:11:24 Sep 14, 2021 2:11:24 AM org.openqa.selenium.remote.ProtocolHandshake createSession
14-Sep-2021 02:11:24 INFO: Detected dialect: W3C
14-Sep-2021 02:11:29 Tests run: 1, Failures: 0, Errors: 0, Skipped: 0, Time elapsed: 5.045 sec
14-Sep-2021 02:11:29 Running org.openmrs.reference.RetireVisitTypeTest
14-Sep-2021 02:11:29 Running locally...
14-Sep-2021 02:11:29 Starting ChromeDriver 90.0.4430.24 (4c6d850f087da467d926e8eddb76550aed655991-refs/branch-heads/4430@{#429}) on port 13886
14-Sep-2021 02:11:29 Only local connections are allowed.
14-Sep-2021 02:11:29 Please see https://chromedriver.chromium.org/security-considerations for suggestions on keeping ChromeDriver safe.
14-Sep-2021 02:11:29 ChromeDriver was started successfully.
14-Sep-2021 02:11:29 Sep 14, 2021 2:11:29 AM org.openqa.selenium.remote.ProtocolHandshake createSession
14-Sep-2021 02:11:29 INFO: Detected dialect: W3C
14-Sep-2021 02:11:33 Tests run: 1, Failures: 0, Errors: 0, Skipped: 0, Time elapsed: 3.299 sec
14-Sep-2021 02:11:33
14-Sep-2021 02:11:33 Results :
14-Sep-2021 02:11:33
14-Sep-2021 02:11:33 Tests in error:
14-Sep-2021 02:11:33   captureVitalsTest(org.openmrs.reference.CaptureVitalsTest): Expected condition failed: waiting for visibility of element located by By.id: w18 (tried for 120 second(s) with 500 milliseconds interval)(..)
14-Sep-2021 02:11:33   captureVitalsTest(org.openmrs.reference.CaptureVitalsTest): Session ID is null. Using WebDriver after calling quit()?(..)
14-Sep-2021 02:11:33
14-Sep-2021 02:11:33 Tests run: 59, Failures: 0, Errors: 2, Skipped: 0
14-Sep-2021 02:11:33
14-Sep-2021 02:11:33 [INFO] ------------------------------------------------------------------------
14-Sep-2021 02:11:33 [INFO] Reactor Summary:
14-Sep-2021 02:11:33 [INFO]
14-Sep-2021 02:11:33 [INFO] Reference Application Distribution ................. SUCCESS [  0.321 s]
14-Sep-2021 02:11:33 [INFO] Reference Application Distribution Package ......... SUCCESS [ 26.806 s]
14-Sep-2021 02:11:33 [INFO] Reference Application Distribution UI Tests ........ FAILURE [10:35 min]
14-Sep-2021 02:11:33 [INFO] ------------------------------------------------------------------------
14-Sep-2021 02:11:33 [INFO] BUILD FAILURE
14-Sep-2021 02:11:33 [INFO] ------------------------------------------------------------------------
14-Sep-2021 02:11:33 [INFO] Total time: 11:02 min
14-Sep-2021 02:11:33 [INFO] Finished at: 2021-09-14T02:11:33+00:00
14-Sep-2021 02:11:34 [INFO] Final Memory: 63M/362M
14-Sep-2021 02:11:34 [INFO] ------------------------------------------------------------------------
14-Sep-2021 02:11:34 [ERROR] Failed to execute goal org.apache.maven.plugins:maven-surefire-plugin:2.12:test (default-test) on project referenceapplication-ui-tests: There are test failures.
14-Sep-2021 02:11:34 [ERROR]
14-Sep-2021 02:11:34 [ERROR] Please refer to /home/bamboo-agent/bamboo-agent/xml-data/build-dir/REFAPP-UI-FRAMEWORK/ui-tests/target/surefire-reports for the individual test results.
14-Sep-2021 02:11:34 [ERROR] -> [Help 1]
14-Sep-2021 02:11:34 org.apache.maven.lifecycle.LifecycleExecutionException: Failed to execute goal org.apache.maven.plugins:maven-surefire-plugin:2.12:test (default-test) on project referenceapplication-ui-tests: There are test failures.
14-Sep-2021 02:11:34
14-Sep-2021 02:11:34 Please refer to /home/bamboo-agent/bamboo-agent/xml-data/build-dir/REFAPP-UI-FRAMEWORK/ui-tests/target/surefire-reports for the individual test results.
14-Sep-2021 02:11:34         at org.apache.maven.lifecycle.internal.MojoExecutor.execute(MojoExecutor.java:212)
14-Sep-2021 02:11:34         at org.apache.maven.lifecycle.internal.MojoExecutor.execute(MojoExecutor.java:153)
14-Sep-2021 02:11:34         at org.apache.maven.lifecycle.internal.MojoExecutor.execute(MojoExecutor.java:145)
14-Sep-2021 02:11:34         at org.apache.maven.lifecycle.internal.LifecycleModuleBuilder.buildProject(LifecycleModuleBuilder.java:116)
14-Sep-2021 02:11:34         at org.apache.maven.lifecycle.internal.LifecycleModuleBuilder.buildProject(LifecycleModuleBuilder.java:80)
14-Sep-2021 02:11:34         at org.apache.maven.lifecycle.internal.builder.singlethreaded.SingleThreadedBuilder.build(SingleThreadedBuilder.java:51)
14-Sep-2021 02:11:34         at org.apache.maven.lifecycle.internal.LifecycleStarter.execute(LifecycleStarter.java:128)
14-Sep-2021 02:11:34         at org.apache.maven.DefaultMaven.doExecute(DefaultMaven.java:307)
14-Sep-2021 02:11:34         at org.apache.maven.DefaultMaven.doExecute(DefaultMaven.java:193)
14-Sep-2021 02:11:34         at org.apache.maven.DefaultMaven.execute(DefaultMaven.java:106)
14-Sep-2021 02:11:34         at org.apache.maven.cli.MavenCli.execute(MavenCli.java:863)
14-Sep-2021 02:11:34         at org.apache.maven.cli.MavenCli.doMain(MavenCli.java:288)
14-Sep-2021 02:11:34         at org.apache.maven.cli.MavenCli.main(MavenCli.java:199)
14-Sep-2021 02:11:34         at sun.reflect.NativeMethodAccessorImpl.invoke0(Native Method)
14-Sep-2021 02:11:34         at sun.reflect.NativeMethodAccessorImpl.invoke(NativeMethodAccessorImpl.java:62)
14-Sep-2021 02:11:34         at sun.reflect.DelegatingMethodAccessorImpl.invoke(DelegatingMethodAccessorImpl.java:43)
14-Sep-2021 02:11:34         at java.lang.reflect.Method.invoke(Method.java:498)
14-Sep-2021 02:11:34         at org.codehaus.plexus.classworlds.launcher.Launcher.launchEnhanced(Launcher.java:289)
14-Sep-2021 02:11:34         at org.codehaus.plexus.classworlds.launcher.Launcher.launch(Launcher.java:229)
14-Sep-2021 02:11:34         at org.codehaus.plexus.classworlds.launcher.Launcher.mainWithExitCode(Launcher.java:415)
14-Sep-2021 02:11:34         at org.codehaus.plexus.classworlds.launcher.Launcher.main(Launcher.java:356)
14-Sep-2021 02:11:34 Caused by: org.apache.maven.plugin.MojoFailureException: There are test failures.
14-Sep-2021 02:11:34
14-Sep-2021 02:11:34 Please refer to /home/bamboo-agent/bamboo-agent/xml-data/build-dir/REFAPP-UI-FRAMEWORK/ui-tests/target/surefire-reports for the individual test results.
14-Sep-2021 02:11:34         at org.apache.maven.plugin.surefire.SurefireHelper.reportExecution(SurefireHelper.java:83)
14-Sep-2021 02:11:34         at org.apache.maven.plugin.surefire.SurefirePlugin.writeSummary(SurefirePlugin.java:673)
14-Sep-2021 02:11:34         at org.apache.maven.plugin.surefire.SurefirePlugin.handleSummary(SurefirePlugin.java:647)
14-Sep-2021 02:11:34         at org.apache.maven.plugin.surefire.AbstractSurefireMojo.executeAfterPreconditionsChecked(AbstractSurefireMojo.java:137)
14-Sep-2021 02:11:34         at org.apache.maven.plugin.surefire.AbstractSurefireMojo.execute(AbstractSurefireMojo.java:98)
14-Sep-2021 02:11:34         at org.apache.maven.plugin.DefaultBuildPluginManager.executeMojo(DefaultBuildPluginManager.java:134)
14-Sep-2021 02:11:34         at org.apache.maven.lifecycle.internal.MojoExecutor.execute(MojoExecutor.java:207)
14-Sep-2021 02:11:34         ... 20 more
14-Sep-2021 02:11:34 [ERROR]
14-Sep-2021 02:11:34 [ERROR] Re-run Maven using the -X switch to enable full debug logging.
14-Sep-2021 02:11:34 [ERROR]
14-Sep-2021 02:11:34 [ERROR] For more information about the errors and possible solutions, please read the following articles:
14-Sep-2021 02:11:34 [ERROR] [Help 1] http://cwiki.apache.org/confluence/display/MAVEN/MojoFailureException
14-Sep-2021 02:11:34 [ERROR]
14-Sep-2021 02:11:34 [ERROR] After correcting the problems, you can resume the build with the command
14-Sep-2021 02:11:34 [ERROR]   mvn <goals> -rf :referenceapplication-ui-tests
14-Sep-2021 02:11:34 Failing task since return code of [/usr/share/apache-maven-3.3.9/bin/mvn --batch-mode -Djava.io.tmpdir=/home/bamboo-agent/bamboo-agent/.agent_tmp/REFAPP-UI-FRAMEWORK clean install -DskipTests=false -e] was 1 while expected 0
14-Sep-2021 02:11:34 Parsing test results under /home/bamboo-agent/bamboo-agent/xml-data/build-dir/REFAPP-UI-FRAMEWORK...
14-Sep-2021 02:11:35 Finished task 'Build distribution' with result: Failed
14-Sep-2021 02:11:35 Running post build plugin 'Docker Container Cleanup'
14-Sep-2021 02:11:35 Running post build plugin 'NCover Results Collector'
14-Sep-2021 02:11:35 Running post build plugin 'Clover Results Collector'
14-Sep-2021 02:11:35 Running post build plugin 'Sauce OnDemand Post Runner'
14-Sep-2021 02:11:35 Running post build plugin 'npm Cache Cleanup'
14-Sep-2021 02:11:35 Running post build plugin 'Artifact Copier'
14-Sep-2021 02:11:35 Finalising the build...
14-Sep-2021 02:11:35 Stopping timer.
14-Sep-2021 02:11:35 Build REFAPP-UI-FRAMEWORK-552 completed.
14-Sep-2021 02:11:36 Running on server: post build plugin 'NCover Results Collector'
14-Sep-2021 02:11:36 Running on server: post build plugin 'Build Hanging Detection Configuration'
14-Sep-2021 02:11:36 Running on server: post build plugin 'Clover Delta Calculator'
14-Sep-2021 02:11:38 Running on server: post build plugin 'Maven Dependencies Postprocessor'
14-Sep-2021 02:11:38 All post build plugins have finished
14-Sep-2021 02:11:38 Generating build results summary...
14-Sep-2021 02:11:38 Saving build results to disk...
14-Sep-2021 02:11:38 Logging substituted variables...
14-Sep-2021 02:11:38 Indexing build results...
14-Sep-2021 02:11:38 Finished building REFAPP-UI-FRAMEWORK-552.