UI tests for the reference application

Build: #562 failed

Job: Run QA UI Tests failed

Stages & jobs

  1. Ref App UI Testing

Build log

The build generated 1,178 lines of output.The output is too long and has been truncated to the last 1,000 lines. Download or view full build log

15-Sep-2021 09:17:46 Starting task 'ensure refapp instance is app and prepare for testing' of type 'com.atlassian.bamboo.plugins.scripttask:task.builder.script'
15-Sep-2021 09:17:46
Beginning to execute external process for build 'Reference Application - UI - Run QA UI Tests #562 (REFAPP-UI-FRAMEWORK-562)'
... running command line:
/home/bamboo-agent/bamboo-agent/temp/REFAPP-UI-FRAMEWORK-562-ScriptBuildTask-3056486833588581532.sh
... in: /home/bamboo-agent/bamboo-agent/xml-data/build-dir/REFAPP-UI-FRAMEWORK
... using extra environment variables:
bamboo_planRepository_1_branch=master
bamboo_capability_system_builder_grailsBuilder_Grails_2_3_7=/opt/grails
bamboo_planRepository_2_branch=master
bamboo_planRepository_1_branchDisplayName=master
bamboo_repository_revision_number=c7f3671641ddaf3dd613e902e5622c3c5320323b
bamboo_saucelabs_username=rkorytkowski
bamboo_repository_207388681_previous_revision_number=c34c0fe0d373a467f44e23c5cc3e8811fe3dd00e
bamboo_buildKey=REFAPP-UI-FRAMEWORK
bamboo_DISPLAY=10
bamboo_maven_release_version=2.8.0
bamboo_planRepository_2_branchDisplayName=master
bamboo_repository_207388681_name=Distribution
bamboo_shortJobName=Run QA UI Tests
bamboo_buildResultsUrl=https://ci.openmrs.org/browse/REFAPP-UI-FRAMEWORK-562
bamboo_planRepository_repositoryUrl=git://github.com/openmrs/openmrs-distro-referenceapplication.git
bamboo_agentId=189792258
bamboo_maven_development_version=
bamboo_capability_system_jdk_JDK_8=/usr/lib/jvm/java-8-openjdk-amd64
bamboo_planRepository_revision=c7f3671641ddaf3dd613e902e5622c3c5320323b
bamboo_planRepository_previousRevision=c34c0fe0d373a467f44e23c5cc3e8811fe3dd00e
bamboo_capability_system_jdk_JDK_1_8_0_265=/usr/lib/jvm/java-1.8.0-openjdk-amd64/
bamboo_repository_branch_name=master
bamboo_dockerhub_username=openmrsci
bamboo_refapp_distro_scm=git@github.com:openmrs/openmrs-distro-referenceapplication.git
bamboo_repository_207388681_branch_name=master
bamboo_repository_207388680_branch_name=master
bamboo_repository_207388681_git_username=
bamboo_planRepository_branch=master
bamboo_repository_207388681_revision_number=c7f3671641ddaf3dd613e902e5622c3c5320323b
bamboo_capability_system_jdk_JDK_1_8_0_275=/usr/lib/jvm/java-1.8.0-openjdk-amd64/
bamboo_capability_system_jdk_JDK_1_8_0_272=/usr/lib/jvm/java-1.8.0-openjdk-amd64/
bamboo_capability_system_jdk_JDK_11=/usr/lib/jvm/java-11-openjdk-amd64
bamboo_planRepository_1_type=gitv2
bamboo_planRepository_branchName=master
bamboo_saucelabs_password=********
bamboo_capability_system_jdk_JDK=/usr/lib/jvm/java-1.8.0-openjdk-amd64/
bamboo_mavenBuildGoals=clean install
bamboo_hg_cache_directory=/home/bamboo-agent/bamboo-agent/xml-data/build-dir/_hg-repositories-cache
bamboo_planRepository_1_username=
bamboo_planRepository_type=gitv2
bamboo_git_cache_directory=/home/bamboo-agent/bamboo-agent/xml-data/build-dir/_git-repositories-cache
bamboo_planRepository_2_branchName=master
bamboo_capability_system_builder_node_Node_js=/usr/bin/node
bamboo_build_commandline_com_atlassian_bamboo_plugins_maven_task_builder_mvn3_2=/usr/share/apache-maven-3.3.9/bin/mvn --batch-mode -Djava.io.tmpdir=/home/bamboo-agent/bamboo-agent/.agent_tmp/REFAPP-UI-FRAMEWORK clean install
bamboo_travis_password=********
bamboo_capability_system_builder_mvn3_Maven_3=/usr/share/apache-maven-3.3.9
bamboo_tmp_directory=/home/bamboo-agent/bamboo-agent/temp
bamboo_planKey=REFAPP-UI
bamboo_capability_system_builder_command_nvm=nvm
bamboo_planRepository_username=
bamboo_capability_system_jdk_JDK_1_8_0_282=/usr/lib/jvm/java-1.8.0-openjdk-amd64/
bamboo_planRepository_1_branchName=master
bamboo_dockerhub_password=********
bamboo_resultsUrl=https://ci.openmrs.org/browse/REFAPP-UI-FRAMEWORK-562
bamboo_capability_system_builder_command_transifex=/usr/bin/tx
bamboo_jdbc_password=********
bamboo_build_working_directory=/home/bamboo-agent/bamboo-agent/xml-data/build-dir/REFAPP-UI-FRAMEWORK
bamboo_planRepository_1_name=Distribution
bamboo_capability_system_jdk_JDK_1_8_0_292=/usr/lib/jvm/java-1.8.0-openjdk-amd64/
bamboo_preparing_refapp_distro_release=false
bamboo_shortPlanName=UI
bamboo_planRepository_2_username=
bamboo_planRepository_name=Distribution
bamboo_docs_aws_secret_key=********
bamboo_buildNumber=562
bamboo_repository_207388680_git_username=
bamboo_repository_207388681_git_repositoryUrl=git://github.com/openmrs/openmrs-distro-referenceapplication.git
bamboo_planName=Reference Application - UI
bamboo_shortPlanKey=UI
bamboo_shortJobKey=FRAMEWORK
bamboo_planRepository_2_name=UI Test Framework
bamboo_buildTimeStamp=2021-09-15T09:17:02.926Z
bamboo_repository_previous_revision_number=c34c0fe0d373a467f44e23c5cc3e8811fe3dd00e
bamboo_refapp_bamboo_build_number=
bamboo_repository_git_branch=master
bamboo_buildResultKey=REFAPP-UI-FRAMEWORK-562
bamboo_docs_aws_access_key=AKIAI7KMDL5KP2673G7A
bamboo_buildPlanName=Reference Application - UI - Run QA UI Tests
bamboo_openMRSVersion=2.1.3
bamboo_planRepository_1_revision=c7f3671641ddaf3dd613e902e5622c3c5320323b
bamboo_repository_207388680_git_repositoryUrl=git://github.com/openmrs/openmrs-contrib-uitestframework.git
bamboo_repository_name=UI Test Framework
bamboo_capability_system_jdk_openjdk_8_jdk=/usr/lib/jvm/java-8-openjdk-amd64
bamboo_planRepository_2_previousRevision=8838c8eeee749c044f9846bcb0a31a7065db1260
bamboo_transifex_password=********
bamboo_repository_207388680_name=UI Test Framework
bamboo_capability_system_jdk_openjdk_11_jdk=/usr/lib/jvm/java-11-openjdk-amd64
bamboo_repository_207388680_previous_revision_number=8838c8eeee749c044f9846bcb0a31a7065db1260
bamboo_buildFailed=false
bamboo_capability_system_builder_grailsBuilder_Grails_2=/opt/grails
bamboo_capability_system_docker_executable=/usr/bin/docker
bamboo_capability_system_builder_command_Bash=/bin/bash
bamboo_agentWorkingDirectory=/home/bamboo-agent/bamboo-agent/xml-data/build-dir
bamboo_planRepository_2_revision=8838c8eeee749c044f9846bcb0a31a7065db1260
bamboo_capability_system_git_executable=/usr/bin/git
bamboo_repository_git_username=
bamboo_planRepository_1_previousRevision=c34c0fe0d373a467f44e23c5cc3e8811fe3dd00e
bamboo_planRepository_branchDisplayName=master
bamboo_planRepository_2_type=gitv2
bamboo_plan_storageTag=plan-207093778
bamboo_repository_207388680_git_branch=master
bamboo_planRepository_2_repositoryUrl=git://github.com/openmrs/openmrs-contrib-uitestframework.git
bamboo_repository_git_repositoryUrl=git://github.com/openmrs/openmrs-distro-referenceapplication.git
bamboo_transifex_username=api
bamboo_refapp_distro_dev_branch=master
bamboo_working_directory=/home/bamboo-agent/bamboo-agent/xml-data/build-dir/REFAPP-UI-FRAMEWORK
bamboo_planRepository_1_repositoryUrl=git://github.com/openmrs/openmrs-distro-referenceapplication.git
bamboo_capability_system_jdk_JDK_1_8=/usr/lib/jvm/java-1.8.0-openjdk-amd64/
bamboo_repository_207388681_git_branch=master
bamboo_repository_207388680_revision_number=8838c8eeee749c044f9846bcb0a31a7065db1260
15-Sep-2021 09:17:46 Finished task 'ensure refapp instance is app and prepare for testing' with result: Success
15-Sep-2021 09:17:46 Starting task 'Build distribution' of type 'com.atlassian.bamboo.plugins.maven:task.builder.mvn3'
15-Sep-2021 09:17:46
Beginning to execute external process for build 'Reference Application - UI - Run QA UI Tests #562 (REFAPP-UI-FRAMEWORK-562)'
... running command line:
/usr/share/apache-maven-3.3.9/bin/mvn --batch-mode -Djava.io.tmpdir=/home/bamboo-agent/bamboo-agent/.agent_tmp/REFAPP-UI-FRAMEWORK clean install -DskipTests=false -e
... in: /home/bamboo-agent/bamboo-agent/xml-data/build-dir/REFAPP-UI-FRAMEWORK
... using extra environment variables:
bamboo_planRepository_1_branch=master
bamboo_capability_system_builder_grailsBuilder_Grails_2_3_7=/opt/grails
bamboo_planRepository_2_branch=master
bamboo_planRepository_1_branchDisplayName=master
bamboo_repository_revision_number=c7f3671641ddaf3dd613e902e5622c3c5320323b
MAVEN2_HOME=/usr/share/apache-maven-3.3.9
bamboo_saucelabs_username=rkorytkowski
bamboo_repository_207388681_previous_revision_number=c34c0fe0d373a467f44e23c5cc3e8811fe3dd00e
bamboo_buildKey=REFAPP-UI-FRAMEWORK
bamboo_DISPLAY=10
bamboo_maven_release_version=2.8.0
bamboo_planRepository_2_branchDisplayName=master
bamboo_repository_207388681_name=Distribution
bamboo_shortJobName=Run QA UI Tests
bamboo_buildResultsUrl=https://ci.openmrs.org/browse/REFAPP-UI-FRAMEWORK-562
bamboo_planRepository_repositoryUrl=git://github.com/openmrs/openmrs-distro-referenceapplication.git
bamboo_agentId=189792258
bamboo_maven_development_version=
bamboo_capability_system_jdk_JDK_8=/usr/lib/jvm/java-8-openjdk-amd64
bamboo_planRepository_revision=c7f3671641ddaf3dd613e902e5622c3c5320323b
bamboo_planRepository_previousRevision=c34c0fe0d373a467f44e23c5cc3e8811fe3dd00e
bamboo_capability_system_jdk_JDK_1_8_0_265=/usr/lib/jvm/java-1.8.0-openjdk-amd64/
bamboo_repository_branch_name=master
bamboo_dockerhub_username=openmrsci
bamboo_refapp_distro_scm=git@github.com:openmrs/openmrs-distro-referenceapplication.git
bamboo_repository_207388681_branch_name=master
JAVA_HOME=/usr/lib/jvm/java-1.8.0-openjdk-amd64/
bamboo_repository_207388680_branch_name=master
bamboo_repository_207388681_git_username=
bamboo_planRepository_branch=master
bamboo_repository_207388681_revision_number=c7f3671641ddaf3dd613e902e5622c3c5320323b
bamboo_capability_system_jdk_JDK_1_8_0_275=/usr/lib/jvm/java-1.8.0-openjdk-amd64/
bamboo_capability_system_jdk_JDK_1_8_0_272=/usr/lib/jvm/java-1.8.0-openjdk-amd64/
bamboo_capability_system_jdk_JDK_11=/usr/lib/jvm/java-11-openjdk-amd64
bamboo_planRepository_1_type=gitv2
bamboo_planRepository_branchName=master
bamboo_saucelabs_password=********
bamboo_capability_system_jdk_JDK=/usr/lib/jvm/java-1.8.0-openjdk-amd64/
bamboo_mavenBuildGoals=clean install
bamboo_hg_cache_directory=/home/bamboo-agent/bamboo-agent/xml-data/build-dir/_hg-repositories-cache
bamboo_planRepository_1_username=
bamboo_planRepository_type=gitv2
bamboo_git_cache_directory=/home/bamboo-agent/bamboo-agent/xml-data/build-dir/_git-repositories-cache
bamboo_planRepository_2_branchName=master
useMavenReturnCode=false
bamboo_capability_system_builder_node_Node_js=/usr/bin/node
bamboo_build_commandline_com_atlassian_bamboo_plugins_maven_task_builder_mvn3_2=/usr/share/apache-maven-3.3.9/bin/mvn --batch-mode -Djava.io.tmpdir=/home/bamboo-agent/bamboo-agent/.agent_tmp/REFAPP-UI-FRAMEWORK clean install
bamboo_travis_password=********
bamboo_capability_system_builder_mvn3_Maven_3=/usr/share/apache-maven-3.3.9
bamboo_tmp_directory=/home/bamboo-agent/bamboo-agent/temp
bamboo_planKey=REFAPP-UI
bamboo_capability_system_builder_command_nvm=nvm
bamboo_planRepository_username=
bamboo_capability_system_jdk_JDK_1_8_0_282=/usr/lib/jvm/java-1.8.0-openjdk-amd64/
bamboo_planRepository_1_branchName=master
bamboo_dockerhub_password=********
bamboo_resultsUrl=https://ci.openmrs.org/browse/REFAPP-UI-FRAMEWORK-562
bamboo_capability_system_builder_command_transifex=/usr/bin/tx
bamboo_jdbc_password=********
bamboo_build_working_directory=/home/bamboo-agent/bamboo-agent/xml-data/build-dir/REFAPP-UI-FRAMEWORK
bamboo_planRepository_1_name=Distribution
bamboo_capability_system_jdk_JDK_1_8_0_292=/usr/lib/jvm/java-1.8.0-openjdk-amd64/
bamboo_preparing_refapp_distro_release=false
bamboo_shortPlanName=UI
bamboo_planRepository_2_username=
bamboo_planRepository_name=Distribution
bamboo_docs_aws_secret_key=********
bamboo_buildNumber=562
bamboo_repository_207388680_git_username=
bamboo_repository_207388681_git_repositoryUrl=git://github.com/openmrs/openmrs-distro-referenceapplication.git
bamboo_planName=Reference Application - UI
bamboo_build_commandline_com_atlassian_bamboo_plugins_scripttask_task_builder_script_6=/home/bamboo-agent/bamboo-agent/temp/REFAPP-UI-FRAMEWORK-562-ScriptBuildTask-3056486833588581532.sh
bamboo_shortPlanKey=UI
bamboo_shortJobKey=FRAMEWORK
bamboo_planRepository_2_name=UI Test Framework
bamboo_buildTimeStamp=2021-09-15T09:17:02.926Z
bamboo_repository_previous_revision_number=c34c0fe0d373a467f44e23c5cc3e8811fe3dd00e
M2_HOME=/usr/share/apache-maven-3.3.9
bamboo_refapp_bamboo_build_number=
bamboo_repository_git_branch=master
bamboo_buildResultKey=REFAPP-UI-FRAMEWORK-562
bamboo_docs_aws_access_key=AKIAI7KMDL5KP2673G7A
bamboo_buildPlanName=Reference Application - UI - Run QA UI Tests
bamboo_openMRSVersion=2.1.3
bamboo_planRepository_1_revision=c7f3671641ddaf3dd613e902e5622c3c5320323b
bamboo_repository_207388680_git_repositoryUrl=git://github.com/openmrs/openmrs-contrib-uitestframework.git
bamboo_repository_name=UI Test Framework
bamboo_capability_system_jdk_openjdk_8_jdk=/usr/lib/jvm/java-8-openjdk-amd64
bamboo_planRepository_2_previousRevision=8838c8eeee749c044f9846bcb0a31a7065db1260
bamboo_transifex_password=********
bamboo_repository_207388680_name=UI Test Framework
bamboo_capability_system_jdk_openjdk_11_jdk=/usr/lib/jvm/java-11-openjdk-amd64
bamboo_repository_207388680_previous_revision_number=8838c8eeee749c044f9846bcb0a31a7065db1260
bamboo_buildFailed=false
bamboo_capability_system_builder_grailsBuilder_Grails_2=/opt/grails
bamboo_capability_system_docker_executable=/usr/bin/docker
bamboo_capability_system_builder_command_Bash=/bin/bash
bamboo_agentWorkingDirectory=/home/bamboo-agent/bamboo-agent/xml-data/build-dir
bamboo_planRepository_2_revision=8838c8eeee749c044f9846bcb0a31a7065db1260
bamboo_capability_system_git_executable=/usr/bin/git
bamboo_repository_git_username=
bamboo_planRepository_1_previousRevision=c34c0fe0d373a467f44e23c5cc3e8811fe3dd00e
bamboo_planRepository_branchDisplayName=master
bamboo_planRepository_2_type=gitv2
bamboo_plan_storageTag=plan-207093778
bamboo_repository_207388680_git_branch=master
bamboo_planRepository_2_repositoryUrl=git://github.com/openmrs/openmrs-contrib-uitestframework.git
bamboo_repository_git_repositoryUrl=git://github.com/openmrs/openmrs-distro-referenceapplication.git
bamboo_transifex_username=api
bamboo_refapp_distro_dev_branch=master
bamboo_working_directory=/home/bamboo-agent/bamboo-agent/xml-data/build-dir/REFAPP-UI-FRAMEWORK
bamboo_planRepository_1_repositoryUrl=git://github.com/openmrs/openmrs-distro-referenceapplication.git
bamboo_capability_system_jdk_JDK_1_8=/usr/lib/jvm/java-1.8.0-openjdk-amd64/
bamboo_repository_207388681_git_branch=master
bamboo_repository_207388680_revision_number=8838c8eeee749c044f9846bcb0a31a7065db1260
PATH=/usr/lib/jvm/java-1.8.0-openjdk-amd64//bin:/home/bamboo-agent/.nvm/versions/node/v10.22.1/bin:/home/bamboo-agent/bin:/home/bamboo-agent/.local/bin:/usr/local/sbin:/usr/local/bin:/usr/sbin:/usr/bin:/sbin:/bin:/usr/games:/usr/local/games:/snap/bin:/opt/puppetlabs/bin
15-Sep-2021 09:17:47 [INFO] Error stacktraces are turned on.
15-Sep-2021 09:17:47 [INFO] Scanning for projects...
15-Sep-2021 09:17:47 [WARNING]
15-Sep-2021 09:17:47 [WARNING] Some problems were encountered while building the effective model for org.openmrs.distro:referenceapplication-ui-tests:jar:2.12.0-SNAPSHOT
15-Sep-2021 09:17:47 [WARNING] 'version' contains an expression but should be a constant. @ org.openmrs.distro:referenceapplication-ui-tests:${parent.version}, /home/bamboo-agent/bamboo-agent/xml-data/build-dir/REFAPP-UI-FRAMEWORK/ui-tests/pom.xml, line 6, column 14
15-Sep-2021 09:17:47 [WARNING] 'build.plugins.plugin.version' for org.apache.maven.plugins:maven-deploy-plugin is missing. @ org.openmrs.distro:referenceapplication-ui-tests:${parent.version}, /home/bamboo-agent/bamboo-agent/xml-data/build-dir/REFAPP-UI-FRAMEWORK/ui-tests/pom.xml, line 88, column 21
15-Sep-2021 09:17:47 [WARNING] The expression ${parent.version} is deprecated. Please use ${project.parent.version} instead. @ org.openmrs.distro:referenceapplication-ui-tests:${parent.version}, /home/bamboo-agent/bamboo-agent/xml-data/build-dir/REFAPP-UI-FRAMEWORK/ui-tests/pom.xml
15-Sep-2021 09:17:47 [WARNING]
15-Sep-2021 09:17:47 [WARNING] It is highly recommended to fix these problems because they threaten the stability of your build.
15-Sep-2021 09:17:47 [WARNING]
15-Sep-2021 09:17:47 [WARNING] For this reason, future Maven versions might no longer support building such malformed projects.
15-Sep-2021 09:17:47 [WARNING]
15-Sep-2021 09:17:47 [INFO] ------------------------------------------------------------------------
15-Sep-2021 09:17:47 [INFO] Reactor Build Order:
15-Sep-2021 09:17:47 [INFO]
15-Sep-2021 09:17:47 [INFO] Reference Application Distribution
15-Sep-2021 09:17:47 [INFO] Reference Application Distribution Package
15-Sep-2021 09:17:47 [INFO] Reference Application Distribution UI Tests
15-Sep-2021 09:17:47 [INFO]                                                                         
15-Sep-2021 09:17:47 [INFO] ------------------------------------------------------------------------
15-Sep-2021 09:17:47 [INFO] Building Reference Application Distribution 2.12.0-SNAPSHOT
15-Sep-2021 09:17:47 [INFO] ------------------------------------------------------------------------
15-Sep-2021 09:17:47 [INFO]
15-Sep-2021 09:17:47 [INFO] --- maven-clean-plugin:2.5:clean (default-clean) @ referenceapplication ---
15-Sep-2021 09:17:47 [INFO]
15-Sep-2021 09:17:47 [INFO] --- maven-install-plugin:2.4:install (default-install) @ referenceapplication ---
15-Sep-2021 09:17:47 [INFO] Installing /home/bamboo-agent/bamboo-agent/xml-data/build-dir/REFAPP-UI-FRAMEWORK/pom.xml to /home/bamboo-agent/.m2/repository/org/openmrs/distro/referenceapplication/2.12.0-SNAPSHOT/referenceapplication-2.12.0-SNAPSHOT.pom
15-Sep-2021 09:17:47 [INFO]                                                                         
15-Sep-2021 09:17:47 [INFO] ------------------------------------------------------------------------
15-Sep-2021 09:17:47 [INFO] Building Reference Application Distribution Package 2.12.0-SNAPSHOT
15-Sep-2021 09:17:47 [INFO] ------------------------------------------------------------------------
15-Sep-2021 09:17:49 [INFO]
15-Sep-2021 09:17:49 [INFO] --- maven-clean-plugin:2.5:clean (default-clean) @ referenceapplication-package ---
15-Sep-2021 09:17:49 [INFO]
15-Sep-2021 09:17:49 [INFO] --- maven-resources-plugin:2.6:resources (default-resources) @ referenceapplication-package ---
15-Sep-2021 09:17:49 [INFO] Using 'UTF-8' encoding to copy filtered resources.
15-Sep-2021 09:17:49 [INFO] Copying 1 resource
15-Sep-2021 09:17:49 [INFO] Copying 2 resources
15-Sep-2021 09:17:49 [INFO] skip non existing resourceDirectory /home/bamboo-agent/bamboo-agent/xml-data/build-dir/REFAPP-UI-FRAMEWORK/package/src/main/webapp
15-Sep-2021 09:17:49 [INFO]
15-Sep-2021 09:17:49 [INFO] --- openmrs-sdk-maven-plugin:4.0.0:build-distro (build-distro) @ referenceapplication-package ---
15-Sep-2021 09:17:51
15-Sep-2021 09:17:51 Downloading modules...
15-Sep-2021 09:17:51
15-Sep-2021 09:17:53 [INFO] Configured Artifact: org.openmrs.web:openmrs-webapp:2.4.0:war
15-Sep-2021 09:17:53 [INFO] Copying openmrs-webapp-2.4.0.war to /home/bamboo-agent/bamboo-agent/xml-data/build-dir/REFAPP-UI-FRAMEWORK/package/target/distro/web/openmrs-2.4.0.war
15-Sep-2021 09:17:53 file:/home/bamboo-agent/bamboo-agent/xml-data/build-dir/REFAPP-UI-FRAMEWORK/package/target/distro/web/openmrs-2.4.0.war
15-Sep-2021 09:17:53 target:/home/bamboo-agent/bamboo-agent/xml-data/build-dir/REFAPP-UI-FRAMEWORK/package/target/distro/web
15-Sep-2021 09:17:53 [INFO] Configured Artifact: org.openmrs.module:addresshierarchy-omod:2.14.2:jar
15-Sep-2021 09:17:53 [INFO] Configured Artifact: org.openmrs.module:legacyui-omod:1.8.3:jar
15-Sep-2021 09:17:53 [INFO] Configured Artifact: org.openmrs.module:openconceptlab-omod:1.2.6:jar
15-Sep-2021 09:17:53 [INFO] Configured Artifact: org.openmrs.module:metadatadeploy-omod:1.13.0:jar
15-Sep-2021 09:17:53 [INFO] Configured Artifact: org.openmrs.module:reportingrest-omod:1.12.0:jar
15-Sep-2021 09:17:53 [INFO] Configured Artifact: org.openmrs.module:owa-omod:1.13.0:jar
15-Sep-2021 09:17:53 [INFO] Configured Artifact: org.openmrs.module:fhir2-omod:1.2.2:jar
15-Sep-2021 09:17:53 [INFO] Configured Artifact: org.openmrs.module:serialization.xstream-omod:0.2.15:omod
15-Sep-2021 09:17:53 [INFO] Configured Artifact: org.openmrs.module:registrationapp-omod:1.24.0:jar
15-Sep-2021 09:17:53 [INFO] Configured Artifact: org.openmrs:event-omod:2.10.0-SNAPSHOT:jar
15-Sep-2021 09:17:54 [INFO] Downloading: http://mavenrepo.openmrs.org/nexus/content/repositories/public/org/openmrs/event-omod/2.10.0-SNAPSHOT/maven-metadata.xml
15-Sep-2021 09:17:55 [INFO] Downloaded: http://mavenrepo.openmrs.org/nexus/content/repositories/public/org/openmrs/event-omod/2.10.0-SNAPSHOT/maven-metadata.xml (987 B at 0.7 KB/sec)
15-Sep-2021 09:17:55 [INFO] Downloading: http://mavenrepo.openmrs.org/nexus/content/repositories/public/org/openmrs/event-omod/2.10.0-SNAPSHOT/event-omod-2.10.0-20210702.124301-3.jar
15-Sep-2021 09:17:57 [INFO] Downloaded: http://mavenrepo.openmrs.org/nexus/content/repositories/public/org/openmrs/event-omod/2.10.0-SNAPSHOT/event-omod-2.10.0-20210702.124301-3.jar (4666 KB at 2553.7 KB/sec)
15-Sep-2021 09:17:57 [INFO] Configured Artifact: org.openmrs.module:uilibrary-omod:2.0.7:jar
15-Sep-2021 09:17:57 [INFO] Configured Artifact: org.openmrs.module:htmlwidgets-omod:1.10.0:jar
15-Sep-2021 09:17:57 [INFO] Configured Artifact: org.openmrs.module:dataexchange-omod:1.3.7:jar
15-Sep-2021 09:17:57 [INFO] Configured Artifact: org.openmrs.module:appui-omod:1.14.0:jar
15-Sep-2021 09:17:57 [INFO] Configured Artifact: org.openmrs.module:allergyui-omod:1.8.4:jar
15-Sep-2021 09:17:57 [INFO] Configured Artifact: org.openmrs.module:providermanagement-omod:2.13.0:jar
15-Sep-2021 09:17:57 [INFO] Configured Artifact: org.openmrs.module:appointmentschedulingui-omod:1.12.0:jar
15-Sep-2021 09:17:57 [INFO] Configured Artifact: org.openmrs.module:attachments-omod:2.5.0:jar
15-Sep-2021 09:17:57 [INFO] Configured Artifact: org.openmrs.module:formentryapp-omod:1.4.2:jar
15-Sep-2021 09:17:57 [INFO] Configured Artifact: org.openmrs.module:idgen-omod:4.7.0:jar
15-Sep-2021 09:17:57 [INFO] Configured Artifact: org.openmrs.module:metadatamapping-omod:1.4.0:jar
15-Sep-2021 09:17:57 [INFO] Configured Artifact: org.openmrs.module:htmlformentryui-omod:2.0.0:jar
15-Sep-2021 09:17:57 [INFO] Configured Artifact: org.openmrs.module:referencedemodata-omod:1.4.7:jar
15-Sep-2021 09:17:57 [INFO] Configured Artifact: org.openmrs.module:emrapi-omod:1.32.0:jar
15-Sep-2021 09:17:57 [INFO] Configured Artifact: org.openmrs.module:referenceapplication-omod:2.12.0-SNAPSHOT:jar
15-Sep-2021 09:17:57 [INFO] Downloading: http://mavenrepo.openmrs.org/nexus/content/repositories/public/org/openmrs/module/referenceapplication-omod/2.12.0-SNAPSHOT/maven-metadata.xml
15-Sep-2021 09:17:57 [INFO] Downloaded: http://mavenrepo.openmrs.org/nexus/content/repositories/public/org/openmrs/module/referenceapplication-omod/2.12.0-SNAPSHOT/maven-metadata.xml (802 B at 2.7 KB/sec)
15-Sep-2021 09:17:57 [INFO] Downloading: http://mavenrepo.openmrs.org/nexus/content/repositories/public/org/openmrs/module/referenceapplication-omod/2.12.0-SNAPSHOT/referenceapplication-omod-2.12.0-20210914.230312-267.jar
15-Sep-2021 09:17:58 [INFO] Downloaded: http://mavenrepo.openmrs.org/nexus/content/repositories/public/org/openmrs/module/referenceapplication-omod/2.12.0-SNAPSHOT/referenceapplication-omod-2.12.0-20210914.230312-267.jar (1902 KB at 2428.0 KB/sec)
15-Sep-2021 09:17:58 [INFO] Configured Artifact: org.openmrs.module:htmlformentry-omod:4.1.0:jar
15-Sep-2021 09:17:58 [INFO] Configured Artifact: org.openmrs.module:appframework-omod:2.16.0:jar
15-Sep-2021 09:17:58 [INFO] Configured Artifact: org.openmrs.module:referencemetadata-omod:2.12.0:jar
15-Sep-2021 09:17:58 [INFO] Configured Artifact: org.openmrs.module:reportingui-omod:1.8.0:jar
15-Sep-2021 09:17:58 [INFO] Configured Artifact: org.openmrs.module:coreapps-omod:1.34.0-SNAPSHOT:jar
15-Sep-2021 09:17:58 [INFO] Downloading: http://mavenrepo.openmrs.org/nexus/content/repositories/public/org/openmrs/module/coreapps-omod/1.34.0-SNAPSHOT/maven-metadata.xml
15-Sep-2021 09:17:59 [INFO] Downloaded: http://mavenrepo.openmrs.org/nexus/content/repositories/public/org/openmrs/module/coreapps-omod/1.34.0-SNAPSHOT/maven-metadata.xml (787 B at 1.0 KB/sec)
15-Sep-2021 09:17:59 [INFO] Downloading: http://mavenrepo.openmrs.org/nexus/content/repositories/public/org/openmrs/module/coreapps-omod/1.34.0-SNAPSHOT/coreapps-omod-1.34.0-20210914.230335-33.jar
15-Sep-2021 09:18:00 [INFO] Downloaded: http://mavenrepo.openmrs.org/nexus/content/repositories/public/org/openmrs/module/coreapps-omod/1.34.0-SNAPSHOT/coreapps-omod-1.34.0-20210914.230335-33.jar (3859 KB at 5037.8 KB/sec)
15-Sep-2021 09:18:00 [INFO] Configured Artifact: org.openmrs.module:reportingcompatibility-omod:2.0.8:jar
15-Sep-2021 09:18:00 [INFO] Configured Artifact: org.openmrs.module:reporting-omod:1.23.0:jar
15-Sep-2021 09:18:00 [INFO] Configured Artifact: org.openmrs.module:adminui-omod:1.5.0:jar
15-Sep-2021 09:18:00 [INFO] Configured Artifact: org.openmrs.module:registrationcore-omod:1.11.0:jar
15-Sep-2021 09:18:00 [INFO] Configured Artifact: org.openmrs.module:appointmentscheduling-omod:1.16.0:jar
15-Sep-2021 09:18:00 [INFO] Configured Artifact: org.openmrs.module:atlas-omod:2.2.5:omod
15-Sep-2021 09:18:00 [INFO] Configured Artifact: org.openmrs.module:calculation-omod:1.3.0:jar
15-Sep-2021 09:18:00 [INFO] Configured Artifact: org.openmrs.module:webservices.rest-omod:2.32.0-SNAPSHOT:jar
15-Sep-2021 09:18:00 [INFO] Downloading: http://mavenrepo.openmrs.org/nexus/content/repositories/public/org/openmrs/module/webservices.rest-omod/2.32.0-SNAPSHOT/maven-metadata.xml
15-Sep-2021 09:18:00 [INFO] Downloaded: http://mavenrepo.openmrs.org/nexus/content/repositories/public/org/openmrs/module/webservices.rest-omod/2.32.0-SNAPSHOT/maven-metadata.xml (1009 B at 3.4 KB/sec)
15-Sep-2021 09:18:00 [INFO] Downloading: http://mavenrepo.openmrs.org/nexus/content/repositories/public/org/openmrs/module/webservices.rest-omod/2.32.0-SNAPSHOT/webservices.rest-omod-2.32.0-20210914.224533-67.jar
15-Sep-2021 09:18:01 [INFO] Downloaded: http://mavenrepo.openmrs.org/nexus/content/repositories/public/org/openmrs/module/webservices.rest-omod/2.32.0-SNAPSHOT/webservices.rest-omod-2.32.0-20210914.224533-67.jar (6750 KB at 5962.8 KB/sec)
15-Sep-2021 09:18:01 [INFO] Configured Artifact: org.openmrs.module:spa-omod:1.0.8:jar
15-Sep-2021 09:18:01 [INFO] Configured Artifact: org.openmrs.module:uicommons-omod:2.18.0:jar
15-Sep-2021 09:18:01 [INFO] Configured Artifact: org.openmrs.module:uiframework-omod:3.21.0:jar
15-Sep-2021 09:18:01 [INFO] Configured Artifact: org.openmrs.module:metadatasharing-omod:1.8.0:jar
15-Sep-2021 09:18:01 [INFO] Copying addresshierarchy-omod-2.14.2.jar to /home/bamboo-agent/bamboo-agent/xml-data/build-dir/REFAPP-UI-FRAMEWORK/package/target/distro/web/modules/addresshierarchy-2.14.2.omod
15-Sep-2021 09:18:01 [INFO] Copying legacyui-omod-1.8.3.jar to /home/bamboo-agent/bamboo-agent/xml-data/build-dir/REFAPP-UI-FRAMEWORK/package/target/distro/web/modules/legacyui-1.8.3.omod
15-Sep-2021 09:18:01 [INFO] Copying openconceptlab-omod-1.2.6.jar to /home/bamboo-agent/bamboo-agent/xml-data/build-dir/REFAPP-UI-FRAMEWORK/package/target/distro/web/modules/openconceptlab-1.2.6.omod
15-Sep-2021 09:18:01 [INFO] Copying metadatadeploy-omod-1.13.0.jar to /home/bamboo-agent/bamboo-agent/xml-data/build-dir/REFAPP-UI-FRAMEWORK/package/target/distro/web/modules/metadatadeploy-1.13.0.omod
15-Sep-2021 09:18:01 [INFO] Copying reportingrest-omod-1.12.0.jar to /home/bamboo-agent/bamboo-agent/xml-data/build-dir/REFAPP-UI-FRAMEWORK/package/target/distro/web/modules/reportingrest-1.12.0.omod
15-Sep-2021 09:18:02 [INFO] Copying owa-omod-1.13.0.jar to /home/bamboo-agent/bamboo-agent/xml-data/build-dir/REFAPP-UI-FRAMEWORK/package/target/distro/web/modules/owa-1.13.0.omod
15-Sep-2021 09:18:02 [INFO] Copying fhir2-omod-1.2.2.jar to /home/bamboo-agent/bamboo-agent/xml-data/build-dir/REFAPP-UI-FRAMEWORK/package/target/distro/web/modules/fhir2-1.2.2.omod
15-Sep-2021 09:18:03 [INFO] Copying serialization.xstream-omod-0.2.15.omod to /home/bamboo-agent/bamboo-agent/xml-data/build-dir/REFAPP-UI-FRAMEWORK/package/target/distro/web/modules/serialization.xstream-0.2.15.omod
15-Sep-2021 09:18:03 [INFO] Copying registrationapp-omod-1.24.0.jar to /home/bamboo-agent/bamboo-agent/xml-data/build-dir/REFAPP-UI-FRAMEWORK/package/target/distro/web/modules/registrationapp-1.24.0.omod
15-Sep-2021 09:18:03 [INFO] Copying event-omod-2.10.0-SNAPSHOT.jar to /home/bamboo-agent/bamboo-agent/xml-data/build-dir/REFAPP-UI-FRAMEWORK/package/target/distro/web/modules/event-2.10.0-SNAPSHOT.omod
15-Sep-2021 09:18:03 [INFO] Copying uilibrary-omod-2.0.7.jar to /home/bamboo-agent/bamboo-agent/xml-data/build-dir/REFAPP-UI-FRAMEWORK/package/target/distro/web/modules/uilibrary-2.0.7.omod
15-Sep-2021 09:18:03 [INFO] Copying htmlwidgets-omod-1.10.0.jar to /home/bamboo-agent/bamboo-agent/xml-data/build-dir/REFAPP-UI-FRAMEWORK/package/target/distro/web/modules/htmlwidgets-1.10.0.omod
15-Sep-2021 09:18:03 [INFO] Copying dataexchange-omod-1.3.7.jar to /home/bamboo-agent/bamboo-agent/xml-data/build-dir/REFAPP-UI-FRAMEWORK/package/target/distro/web/modules/dataexchange-1.3.7.omod
15-Sep-2021 09:18:03 [INFO] Copying appui-omod-1.14.0.jar to /home/bamboo-agent/bamboo-agent/xml-data/build-dir/REFAPP-UI-FRAMEWORK/package/target/distro/web/modules/appui-1.14.0.omod
15-Sep-2021 09:18:03 [INFO] Copying allergyui-omod-1.8.4.jar to /home/bamboo-agent/bamboo-agent/xml-data/build-dir/REFAPP-UI-FRAMEWORK/package/target/distro/web/modules/allergyui-1.8.4.omod
15-Sep-2021 09:18:03 [INFO] Copying providermanagement-omod-2.13.0.jar to /home/bamboo-agent/bamboo-agent/xml-data/build-dir/REFAPP-UI-FRAMEWORK/package/target/distro/web/modules/providermanagement-2.13.0.omod
15-Sep-2021 09:18:03 [INFO] Copying appointmentschedulingui-omod-1.12.0.jar to /home/bamboo-agent/bamboo-agent/xml-data/build-dir/REFAPP-UI-FRAMEWORK/package/target/distro/web/modules/appointmentschedulingui-1.12.0.omod
15-Sep-2021 09:18:04 [INFO] Copying attachments-omod-2.5.0.jar to /home/bamboo-agent/bamboo-agent/xml-data/build-dir/REFAPP-UI-FRAMEWORK/package/target/distro/web/modules/attachments-2.5.0.omod
15-Sep-2021 09:18:04 [INFO] Copying formentryapp-omod-1.4.2.jar to /home/bamboo-agent/bamboo-agent/xml-data/build-dir/REFAPP-UI-FRAMEWORK/package/target/distro/web/modules/formentryapp-1.4.2.omod
15-Sep-2021 09:18:04 [INFO] Copying idgen-omod-4.7.0.jar to /home/bamboo-agent/bamboo-agent/xml-data/build-dir/REFAPP-UI-FRAMEWORK/package/target/distro/web/modules/idgen-4.7.0.omod
15-Sep-2021 09:18:04 [INFO] Copying metadatamapping-omod-1.4.0.jar to /home/bamboo-agent/bamboo-agent/xml-data/build-dir/REFAPP-UI-FRAMEWORK/package/target/distro/web/modules/metadatamapping-1.4.0.omod
15-Sep-2021 09:18:04 [INFO] Copying htmlformentryui-omod-2.0.0.jar to /home/bamboo-agent/bamboo-agent/xml-data/build-dir/REFAPP-UI-FRAMEWORK/package/target/distro/web/modules/htmlformentryui-2.0.0.omod
15-Sep-2021 09:18:04 [INFO] Copying referencedemodata-omod-1.4.7.jar to /home/bamboo-agent/bamboo-agent/xml-data/build-dir/REFAPP-UI-FRAMEWORK/package/target/distro/web/modules/referencedemodata-1.4.7.omod
15-Sep-2021 09:18:04 [INFO] Copying emrapi-omod-1.32.0.jar to /home/bamboo-agent/bamboo-agent/xml-data/build-dir/REFAPP-UI-FRAMEWORK/package/target/distro/web/modules/emrapi-1.32.0.omod
15-Sep-2021 09:18:04 [INFO] Copying referenceapplication-omod-2.12.0-SNAPSHOT.jar to /home/bamboo-agent/bamboo-agent/xml-data/build-dir/REFAPP-UI-FRAMEWORK/package/target/distro/web/modules/referenceapplication-2.12.0-SNAPSHOT.omod
15-Sep-2021 09:18:04 [INFO] Copying htmlformentry-omod-4.1.0.jar to /home/bamboo-agent/bamboo-agent/xml-data/build-dir/REFAPP-UI-FRAMEWORK/package/target/distro/web/modules/htmlformentry-4.1.0.omod
15-Sep-2021 09:18:04 [INFO] Copying appframework-omod-2.16.0.jar to /home/bamboo-agent/bamboo-agent/xml-data/build-dir/REFAPP-UI-FRAMEWORK/package/target/distro/web/modules/appframework-2.16.0.omod
15-Sep-2021 09:18:04 [INFO] Copying referencemetadata-omod-2.12.0.jar to /home/bamboo-agent/bamboo-agent/xml-data/build-dir/REFAPP-UI-FRAMEWORK/package/target/distro/web/modules/referencemetadata-2.12.0.omod
15-Sep-2021 09:18:04 [INFO] Copying reportingui-omod-1.8.0.jar to /home/bamboo-agent/bamboo-agent/xml-data/build-dir/REFAPP-UI-FRAMEWORK/package/target/distro/web/modules/reportingui-1.8.0.omod
15-Sep-2021 09:18:04 [INFO] Copying coreapps-omod-1.34.0-SNAPSHOT.jar to /home/bamboo-agent/bamboo-agent/xml-data/build-dir/REFAPP-UI-FRAMEWORK/package/target/distro/web/modules/coreapps-1.34.0-SNAPSHOT.omod
15-Sep-2021 09:18:04 [INFO] Copying reportingcompatibility-omod-2.0.8.jar to /home/bamboo-agent/bamboo-agent/xml-data/build-dir/REFAPP-UI-FRAMEWORK/package/target/distro/web/modules/reportingcompatibility-2.0.8.omod
15-Sep-2021 09:18:04 [INFO] Copying reporting-omod-1.23.0.jar to /home/bamboo-agent/bamboo-agent/xml-data/build-dir/REFAPP-UI-FRAMEWORK/package/target/distro/web/modules/reporting-1.23.0.omod
15-Sep-2021 09:18:04 [INFO] Copying adminui-omod-1.5.0.jar to /home/bamboo-agent/bamboo-agent/xml-data/build-dir/REFAPP-UI-FRAMEWORK/package/target/distro/web/modules/adminui-1.5.0.omod
15-Sep-2021 09:18:04 [INFO] Copying registrationcore-omod-1.11.0.jar to /home/bamboo-agent/bamboo-agent/xml-data/build-dir/REFAPP-UI-FRAMEWORK/package/target/distro/web/modules/registrationcore-1.11.0.omod
15-Sep-2021 09:18:04 [INFO] Copying appointmentscheduling-omod-1.16.0.jar to /home/bamboo-agent/bamboo-agent/xml-data/build-dir/REFAPP-UI-FRAMEWORK/package/target/distro/web/modules/appointmentscheduling-1.16.0.omod
15-Sep-2021 09:18:04 [INFO] Copying atlas-omod-2.2.5.omod to /home/bamboo-agent/bamboo-agent/xml-data/build-dir/REFAPP-UI-FRAMEWORK/package/target/distro/web/modules/atlas-2.2.5.omod
15-Sep-2021 09:18:04 [INFO] Copying calculation-omod-1.3.0.jar to /home/bamboo-agent/bamboo-agent/xml-data/build-dir/REFAPP-UI-FRAMEWORK/package/target/distro/web/modules/calculation-1.3.0.omod
15-Sep-2021 09:18:04 [INFO] Copying webservices.rest-omod-2.32.0-SNAPSHOT.jar to /home/bamboo-agent/bamboo-agent/xml-data/build-dir/REFAPP-UI-FRAMEWORK/package/target/distro/web/modules/webservices.rest-2.32.0-SNAPSHOT.omod
15-Sep-2021 09:18:04 [INFO] Copying spa-omod-1.0.8.jar to /home/bamboo-agent/bamboo-agent/xml-data/build-dir/REFAPP-UI-FRAMEWORK/package/target/distro/web/modules/spa-1.0.8.omod
15-Sep-2021 09:18:04 [INFO] Copying uicommons-omod-2.18.0.jar to /home/bamboo-agent/bamboo-agent/xml-data/build-dir/REFAPP-UI-FRAMEWORK/package/target/distro/web/modules/uicommons-2.18.0.omod
15-Sep-2021 09:18:04 [INFO] Copying uiframework-omod-3.21.0.jar to /home/bamboo-agent/bamboo-agent/xml-data/build-dir/REFAPP-UI-FRAMEWORK/package/target/distro/web/modules/uiframework-3.21.0.omod
15-Sep-2021 09:18:04 [INFO] Copying metadatasharing-omod-1.8.0.jar to /home/bamboo-agent/bamboo-agent/xml-data/build-dir/REFAPP-UI-FRAMEWORK/package/target/distro/web/modules/metadatasharing-1.8.0.omod
15-Sep-2021 09:18:04
15-Sep-2021 09:18:04 Downloading OWAs...
15-Sep-2021 09:18:04
15-Sep-2021 09:18:04
15-Sep-2021 09:18:04 Downloading OWA: org.openmrs.owa:openmrs-owa-sysadmin:1.2
15-Sep-2021 09:18:04 [INFO] Configured Artifact: org.openmrs.owa:sysadmin:1.2:zip
15-Sep-2021 09:18:04 [INFO] Copying sysadmin-1.2.zip to /home/bamboo-agent/bamboo-agent/xml-data/build-dir/REFAPP-UI-FRAMEWORK/package/target/distro/web/owa/sysadmin-1.2.zip
15-Sep-2021 09:18:04
15-Sep-2021 09:18:04 Creating Docker Compose configuration...
15-Sep-2021 09:18:04
15-Sep-2021 09:18:06
15-Sep-2021 09:18:06 The 'referenceapplication' distribution created! To start up the server run 'docker-compose up' from /home/bamboo-agent/bamboo-agent/xml-data/build-dir/REFAPP-UI-FRAMEWORK/package/target/distro
15-Sep-2021 09:18:06
15-Sep-2021 09:18:06 [INFO]
15-Sep-2021 09:18:06 [INFO] --- openmrs-sdk-maven-plugin:4.0.0:build-distro (build-bundled-distro) @ referenceapplication-package ---
15-Sep-2021 09:18:06
15-Sep-2021 09:18:06 Downloading modules...
15-Sep-2021 09:18:06
15-Sep-2021 09:18:06 [INFO] Configured Artifact: org.openmrs.web:openmrs-webapp:2.4.0:war
15-Sep-2021 09:18:06 [INFO] Copying openmrs-webapp-2.4.0.war to /home/bamboo-agent/bamboo-agent/xml-data/build-dir/REFAPP-UI-FRAMEWORK/package/target/bundled-distro/web/openmrs-2.4.0.war
15-Sep-2021 09:18:06 file:/home/bamboo-agent/bamboo-agent/xml-data/build-dir/REFAPP-UI-FRAMEWORK/package/target/bundled-distro/web/openmrs-2.4.0.war
15-Sep-2021 09:18:06 target:/home/bamboo-agent/bamboo-agent/xml-data/build-dir/REFAPP-UI-FRAMEWORK/package/target/bundled-distro/web
15-Sep-2021 09:18:06 [INFO] Configured Artifact: org.openmrs.module:addresshierarchy-omod:2.14.2:jar
15-Sep-2021 09:18:06 [INFO] Configured Artifact: org.openmrs.module:legacyui-omod:1.8.3:jar
15-Sep-2021 09:18:06 [INFO] Configured Artifact: org.openmrs.module:openconceptlab-omod:1.2.6:jar
15-Sep-2021 09:18:06 [INFO] Configured Artifact: org.openmrs.module:metadatadeploy-omod:1.13.0:jar
15-Sep-2021 09:18:06 [INFO] Configured Artifact: org.openmrs.module:reportingrest-omod:1.12.0:jar
15-Sep-2021 09:18:06 [INFO] Configured Artifact: org.openmrs.module:owa-omod:1.13.0:jar
15-Sep-2021 09:18:06 [INFO] Configured Artifact: org.openmrs.module:fhir2-omod:1.2.2:jar
15-Sep-2021 09:18:06 [INFO] Configured Artifact: org.openmrs.module:serialization.xstream-omod:0.2.15:omod
15-Sep-2021 09:18:06 [INFO] Configured Artifact: org.openmrs.module:registrationapp-omod:1.24.0:jar
15-Sep-2021 09:18:06 [INFO] Configured Artifact: org.openmrs:event-omod:2.10.0-SNAPSHOT:jar
15-Sep-2021 09:18:06 [INFO] Configured Artifact: org.openmrs.module:uilibrary-omod:2.0.7:jar
15-Sep-2021 09:18:06 [INFO] Configured Artifact: org.openmrs.module:htmlwidgets-omod:1.10.0:jar
15-Sep-2021 09:18:06 [INFO] Configured Artifact: org.openmrs.module:dataexchange-omod:1.3.7:jar
15-Sep-2021 09:18:06 [INFO] Configured Artifact: org.openmrs.module:appui-omod:1.14.0:jar
15-Sep-2021 09:18:06 [INFO] Configured Artifact: org.openmrs.module:allergyui-omod:1.8.4:jar
15-Sep-2021 09:18:06 [INFO] Configured Artifact: org.openmrs.module:providermanagement-omod:2.13.0:jar
15-Sep-2021 09:18:06 [INFO] Configured Artifact: org.openmrs.module:appointmentschedulingui-omod:1.12.0:jar
15-Sep-2021 09:18:06 [INFO] Configured Artifact: org.openmrs.module:attachments-omod:2.5.0:jar
15-Sep-2021 09:18:06 [INFO] Configured Artifact: org.openmrs.module:formentryapp-omod:1.4.2:jar
15-Sep-2021 09:18:06 [INFO] Configured Artifact: org.openmrs.module:idgen-omod:4.7.0:jar
15-Sep-2021 09:18:06 [INFO] Configured Artifact: org.openmrs.module:metadatamapping-omod:1.4.0:jar
15-Sep-2021 09:18:06 [INFO] Configured Artifact: org.openmrs.module:htmlformentryui-omod:2.0.0:jar
15-Sep-2021 09:18:06 [INFO] Configured Artifact: org.openmrs.module:referencedemodata-omod:1.4.7:jar
15-Sep-2021 09:18:06 [INFO] Configured Artifact: org.openmrs.module:emrapi-omod:1.32.0:jar
15-Sep-2021 09:18:06 [INFO] Configured Artifact: org.openmrs.module:referenceapplication-omod:2.12.0-SNAPSHOT:jar
15-Sep-2021 09:18:06 [INFO] Configured Artifact: org.openmrs.module:htmlformentry-omod:4.1.0:jar
15-Sep-2021 09:18:06 [INFO] Configured Artifact: org.openmrs.module:appframework-omod:2.16.0:jar
15-Sep-2021 09:18:06 [INFO] Configured Artifact: org.openmrs.module:referencemetadata-omod:2.12.0:jar
15-Sep-2021 09:18:06 [INFO] Configured Artifact: org.openmrs.module:reportingui-omod:1.8.0:jar
15-Sep-2021 09:18:06 [INFO] Configured Artifact: org.openmrs.module:coreapps-omod:1.34.0-SNAPSHOT:jar
15-Sep-2021 09:18:06 [INFO] Configured Artifact: org.openmrs.module:reportingcompatibility-omod:2.0.8:jar
15-Sep-2021 09:18:06 [INFO] Configured Artifact: org.openmrs.module:reporting-omod:1.23.0:jar
15-Sep-2021 09:18:06 [INFO] Configured Artifact: org.openmrs.module:adminui-omod:1.5.0:jar
15-Sep-2021 09:18:06 [INFO] Configured Artifact: org.openmrs.module:registrationcore-omod:1.11.0:jar
15-Sep-2021 09:18:06 [INFO] Configured Artifact: org.openmrs.module:appointmentscheduling-omod:1.16.0:jar
15-Sep-2021 09:18:06 [INFO] Configured Artifact: org.openmrs.module:atlas-omod:2.2.5:omod
15-Sep-2021 09:18:06 [INFO] Configured Artifact: org.openmrs.module:calculation-omod:1.3.0:jar
15-Sep-2021 09:18:06 [INFO] Configured Artifact: org.openmrs.module:webservices.rest-omod:2.32.0-SNAPSHOT:jar
15-Sep-2021 09:18:06 [INFO] Configured Artifact: org.openmrs.module:spa-omod:1.0.8:jar
15-Sep-2021 09:18:06 [INFO] Configured Artifact: org.openmrs.module:uicommons-omod:2.18.0:jar
15-Sep-2021 09:18:06 [INFO] Configured Artifact: org.openmrs.module:uiframework-omod:3.21.0:jar
15-Sep-2021 09:18:06 [INFO] Configured Artifact: org.openmrs.module:metadatasharing-omod:1.8.0:jar
15-Sep-2021 09:18:06 [INFO] Copying addresshierarchy-omod-2.14.2.jar to /home/bamboo-agent/bamboo-agent/xml-data/build-dir/REFAPP-UI-FRAMEWORK/package/target/bundled-distro/web/WEB-INF/bundledModules/addresshierarchy-2.14.2.omod
15-Sep-2021 09:18:06 [INFO] Copying legacyui-omod-1.8.3.jar to /home/bamboo-agent/bamboo-agent/xml-data/build-dir/REFAPP-UI-FRAMEWORK/package/target/bundled-distro/web/WEB-INF/bundledModules/legacyui-1.8.3.omod
15-Sep-2021 09:18:06 [INFO] Copying openconceptlab-omod-1.2.6.jar to /home/bamboo-agent/bamboo-agent/xml-data/build-dir/REFAPP-UI-FRAMEWORK/package/target/bundled-distro/web/WEB-INF/bundledModules/openconceptlab-1.2.6.omod
15-Sep-2021 09:18:06 [INFO] Copying metadatadeploy-omod-1.13.0.jar to /home/bamboo-agent/bamboo-agent/xml-data/build-dir/REFAPP-UI-FRAMEWORK/package/target/bundled-distro/web/WEB-INF/bundledModules/metadatadeploy-1.13.0.omod
15-Sep-2021 09:18:06 [INFO] Copying reportingrest-omod-1.12.0.jar to /home/bamboo-agent/bamboo-agent/xml-data/build-dir/REFAPP-UI-FRAMEWORK/package/target/bundled-distro/web/WEB-INF/bundledModules/reportingrest-1.12.0.omod
15-Sep-2021 09:18:06 [INFO] Copying owa-omod-1.13.0.jar to /home/bamboo-agent/bamboo-agent/xml-data/build-dir/REFAPP-UI-FRAMEWORK/package/target/bundled-distro/web/WEB-INF/bundledModules/owa-1.13.0.omod
15-Sep-2021 09:18:06 [INFO] Copying fhir2-omod-1.2.2.jar to /home/bamboo-agent/bamboo-agent/xml-data/build-dir/REFAPP-UI-FRAMEWORK/package/target/bundled-distro/web/WEB-INF/bundledModules/fhir2-1.2.2.omod
15-Sep-2021 09:18:06 [INFO] Copying serialization.xstream-omod-0.2.15.omod to /home/bamboo-agent/bamboo-agent/xml-data/build-dir/REFAPP-UI-FRAMEWORK/package/target/bundled-distro/web/WEB-INF/bundledModules/serialization.xstream-0.2.15.omod
15-Sep-2021 09:18:06 [INFO] Copying registrationapp-omod-1.24.0.jar to /home/bamboo-agent/bamboo-agent/xml-data/build-dir/REFAPP-UI-FRAMEWORK/package/target/bundled-distro/web/WEB-INF/bundledModules/registrationapp-1.24.0.omod
15-Sep-2021 09:18:06 [INFO] Copying event-omod-2.10.0-SNAPSHOT.jar to /home/bamboo-agent/bamboo-agent/xml-data/build-dir/REFAPP-UI-FRAMEWORK/package/target/bundled-distro/web/WEB-INF/bundledModules/event-2.10.0-SNAPSHOT.omod
15-Sep-2021 09:18:06 [INFO] Copying uilibrary-omod-2.0.7.jar to /home/bamboo-agent/bamboo-agent/xml-data/build-dir/REFAPP-UI-FRAMEWORK/package/target/bundled-distro/web/WEB-INF/bundledModules/uilibrary-2.0.7.omod
15-Sep-2021 09:18:06 [INFO] Copying htmlwidgets-omod-1.10.0.jar to /home/bamboo-agent/bamboo-agent/xml-data/build-dir/REFAPP-UI-FRAMEWORK/package/target/bundled-distro/web/WEB-INF/bundledModules/htmlwidgets-1.10.0.omod
15-Sep-2021 09:18:06 [INFO] Copying dataexchange-omod-1.3.7.jar to /home/bamboo-agent/bamboo-agent/xml-data/build-dir/REFAPP-UI-FRAMEWORK/package/target/bundled-distro/web/WEB-INF/bundledModules/dataexchange-1.3.7.omod
15-Sep-2021 09:18:06 [INFO] Copying appui-omod-1.14.0.jar to /home/bamboo-agent/bamboo-agent/xml-data/build-dir/REFAPP-UI-FRAMEWORK/package/target/bundled-distro/web/WEB-INF/bundledModules/appui-1.14.0.omod
15-Sep-2021 09:18:06 [INFO] Copying allergyui-omod-1.8.4.jar to /home/bamboo-agent/bamboo-agent/xml-data/build-dir/REFAPP-UI-FRAMEWORK/package/target/bundled-distro/web/WEB-INF/bundledModules/allergyui-1.8.4.omod
15-Sep-2021 09:18:06 [INFO] Copying providermanagement-omod-2.13.0.jar to /home/bamboo-agent/bamboo-agent/xml-data/build-dir/REFAPP-UI-FRAMEWORK/package/target/bundled-distro/web/WEB-INF/bundledModules/providermanagement-2.13.0.omod
15-Sep-2021 09:18:06 [INFO] Copying appointmentschedulingui-omod-1.12.0.jar to /home/bamboo-agent/bamboo-agent/xml-data/build-dir/REFAPP-UI-FRAMEWORK/package/target/bundled-distro/web/WEB-INF/bundledModules/appointmentschedulingui-1.12.0.omod
15-Sep-2021 09:18:06 [INFO] Copying attachments-omod-2.5.0.jar to /home/bamboo-agent/bamboo-agent/xml-data/build-dir/REFAPP-UI-FRAMEWORK/package/target/bundled-distro/web/WEB-INF/bundledModules/attachments-2.5.0.omod
15-Sep-2021 09:18:06 [INFO] Copying formentryapp-omod-1.4.2.jar to /home/bamboo-agent/bamboo-agent/xml-data/build-dir/REFAPP-UI-FRAMEWORK/package/target/bundled-distro/web/WEB-INF/bundledModules/formentryapp-1.4.2.omod
15-Sep-2021 09:18:06 [INFO] Copying idgen-omod-4.7.0.jar to /home/bamboo-agent/bamboo-agent/xml-data/build-dir/REFAPP-UI-FRAMEWORK/package/target/bundled-distro/web/WEB-INF/bundledModules/idgen-4.7.0.omod
15-Sep-2021 09:18:06 [INFO] Copying metadatamapping-omod-1.4.0.jar to /home/bamboo-agent/bamboo-agent/xml-data/build-dir/REFAPP-UI-FRAMEWORK/package/target/bundled-distro/web/WEB-INF/bundledModules/metadatamapping-1.4.0.omod
15-Sep-2021 09:18:06 [INFO] Copying htmlformentryui-omod-2.0.0.jar to /home/bamboo-agent/bamboo-agent/xml-data/build-dir/REFAPP-UI-FRAMEWORK/package/target/bundled-distro/web/WEB-INF/bundledModules/htmlformentryui-2.0.0.omod
15-Sep-2021 09:18:06 [INFO] Copying referencedemodata-omod-1.4.7.jar to /home/bamboo-agent/bamboo-agent/xml-data/build-dir/REFAPP-UI-FRAMEWORK/package/target/bundled-distro/web/WEB-INF/bundledModules/referencedemodata-1.4.7.omod
15-Sep-2021 09:18:06 [INFO] Copying emrapi-omod-1.32.0.jar to /home/bamboo-agent/bamboo-agent/xml-data/build-dir/REFAPP-UI-FRAMEWORK/package/target/bundled-distro/web/WEB-INF/bundledModules/emrapi-1.32.0.omod
15-Sep-2021 09:18:06 [INFO] Copying referenceapplication-omod-2.12.0-SNAPSHOT.jar to /home/bamboo-agent/bamboo-agent/xml-data/build-dir/REFAPP-UI-FRAMEWORK/package/target/bundled-distro/web/WEB-INF/bundledModules/referenceapplication-2.12.0-SNAPSHOT.omod
15-Sep-2021 09:18:06 [INFO] Copying htmlformentry-omod-4.1.0.jar to /home/bamboo-agent/bamboo-agent/xml-data/build-dir/REFAPP-UI-FRAMEWORK/package/target/bundled-distro/web/WEB-INF/bundledModules/htmlformentry-4.1.0.omod
15-Sep-2021 09:18:06 [INFO] Copying appframework-omod-2.16.0.jar to /home/bamboo-agent/bamboo-agent/xml-data/build-dir/REFAPP-UI-FRAMEWORK/package/target/bundled-distro/web/WEB-INF/bundledModules/appframework-2.16.0.omod
15-Sep-2021 09:18:06 [INFO] Copying referencemetadata-omod-2.12.0.jar to /home/bamboo-agent/bamboo-agent/xml-data/build-dir/REFAPP-UI-FRAMEWORK/package/target/bundled-distro/web/WEB-INF/bundledModules/referencemetadata-2.12.0.omod
15-Sep-2021 09:18:06 [INFO] Copying reportingui-omod-1.8.0.jar to /home/bamboo-agent/bamboo-agent/xml-data/build-dir/REFAPP-UI-FRAMEWORK/package/target/bundled-distro/web/WEB-INF/bundledModules/reportingui-1.8.0.omod
15-Sep-2021 09:18:06 [INFO] Copying coreapps-omod-1.34.0-SNAPSHOT.jar to /home/bamboo-agent/bamboo-agent/xml-data/build-dir/REFAPP-UI-FRAMEWORK/package/target/bundled-distro/web/WEB-INF/bundledModules/coreapps-1.34.0-SNAPSHOT.omod
15-Sep-2021 09:18:06 [INFO] Copying reportingcompatibility-omod-2.0.8.jar to /home/bamboo-agent/bamboo-agent/xml-data/build-dir/REFAPP-UI-FRAMEWORK/package/target/bundled-distro/web/WEB-INF/bundledModules/reportingcompatibility-2.0.8.omod
15-Sep-2021 09:18:06 [INFO] Copying reporting-omod-1.23.0.jar to /home/bamboo-agent/bamboo-agent/xml-data/build-dir/REFAPP-UI-FRAMEWORK/package/target/bundled-distro/web/WEB-INF/bundledModules/reporting-1.23.0.omod
15-Sep-2021 09:18:06 [INFO] Copying adminui-omod-1.5.0.jar to /home/bamboo-agent/bamboo-agent/xml-data/build-dir/REFAPP-UI-FRAMEWORK/package/target/bundled-distro/web/WEB-INF/bundledModules/adminui-1.5.0.omod
15-Sep-2021 09:18:06 [INFO] Copying registrationcore-omod-1.11.0.jar to /home/bamboo-agent/bamboo-agent/xml-data/build-dir/REFAPP-UI-FRAMEWORK/package/target/bundled-distro/web/WEB-INF/bundledModules/registrationcore-1.11.0.omod
15-Sep-2021 09:18:06 [INFO] Copying appointmentscheduling-omod-1.16.0.jar to /home/bamboo-agent/bamboo-agent/xml-data/build-dir/REFAPP-UI-FRAMEWORK/package/target/bundled-distro/web/WEB-INF/bundledModules/appointmentscheduling-1.16.0.omod
15-Sep-2021 09:18:06 [INFO] Copying atlas-omod-2.2.5.omod to /home/bamboo-agent/bamboo-agent/xml-data/build-dir/REFAPP-UI-FRAMEWORK/package/target/bundled-distro/web/WEB-INF/bundledModules/atlas-2.2.5.omod
15-Sep-2021 09:18:06 [INFO] Copying calculation-omod-1.3.0.jar to /home/bamboo-agent/bamboo-agent/xml-data/build-dir/REFAPP-UI-FRAMEWORK/package/target/bundled-distro/web/WEB-INF/bundledModules/calculation-1.3.0.omod
15-Sep-2021 09:18:06 [INFO] Copying webservices.rest-omod-2.32.0-SNAPSHOT.jar to /home/bamboo-agent/bamboo-agent/xml-data/build-dir/REFAPP-UI-FRAMEWORK/package/target/bundled-distro/web/WEB-INF/bundledModules/webservices.rest-2.32.0-SNAPSHOT.omod
15-Sep-2021 09:18:06 [INFO] Copying spa-omod-1.0.8.jar to /home/bamboo-agent/bamboo-agent/xml-data/build-dir/REFAPP-UI-FRAMEWORK/package/target/bundled-distro/web/WEB-INF/bundledModules/spa-1.0.8.omod
15-Sep-2021 09:18:06 [INFO] Copying uicommons-omod-2.18.0.jar to /home/bamboo-agent/bamboo-agent/xml-data/build-dir/REFAPP-UI-FRAMEWORK/package/target/bundled-distro/web/WEB-INF/bundledModules/uicommons-2.18.0.omod
15-Sep-2021 09:18:06 [INFO] Copying uiframework-omod-3.21.0.jar to /home/bamboo-agent/bamboo-agent/xml-data/build-dir/REFAPP-UI-FRAMEWORK/package/target/bundled-distro/web/WEB-INF/bundledModules/uiframework-3.21.0.omod
15-Sep-2021 09:18:06 [INFO] Copying metadatasharing-omod-1.8.0.jar to /home/bamboo-agent/bamboo-agent/xml-data/build-dir/REFAPP-UI-FRAMEWORK/package/target/bundled-distro/web/WEB-INF/bundledModules/metadatasharing-1.8.0.omod
15-Sep-2021 09:18:06
15-Sep-2021 09:18:06 Downloading OWAs...
15-Sep-2021 09:18:06
15-Sep-2021 09:18:06
15-Sep-2021 09:18:06 Downloading OWA: org.openmrs.owa:openmrs-owa-sysadmin:1.2
15-Sep-2021 09:18:06 [INFO] Configured Artifact: org.openmrs.owa:sysadmin:1.2:zip
15-Sep-2021 09:18:06 [INFO] Copying sysadmin-1.2.zip to /home/bamboo-agent/bamboo-agent/xml-data/build-dir/REFAPP-UI-FRAMEWORK/package/target/bundled-distro/web/WEB-INF/bundledOwas/sysadmin-1.2.zip
15-Sep-2021 09:18:08
15-Sep-2021 09:18:08 Creating Docker Compose configuration...
15-Sep-2021 09:18:08
15-Sep-2021 09:18:09
15-Sep-2021 09:18:09 The 'referenceapplication' distribution created! To start up the server run 'docker-compose up' from /home/bamboo-agent/bamboo-agent/xml-data/build-dir/REFAPP-UI-FRAMEWORK/package/target/bundled-distro
15-Sep-2021 09:18:09
15-Sep-2021 09:18:09 [INFO]
15-Sep-2021 09:18:09 [INFO] --- maven-compiler-plugin:3.1:compile (default-compile) @ referenceapplication-package ---
15-Sep-2021 09:18:10 [INFO] No sources to compile
15-Sep-2021 09:18:10 [INFO]
15-Sep-2021 09:18:10 [INFO] --- maven-resources-plugin:2.6:testResources (default-testResources) @ referenceapplication-package ---
15-Sep-2021 09:18:10 [INFO] Using 'UTF-8' encoding to copy filtered resources.
15-Sep-2021 09:18:10 [INFO] skip non existing resourceDirectory /home/bamboo-agent/bamboo-agent/xml-data/build-dir/REFAPP-UI-FRAMEWORK/package/src/test/resources
15-Sep-2021 09:18:10 [INFO] skip non existing resourceDirectory /home/bamboo-agent/bamboo-agent/xml-data/build-dir/REFAPP-UI-FRAMEWORK/package/src/test/resources
15-Sep-2021 09:18:10 [INFO]
15-Sep-2021 09:18:10 [INFO] --- maven-compiler-plugin:3.1:testCompile (default-testCompile) @ referenceapplication-package ---
15-Sep-2021 09:18:10 [INFO] No sources to compile
15-Sep-2021 09:18:10 [INFO]
15-Sep-2021 09:18:10 [INFO] --- maven-surefire-plugin:2.12:test (default-test) @ referenceapplication-package ---
15-Sep-2021 09:18:10 [INFO] No tests to run.
15-Sep-2021 09:18:10 [INFO] Surefire report directory: /home/bamboo-agent/bamboo-agent/xml-data/build-dir/REFAPP-UI-FRAMEWORK/package/target/surefire-reports
15-Sep-2021 09:18:10
15-Sep-2021 09:18:10 -------------------------------------------------------
15-Sep-2021 09:18:10 T E S T S
15-Sep-2021 09:18:10 -------------------------------------------------------
15-Sep-2021 09:18:12
15-Sep-2021 09:18:12 Results :
15-Sep-2021 09:18:12
15-Sep-2021 09:18:12 Tests run: 0, Failures: 0, Errors: 0, Skipped: 0
15-Sep-2021 09:18:12
15-Sep-2021 09:18:12 [INFO]
15-Sep-2021 09:18:12 [INFO] --- maven-jar-plugin:2.4:jar (default-jar) @ referenceapplication-package ---
15-Sep-2021 09:18:12 [INFO] Building jar: /home/bamboo-agent/bamboo-agent/xml-data/build-dir/REFAPP-UI-FRAMEWORK/package/target/referenceapplication-package-2.12.0-SNAPSHOT.jar
15-Sep-2021 09:18:12 [INFO]
15-Sep-2021 09:18:12 [INFO] --- maven-assembly-plugin:2.3:single (make-assembly) @ referenceapplication-package ---
15-Sep-2021 09:18:13 [INFO] Reading assembly descriptor: /home/bamboo-agent/bamboo-agent/xml-data/build-dir/REFAPP-UI-FRAMEWORK/package/src/main/assembly/assembly.xml
15-Sep-2021 09:18:13 [INFO] Building zip: /home/bamboo-agent/bamboo-agent/xml-data/build-dir/REFAPP-UI-FRAMEWORK/package/target/referenceapplication-package-2.12.0-SNAPSHOT-addons.zip
15-Sep-2021 09:18:17 [INFO]
15-Sep-2021 09:18:17 [INFO] --- build-helper-maven-plugin:3.0.0:attach-artifact (attach-artifacts) @ referenceapplication-package ---
15-Sep-2021 09:18:17 [INFO]
15-Sep-2021 09:18:17 [INFO] --- maven-jar-plugin:2.4:test-jar (default) @ referenceapplication-package ---
15-Sep-2021 09:18:17 [WARNING] JAR will be empty - no content was marked for inclusion!
15-Sep-2021 09:18:17 [INFO] Building jar: /home/bamboo-agent/bamboo-agent/xml-data/build-dir/REFAPP-UI-FRAMEWORK/package/target/referenceapplication-package-2.12.0-SNAPSHOT-tests.jar
15-Sep-2021 09:18:17 [INFO]
15-Sep-2021 09:18:17 [INFO] --- maven-install-plugin:2.4:install (default-install) @ referenceapplication-package ---
15-Sep-2021 09:18:17 [INFO] Installing /home/bamboo-agent/bamboo-agent/xml-data/build-dir/REFAPP-UI-FRAMEWORK/package/target/referenceapplication-package-2.12.0-SNAPSHOT.jar to /home/bamboo-agent/.m2/repository/org/openmrs/distro/referenceapplication-package/2.12.0-SNAPSHOT/referenceapplication-package-2.12.0-SNAPSHOT.jar
15-Sep-2021 09:18:17 [INFO] Installing /home/bamboo-agent/bamboo-agent/xml-data/build-dir/REFAPP-UI-FRAMEWORK/package/pom.xml to /home/bamboo-agent/.m2/repository/org/openmrs/distro/referenceapplication-package/2.12.0-SNAPSHOT/referenceapplication-package-2.12.0-SNAPSHOT.pom
15-Sep-2021 09:18:17 [INFO] Installing /home/bamboo-agent/bamboo-agent/xml-data/build-dir/REFAPP-UI-FRAMEWORK/package/target/referenceapplication-package-2.12.0-SNAPSHOT-addons.zip to /home/bamboo-agent/.m2/repository/org/openmrs/distro/referenceapplication-package/2.12.0-SNAPSHOT/referenceapplication-package-2.12.0-SNAPSHOT-addons.zip
15-Sep-2021 09:18:18 [INFO] Installing /home/bamboo-agent/bamboo-agent/xml-data/build-dir/REFAPP-UI-FRAMEWORK/package/target/bundled-distro/web/openmrs.war to /home/bamboo-agent/.m2/repository/org/openmrs/distro/referenceapplication-package/2.12.0-SNAPSHOT/referenceapplication-package-2.12.0-SNAPSHOT.war
15-Sep-2021 09:18:18 [INFO] Installing /home/bamboo-agent/bamboo-agent/xml-data/build-dir/REFAPP-UI-FRAMEWORK/package/target/referenceapplication-package-2.12.0-SNAPSHOT-tests.jar to /home/bamboo-agent/.m2/repository/org/openmrs/distro/referenceapplication-package/2.12.0-SNAPSHOT/referenceapplication-package-2.12.0-SNAPSHOT-tests.jar
15-Sep-2021 09:18:18 [INFO]                                                                         
15-Sep-2021 09:18:18 [INFO] ------------------------------------------------------------------------
15-Sep-2021 09:18:18 [INFO] Building Reference Application Distribution UI Tests 2.12.0-SNAPSHOT
15-Sep-2021 09:18:18 [INFO] ------------------------------------------------------------------------
15-Sep-2021 09:18:19 [INFO]
15-Sep-2021 09:18:19 [INFO] --- maven-clean-plugin:2.5:clean (default-clean) @ referenceapplication-ui-tests ---
15-Sep-2021 09:18:19 [INFO]
15-Sep-2021 09:18:19 [INFO] --- maven-resources-plugin:2.6:resources (default-resources) @ referenceapplication-ui-tests ---
15-Sep-2021 09:18:19 [INFO] Using 'UTF-8' encoding to copy filtered resources.
15-Sep-2021 09:18:19 [INFO] skip non existing resourceDirectory /home/bamboo-agent/bamboo-agent/xml-data/build-dir/REFAPP-UI-FRAMEWORK/ui-tests/src/main/resources
15-Sep-2021 09:18:19 [INFO]
15-Sep-2021 09:18:19 [INFO] --- maven-compiler-plugin:3.1:compile (default-compile) @ referenceapplication-ui-tests ---
15-Sep-2021 09:18:19 [INFO] No sources to compile
15-Sep-2021 09:18:19 [INFO]
15-Sep-2021 09:18:19 [INFO] --- maven-resources-plugin:2.6:testResources (default-testResources) @ referenceapplication-ui-tests ---
15-Sep-2021 09:18:19 [INFO] Using 'UTF-8' encoding to copy filtered resources.
15-Sep-2021 09:18:19 [INFO] Copying 2 resources
15-Sep-2021 09:18:19 [INFO] Copying 2 resources
15-Sep-2021 09:18:19 [INFO]
15-Sep-2021 09:18:19 [INFO] --- maven-compiler-plugin:3.1:testCompile (default-testCompile) @ referenceapplication-ui-tests ---
15-Sep-2021 09:18:19 [INFO] Changes detected - recompiling the module!
15-Sep-2021 09:18:19 [INFO] Compiling 119 source files to /home/bamboo-agent/bamboo-agent/xml-data/build-dir/REFAPP-UI-FRAMEWORK/ui-tests/target/test-classes
15-Sep-2021 09:18:22 [WARNING] /home/bamboo-agent/bamboo-agent/xml-data/build-dir/REFAPP-UI-FRAMEWORK/ui-tests/src/test/java/org/openmrs/reference/AddDeleteLocationTest.java: Some input files use or override a deprecated API.
15-Sep-2021 09:18:22 [WARNING] /home/bamboo-agent/bamboo-agent/xml-data/build-dir/REFAPP-UI-FRAMEWORK/ui-tests/src/test/java/org/openmrs/reference/AddDeleteLocationTest.java: Recompile with -Xlint:deprecation for details.
15-Sep-2021 09:18:22 [WARNING] /home/bamboo-agent/bamboo-agent/xml-data/build-dir/REFAPP-UI-FRAMEWORK/ui-tests/src/test/java/org/openmrs/reference/AddRolesToUserTest.java: /home/bamboo-agent/bamboo-agent/xml-data/build-dir/REFAPP-UI-FRAMEWORK/ui-tests/src/test/java/org/openmrs/reference/AddRolesToUserTest.java uses unchecked or unsafe operations.
15-Sep-2021 09:18:22 [WARNING] /home/bamboo-agent/bamboo-agent/xml-data/build-dir/REFAPP-UI-FRAMEWORK/ui-tests/src/test/java/org/openmrs/reference/AddRolesToUserTest.java: Recompile with -Xlint:unchecked for details.
15-Sep-2021 09:18:22 [INFO]
15-Sep-2021 09:18:22 [INFO] --- maven-antrun-plugin:1.8:run (make-mac-chromedriver-executable) @ referenceapplication-ui-tests ---
15-Sep-2021 09:18:23 [INFO] Executing tasks
15-Sep-2021 09:18:23
15-Sep-2021 09:18:23 main:
15-Sep-2021 09:18:23 [INFO] An Ant BuildException has occured: /home/bamboo-agent/bamboo-agent/xml-data/build-dir/REFAPP-UI-FRAMEWORK/ui-tests/target/test-classes/chromedriver/mac does not exist.
15-Sep-2021 09:18:23 around Ant part ...<chmod file="target/test-classes/chromedriver/mac/chromedriver" perm="755"/>... @ 4:79 in /home/bamboo-agent/bamboo-agent/xml-data/build-dir/REFAPP-UI-FRAMEWORK/ui-tests/target/antrun/build-main.xml
15-Sep-2021 09:18:23 /home/bamboo-agent/bamboo-agent/xml-data/build-dir/REFAPP-UI-FRAMEWORK/ui-tests/target/antrun/build-main.xml:4: /home/bamboo-agent/bamboo-agent/xml-data/build-dir/REFAPP-UI-FRAMEWORK/ui-tests/target/test-classes/chromedriver/mac does not exist.
15-Sep-2021 09:18:23         at org.apache.tools.ant.types.AbstractFileSet.getDirectoryScanner(AbstractFileSet.java:484)
15-Sep-2021 09:18:23         at org.apache.tools.ant.taskdefs.ExecuteOn.runExec(ExecuteOn.java:369)
15-Sep-2021 09:18:23         at org.apache.tools.ant.taskdefs.ExecTask.execute(ExecTask.java:495)
15-Sep-2021 09:18:23         at org.apache.tools.ant.taskdefs.Chmod.execute(Chmod.java:181)
15-Sep-2021 09:18:23         at org.apache.tools.ant.UnknownElement.execute(UnknownElement.java:292)
15-Sep-2021 09:18:23         at sun.reflect.NativeMethodAccessorImpl.invoke0(Native Method)
15-Sep-2021 09:18:23         at sun.reflect.NativeMethodAccessorImpl.invoke(NativeMethodAccessorImpl.java:62)
15-Sep-2021 09:18:23         at sun.reflect.DelegatingMethodAccessorImpl.invoke(DelegatingMethodAccessorImpl.java:43)
15-Sep-2021 09:18:23         at java.lang.reflect.Method.invoke(Method.java:498)
15-Sep-2021 09:18:23         at org.apache.tools.ant.dispatch.DispatchUtils.execute(DispatchUtils.java:106)
15-Sep-2021 09:18:23         at org.apache.tools.ant.Task.perform(Task.java:348)
15-Sep-2021 09:18:23         at org.apache.tools.ant.Target.execute(Target.java:435)
15-Sep-2021 09:18:23         at org.apache.tools.ant.Target.performTasks(Target.java:456)
15-Sep-2021 09:18:23         at org.apache.tools.ant.Project.executeSortedTargets(Project.java:1393)
15-Sep-2021 09:18:23         at org.apache.tools.ant.Project.executeTarget(Project.java:1364)
15-Sep-2021 09:18:23         at org.apache.maven.plugin.antrun.AntRunMojo.execute(AntRunMojo.java:313)
15-Sep-2021 09:18:23         at org.apache.maven.plugin.DefaultBuildPluginManager.executeMojo(DefaultBuildPluginManager.java:134)
15-Sep-2021 09:18:23         at org.apache.maven.lifecycle.internal.MojoExecutor.execute(MojoExecutor.java:207)
15-Sep-2021 09:18:23         at org.apache.maven.lifecycle.internal.MojoExecutor.execute(MojoExecutor.java:153)
15-Sep-2021 09:18:23         at org.apache.maven.lifecycle.internal.MojoExecutor.execute(MojoExecutor.java:145)
15-Sep-2021 09:18:23         at org.apache.maven.lifecycle.internal.LifecycleModuleBuilder.buildProject(LifecycleModuleBuilder.java:116)
15-Sep-2021 09:18:23         at org.apache.maven.lifecycle.internal.LifecycleModuleBuilder.buildProject(LifecycleModuleBuilder.java:80)
15-Sep-2021 09:18:23         at org.apache.maven.lifecycle.internal.builder.singlethreaded.SingleThreadedBuilder.build(SingleThreadedBuilder.java:51)
15-Sep-2021 09:18:23         at org.apache.maven.lifecycle.internal.LifecycleStarter.execute(LifecycleStarter.java:128)
15-Sep-2021 09:18:23         at org.apache.maven.DefaultMaven.doExecute(DefaultMaven.java:307)
15-Sep-2021 09:18:23         at org.apache.maven.DefaultMaven.doExecute(DefaultMaven.java:193)
15-Sep-2021 09:18:23         at org.apache.maven.DefaultMaven.execute(DefaultMaven.java:106)
15-Sep-2021 09:18:23         at org.apache.maven.cli.MavenCli.execute(MavenCli.java:863)
15-Sep-2021 09:18:23         at org.apache.maven.cli.MavenCli.doMain(MavenCli.java:288)
15-Sep-2021 09:18:23         at org.apache.maven.cli.MavenCli.main(MavenCli.java:199)
15-Sep-2021 09:18:23         at sun.reflect.NativeMethodAccessorImpl.invoke0(Native Method)
15-Sep-2021 09:18:23         at sun.reflect.NativeMethodAccessorImpl.invoke(NativeMethodAccessorImpl.java:62)
15-Sep-2021 09:18:23         at sun.reflect.DelegatingMethodAccessorImpl.invoke(DelegatingMethodAccessorImpl.java:43)
15-Sep-2021 09:18:23         at java.lang.reflect.Method.invoke(Method.java:498)
15-Sep-2021 09:18:23         at org.codehaus.plexus.classworlds.launcher.Launcher.launchEnhanced(Launcher.java:289)
15-Sep-2021 09:18:23         at org.codehaus.plexus.classworlds.launcher.Launcher.launch(Launcher.java:229)
15-Sep-2021 09:18:23         at org.codehaus.plexus.classworlds.launcher.Launcher.mainWithExitCode(Launcher.java:415)
15-Sep-2021 09:18:23         at org.codehaus.plexus.classworlds.launcher.Launcher.main(Launcher.java:356)
15-Sep-2021 09:18:23 [INFO]
15-Sep-2021 09:18:23 [INFO] --- maven-antrun-plugin:1.8:run (make-linux-chromedriver-executable) @ referenceapplication-ui-tests ---
15-Sep-2021 09:18:23 [INFO] Executing tasks
15-Sep-2021 09:18:23
15-Sep-2021 09:18:23 main:
15-Sep-2021 09:18:23 [INFO] Executed tasks
15-Sep-2021 09:18:23 [INFO]
15-Sep-2021 09:18:23 [INFO] --- maven-antrun-plugin:1.8:run (make-mac-firefoxdriver-executable) @ referenceapplication-ui-tests ---
15-Sep-2021 09:18:23 [INFO] Executing tasks
15-Sep-2021 09:18:23
15-Sep-2021 09:18:23 main:
15-Sep-2021 09:18:23 [INFO] An Ant BuildException has occured: /home/bamboo-agent/bamboo-agent/xml-data/build-dir/REFAPP-UI-FRAMEWORK/ui-tests/target/test-classes/firefoxdriver/mac does not exist.
15-Sep-2021 09:18:23 around Ant part ...<chmod file="target/test-classes/firefoxdriver/mac/geckodriver" perm="755"/>... @ 4:79 in /home/bamboo-agent/bamboo-agent/xml-data/build-dir/REFAPP-UI-FRAMEWORK/ui-tests/target/antrun/build-main.xml
15-Sep-2021 09:18:23 /home/bamboo-agent/bamboo-agent/xml-data/build-dir/REFAPP-UI-FRAMEWORK/ui-tests/target/antrun/build-main.xml:4: /home/bamboo-agent/bamboo-agent/xml-data/build-dir/REFAPP-UI-FRAMEWORK/ui-tests/target/test-classes/firefoxdriver/mac does not exist.
15-Sep-2021 09:18:23         at org.apache.tools.ant.types.AbstractFileSet.getDirectoryScanner(AbstractFileSet.java:484)
15-Sep-2021 09:18:23         at org.apache.tools.ant.taskdefs.ExecuteOn.runExec(ExecuteOn.java:369)
15-Sep-2021 09:18:23         at org.apache.tools.ant.taskdefs.ExecTask.execute(ExecTask.java:495)
15-Sep-2021 09:18:23         at org.apache.tools.ant.taskdefs.Chmod.execute(Chmod.java:181)
15-Sep-2021 09:18:23         at org.apache.tools.ant.UnknownElement.execute(UnknownElement.java:292)
15-Sep-2021 09:18:23         at sun.reflect.NativeMethodAccessorImpl.invoke0(Native Method)
15-Sep-2021 09:18:23         at sun.reflect.NativeMethodAccessorImpl.invoke(NativeMethodAccessorImpl.java:62)
15-Sep-2021 09:18:23         at sun.reflect.DelegatingMethodAccessorImpl.invoke(DelegatingMethodAccessorImpl.java:43)
15-Sep-2021 09:18:23         at java.lang.reflect.Method.invoke(Method.java:498)
15-Sep-2021 09:18:23         at org.apache.tools.ant.dispatch.DispatchUtils.execute(DispatchUtils.java:106)
15-Sep-2021 09:18:23         at org.apache.tools.ant.Task.perform(Task.java:348)
15-Sep-2021 09:18:23         at org.apache.tools.ant.Target.execute(Target.java:435)
15-Sep-2021 09:18:23         at org.apache.tools.ant.Target.performTasks(Target.java:456)
15-Sep-2021 09:18:23         at org.apache.tools.ant.Project.executeSortedTargets(Project.java:1393)
15-Sep-2021 09:18:23         at org.apache.tools.ant.Project.executeTarget(Project.java:1364)
15-Sep-2021 09:18:23         at org.apache.maven.plugin.antrun.AntRunMojo.execute(AntRunMojo.java:313)
15-Sep-2021 09:18:23         at org.apache.maven.plugin.DefaultBuildPluginManager.executeMojo(DefaultBuildPluginManager.java:134)
15-Sep-2021 09:18:23         at org.apache.maven.lifecycle.internal.MojoExecutor.execute(MojoExecutor.java:207)
15-Sep-2021 09:18:23         at org.apache.maven.lifecycle.internal.MojoExecutor.execute(MojoExecutor.java:153)
15-Sep-2021 09:18:23         at org.apache.maven.lifecycle.internal.MojoExecutor.execute(MojoExecutor.java:145)
15-Sep-2021 09:18:23         at org.apache.maven.lifecycle.internal.LifecycleModuleBuilder.buildProject(LifecycleModuleBuilder.java:116)
15-Sep-2021 09:18:23         at org.apache.maven.lifecycle.internal.LifecycleModuleBuilder.buildProject(LifecycleModuleBuilder.java:80)
15-Sep-2021 09:18:23         at org.apache.maven.lifecycle.internal.builder.singlethreaded.SingleThreadedBuilder.build(SingleThreadedBuilder.java:51)
15-Sep-2021 09:18:23         at org.apache.maven.lifecycle.internal.LifecycleStarter.execute(LifecycleStarter.java:128)
15-Sep-2021 09:18:23         at org.apache.maven.DefaultMaven.doExecute(DefaultMaven.java:307)
15-Sep-2021 09:18:23         at org.apache.maven.DefaultMaven.doExecute(DefaultMaven.java:193)
15-Sep-2021 09:18:23         at org.apache.maven.DefaultMaven.execute(DefaultMaven.java:106)
15-Sep-2021 09:18:23         at org.apache.maven.cli.MavenCli.execute(MavenCli.java:863)
15-Sep-2021 09:18:23         at org.apache.maven.cli.MavenCli.doMain(MavenCli.java:288)
15-Sep-2021 09:18:23         at org.apache.maven.cli.MavenCli.main(MavenCli.java:199)
15-Sep-2021 09:18:23         at sun.reflect.NativeMethodAccessorImpl.invoke0(Native Method)
15-Sep-2021 09:18:23         at sun.reflect.NativeMethodAccessorImpl.invoke(NativeMethodAccessorImpl.java:62)
15-Sep-2021 09:18:23         at sun.reflect.DelegatingMethodAccessorImpl.invoke(DelegatingMethodAccessorImpl.java:43)
15-Sep-2021 09:18:23         at java.lang.reflect.Method.invoke(Method.java:498)
15-Sep-2021 09:18:23         at org.codehaus.plexus.classworlds.launcher.Launcher.launchEnhanced(Launcher.java:289)
15-Sep-2021 09:18:23         at org.codehaus.plexus.classworlds.launcher.Launcher.launch(Launcher.java:229)
15-Sep-2021 09:18:23         at org.codehaus.plexus.classworlds.launcher.Launcher.mainWithExitCode(Launcher.java:415)
15-Sep-2021 09:18:23         at org.codehaus.plexus.classworlds.launcher.Launcher.main(Launcher.java:356)
15-Sep-2021 09:18:23 [INFO]
15-Sep-2021 09:18:23 [INFO] --- maven-antrun-plugin:1.8:run (make-linux-firefoxdriver-executable) @ referenceapplication-ui-tests ---
15-Sep-2021 09:18:23 [INFO] Executing tasks
15-Sep-2021 09:18:23
15-Sep-2021 09:18:23 main:
15-Sep-2021 09:18:23 [INFO] Executed tasks
15-Sep-2021 09:18:23 [INFO]
15-Sep-2021 09:18:23 [INFO] --- maven-surefire-plugin:2.12:test (default-test) @ referenceapplication-ui-tests ---
15-Sep-2021 09:18:23 [INFO] Surefire report directory: /home/bamboo-agent/bamboo-agent/xml-data/build-dir/REFAPP-UI-FRAMEWORK/ui-tests/target/surefire-reports
15-Sep-2021 09:18:23
15-Sep-2021 09:18:23 -------------------------------------------------------
15-Sep-2021 09:18:23 T E S T S
15-Sep-2021 09:18:23 -------------------------------------------------------
15-Sep-2021 09:18:24 Running org.openmrs.reference.UnidentifiedPatientKeyboardTest
15-Sep-2021 09:18:24 Running locally...
15-Sep-2021 09:18:27 Starting ChromeDriver 90.0.4430.24 (4c6d850f087da467d926e8eddb76550aed655991-refs/branch-heads/4430@{#429}) on port 24636
15-Sep-2021 09:18:27 Only local connections are allowed.
15-Sep-2021 09:18:27 Please see https://chromedriver.chromium.org/security-considerations for suggestions on keeping ChromeDriver safe.
15-Sep-2021 09:18:27 ChromeDriver was started successfully.
15-Sep-2021 09:18:40 Sep 15, 2021 9:18:40 AM org.openqa.selenium.remote.ProtocolHandshake createSession
15-Sep-2021 09:18:40 INFO: Detected dialect: W3C
15-Sep-2021 09:18:54 Tests run: 1, Failures: 0, Errors: 0, Skipped: 0, Time elapsed: 29.745 sec
15-Sep-2021 09:18:54 Running org.openmrs.reference.DeleteAllergyTest
15-Sep-2021 09:18:54 Running locally...
15-Sep-2021 09:18:54 Starting ChromeDriver 90.0.4430.24 (4c6d850f087da467d926e8eddb76550aed655991-refs/branch-heads/4430@{#429}) on port 9551
15-Sep-2021 09:18:54 Only local connections are allowed.
15-Sep-2021 09:18:54 Please see https://chromedriver.chromium.org/security-considerations for suggestions on keeping ChromeDriver safe.
15-Sep-2021 09:18:54 ChromeDriver was started successfully.
15-Sep-2021 09:18:54 Sep 15, 2021 9:18:54 AM org.openqa.selenium.remote.ProtocolHandshake createSession
15-Sep-2021 09:18:54 INFO: Detected dialect: W3C
15-Sep-2021 09:19:03 Tests run: 1, Failures: 0, Errors: 0, Skipped: 0, Time elapsed: 9.554 sec
15-Sep-2021 09:19:03 Running org.openmrs.reference.SearchActiveVisitsTest
15-Sep-2021 09:19:03 Running locally...
15-Sep-2021 09:19:03 Starting ChromeDriver 90.0.4430.24 (4c6d850f087da467d926e8eddb76550aed655991-refs/branch-heads/4430@{#429}) on port 23889
15-Sep-2021 09:19:03 Only local connections are allowed.
15-Sep-2021 09:19:03 Please see https://chromedriver.chromium.org/security-considerations for suggestions on keeping ChromeDriver safe.
15-Sep-2021 09:19:03 ChromeDriver was started successfully.
15-Sep-2021 09:19:04 Sep 15, 2021 9:19:04 AM org.openqa.selenium.remote.ProtocolHandshake createSession
15-Sep-2021 09:19:04 INFO: Detected dialect: W3C
15-Sep-2021 09:19:09 Tests run: 1, Failures: 0, Errors: 0, Skipped: 0, Time elapsed: 5.762 sec
15-Sep-2021 09:19:09 Running org.openmrs.reference.AddVisitTypeTest
15-Sep-2021 09:19:09 Running locally...
15-Sep-2021 09:19:09 Starting ChromeDriver 90.0.4430.24 (4c6d850f087da467d926e8eddb76550aed655991-refs/branch-heads/4430@{#429}) on port 10439
15-Sep-2021 09:19:09 Only local connections are allowed.
15-Sep-2021 09:19:09 Please see https://chromedriver.chromium.org/security-considerations for suggestions on keeping ChromeDriver safe.
15-Sep-2021 09:19:09 ChromeDriver was started successfully.
15-Sep-2021 09:19:09 Sep 15, 2021 9:19:09 AM org.openqa.selenium.remote.ProtocolHandshake createSession
15-Sep-2021 09:19:09 INFO: Detected dialect: W3C
15-Sep-2021 09:19:13 Tests run: 1, Failures: 0, Errors: 0, Skipped: 0, Time elapsed: 4.38 sec
15-Sep-2021 09:19:13 Running org.openmrs.reference.FindPatientRecordTest
15-Sep-2021 09:19:13 Running locally...
15-Sep-2021 09:19:13 Starting ChromeDriver 90.0.4430.24 (4c6d850f087da467d926e8eddb76550aed655991-refs/branch-heads/4430@{#429}) on port 16630
15-Sep-2021 09:19:13 Only local connections are allowed.
15-Sep-2021 09:19:13 Please see https://chromedriver.chromium.org/security-considerations for suggestions on keeping ChromeDriver safe.
15-Sep-2021 09:19:13 ChromeDriver was started successfully.
15-Sep-2021 09:19:14 Sep 15, 2021 9:19:14 AM org.openqa.selenium.remote.ProtocolHandshake createSession
15-Sep-2021 09:19:14 INFO: Detected dialect: W3C
15-Sep-2021 09:19:18 Tests run: 1, Failures: 0, Errors: 0, Skipped: 0, Time elapsed: 4.928 sec
15-Sep-2021 09:19:18 Running org.openmrs.reference.EditPersonTest
15-Sep-2021 09:19:18 Running locally...
15-Sep-2021 09:19:18 Starting ChromeDriver 90.0.4430.24 (4c6d850f087da467d926e8eddb76550aed655991-refs/branch-heads/4430@{#429}) on port 2153
15-Sep-2021 09:19:18 Only local connections are allowed.
15-Sep-2021 09:19:18 Please see https://chromedriver.chromium.org/security-considerations for suggestions on keeping ChromeDriver safe.
15-Sep-2021 09:19:18 ChromeDriver was started successfully.
15-Sep-2021 09:19:19 Sep 15, 2021 9:19:19 AM org.openqa.selenium.remote.ProtocolHandshake createSession
15-Sep-2021 09:19:19 INFO: Detected dialect: W3C
15-Sep-2021 09:19:24 Tests run: 1, Failures: 0, Errors: 0, Skipped: 0, Time elapsed: 5.443 sec
15-Sep-2021 09:19:24 Running org.openmrs.reference.RetireLocationTest
15-Sep-2021 09:19:24 Running locally...
15-Sep-2021 09:19:24 Starting ChromeDriver 90.0.4430.24 (4c6d850f087da467d926e8eddb76550aed655991-refs/branch-heads/4430@{#429}) on port 21593
15-Sep-2021 09:19:24 Only local connections are allowed.
15-Sep-2021 09:19:24 Please see https://chromedriver.chromium.org/security-considerations for suggestions on keeping ChromeDriver safe.
15-Sep-2021 09:19:24 ChromeDriver was started successfully.
15-Sep-2021 09:19:24 Sep 15, 2021 9:19:24 AM org.openqa.selenium.remote.ProtocolHandshake createSession
15-Sep-2021 09:19:24 INFO: Detected dialect: W3C
15-Sep-2021 09:19:27 Tests run: 1, Failures: 0, Errors: 0, Skipped: 0, Time elapsed: 3.451 sec
15-Sep-2021 09:19:27 Running org.openmrs.reference.XSSOnPhoneNumberFieldTest
15-Sep-2021 09:19:27 Running locally...
15-Sep-2021 09:19:27 Starting ChromeDriver 90.0.4430.24 (4c6d850f087da467d926e8eddb76550aed655991-refs/branch-heads/4430@{#429}) on port 1475
15-Sep-2021 09:19:27 Only local connections are allowed.
15-Sep-2021 09:19:27 Please see https://chromedriver.chromium.org/security-considerations for suggestions on keeping ChromeDriver safe.
15-Sep-2021 09:19:27 ChromeDriver was started successfully.
15-Sep-2021 09:19:27 Sep 15, 2021 9:19:27 AM org.openqa.selenium.remote.ProtocolHandshake createSession
15-Sep-2021 09:19:27 INFO: Detected dialect: W3C
15-Sep-2021 09:19:38 Tests run: 1, Failures: 0, Errors: 0, Skipped: 0, Time elapsed: 10.605 sec
15-Sep-2021 09:19:38 Running org.openmrs.reference.TransferToWardServiceTest
15-Sep-2021 09:19:38 Running locally...
15-Sep-2021 09:19:38 Starting ChromeDriver 90.0.4430.24 (4c6d850f087da467d926e8eddb76550aed655991-refs/branch-heads/4430@{#429}) on port 5037
15-Sep-2021 09:19:38 Only local connections are allowed.
15-Sep-2021 09:19:38 Please see https://chromedriver.chromium.org/security-considerations for suggestions on keeping ChromeDriver safe.
15-Sep-2021 09:19:38 ChromeDriver was started successfully.
15-Sep-2021 09:19:39 Sep 15, 2021 9:19:39 AM org.openqa.selenium.remote.ProtocolHandshake createSession
15-Sep-2021 09:19:39 INFO: Detected dialect: W3C
15-Sep-2021 09:19:53 Tests run: 1, Failures: 0, Errors: 0, Skipped: 0, Time elapsed: 15.254 sec
15-Sep-2021 09:19:53 Running org.openmrs.reference.EditVisitTypeTest
15-Sep-2021 09:19:53 Running locally...
15-Sep-2021 09:19:53 Starting ChromeDriver 90.0.4430.24 (4c6d850f087da467d926e8eddb76550aed655991-refs/branch-heads/4430@{#429}) on port 17284
15-Sep-2021 09:19:53 Only local connections are allowed.
15-Sep-2021 09:19:53 Please see https://chromedriver.chromium.org/security-considerations for suggestions on keeping ChromeDriver safe.
15-Sep-2021 09:19:53 ChromeDriver was started successfully.
15-Sep-2021 09:19:54 Sep 15, 2021 9:19:54 AM org.openqa.selenium.remote.ProtocolHandshake createSession
15-Sep-2021 09:19:54 INFO: Detected dialect: W3C
15-Sep-2021 09:19:58 Tests run: 1, Failures: 0, Errors: 0, Skipped: 0, Time elapsed: 4.319 sec
15-Sep-2021 09:19:58 Running org.openmrs.reference.ComeBackToApplicationAfterLogoutTest
15-Sep-2021 09:19:58 Running locally...
15-Sep-2021 09:19:58 Starting ChromeDriver 90.0.4430.24 (4c6d850f087da467d926e8eddb76550aed655991-refs/branch-heads/4430@{#429}) on port 7345
15-Sep-2021 09:19:58 Only local connections are allowed.
15-Sep-2021 09:19:58 Please see https://chromedriver.chromium.org/security-considerations for suggestions on keeping ChromeDriver safe.
15-Sep-2021 09:19:58 ChromeDriver was started successfully.
15-Sep-2021 09:19:58 Sep 15, 2021 9:19:58 AM org.openqa.selenium.remote.ProtocolHandshake createSession
15-Sep-2021 09:19:58 INFO: Detected dialect: W3C
15-Sep-2021 09:20:00 Tests run: 1, Failures: 0, Errors: 0, Skipped: 0, Time elapsed: 2.138 sec
15-Sep-2021 09:20:00 Running org.openmrs.reference.EditDemographicTest
15-Sep-2021 09:20:00 Running locally...
15-Sep-2021 09:20:00 Starting ChromeDriver 90.0.4430.24 (4c6d850f087da467d926e8eddb76550aed655991-refs/branch-heads/4430@{#429}) on port 13060
15-Sep-2021 09:20:00 Only local connections are allowed.
15-Sep-2021 09:20:00 Please see https://chromedriver.chromium.org/security-considerations for suggestions on keeping ChromeDriver safe.
15-Sep-2021 09:20:00 ChromeDriver was started successfully.
15-Sep-2021 09:20:00 Sep 15, 2021 9:20:00 AM org.openqa.selenium.remote.ProtocolHandshake createSession
15-Sep-2021 09:20:00 INFO: Detected dialect: W3C
15-Sep-2021 09:20:09 Tests run: 1, Failures: 0, Errors: 0, Skipped: 0, Time elapsed: 9.518 sec
15-Sep-2021 09:20:09 Running org.openmrs.reference.DeleteVisitTypeTest
15-Sep-2021 09:20:09 Running locally...
15-Sep-2021 09:20:09 Starting ChromeDriver 90.0.4430.24 (4c6d850f087da467d926e8eddb76550aed655991-refs/branch-heads/4430@{#429}) on port 28060
15-Sep-2021 09:20:09 Only local connections are allowed.
15-Sep-2021 09:20:09 Please see https://chromedriver.chromium.org/security-considerations for suggestions on keeping ChromeDriver safe.
15-Sep-2021 09:20:09 ChromeDriver was started successfully.
15-Sep-2021 09:20:09 Sep 15, 2021 9:20:09 AM org.openqa.selenium.remote.ProtocolHandshake createSession
15-Sep-2021 09:20:09 INFO: Detected dialect: W3C
15-Sep-2021 09:20:13 Tests run: 1, Failures: 0, Errors: 0, Skipped: 0, Time elapsed: 3.65 sec
15-Sep-2021 09:20:13 Running org.openmrs.reference.FormTest
15-Sep-2021 09:20:13 Running locally...
15-Sep-2021 09:20:13 Starting ChromeDriver 90.0.4430.24 (4c6d850f087da467d926e8eddb76550aed655991-refs/branch-heads/4430@{#429}) on port 21666
15-Sep-2021 09:20:13 Only local connections are allowed.
15-Sep-2021 09:20:13 Please see https://chromedriver.chromium.org/security-considerations for suggestions on keeping ChromeDriver safe.
15-Sep-2021 09:20:13 ChromeDriver was started successfully.
15-Sep-2021 09:20:13 Sep 15, 2021 9:20:13 AM org.openqa.selenium.remote.ProtocolHandshake createSession
15-Sep-2021 09:20:13 INFO: Detected dialect: W3C
15-Sep-2021 09:20:19 Running locally...
15-Sep-2021 09:20:19 Starting ChromeDriver 90.0.4430.24 (4c6d850f087da467d926e8eddb76550aed655991-refs/branch-heads/4430@{#429}) on port 17633
15-Sep-2021 09:20:19 Only local connections are allowed.
15-Sep-2021 09:20:19 Please see https://chromedriver.chromium.org/security-considerations for suggestions on keeping ChromeDriver safe.
15-Sep-2021 09:20:19 ChromeDriver was started successfully.
15-Sep-2021 09:20:19 Sep 15, 2021 9:20:19 AM org.openqa.selenium.remote.ProtocolHandshake createSession
15-Sep-2021 09:20:19 INFO: Detected dialect: W3C
15-Sep-2021 09:20:26 Running locally...
15-Sep-2021 09:20:26 Starting ChromeDriver 90.0.4430.24 (4c6d850f087da467d926e8eddb76550aed655991-refs/branch-heads/4430@{#429}) on port 22309
15-Sep-2021 09:20:26 Only local connections are allowed.
15-Sep-2021 09:20:26 Please see https://chromedriver.chromium.org/security-considerations for suggestions on keeping ChromeDriver safe.
15-Sep-2021 09:20:26 ChromeDriver was started successfully.
15-Sep-2021 09:20:26 Sep 15, 2021 9:20:26 AM org.openqa.selenium.remote.ProtocolHandshake createSession
15-Sep-2021 09:20:26 INFO: Detected dialect: W3C
15-Sep-2021 09:20:31 Running locally...
15-Sep-2021 09:20:31 Starting ChromeDriver 90.0.4430.24 (4c6d850f087da467d926e8eddb76550aed655991-refs/branch-heads/4430@{#429}) on port 27895
15-Sep-2021 09:20:31 Only local connections are allowed.
15-Sep-2021 09:20:31 Please see https://chromedriver.chromium.org/security-considerations for suggestions on keeping ChromeDriver safe.
15-Sep-2021 09:20:31 ChromeDriver was started successfully.
15-Sep-2021 09:20:31 Sep 15, 2021 9:20:31 AM org.openqa.selenium.remote.ProtocolHandshake createSession
15-Sep-2021 09:20:31 INFO: Detected dialect: W3C
15-Sep-2021 09:20:36 Tests run: 4, Failures: 0, Errors: 0, Skipped: 0, Time elapsed: 22.951 sec
15-Sep-2021 09:20:36 Running org.openmrs.reference.RegisterUnidentifiedPatientTest
15-Sep-2021 09:20:36 Running locally...
15-Sep-2021 09:20:36 Starting ChromeDriver 90.0.4430.24 (4c6d850f087da467d926e8eddb76550aed655991-refs/branch-heads/4430@{#429}) on port 9348
15-Sep-2021 09:20:36 Only local connections are allowed.
15-Sep-2021 09:20:36 Please see https://chromedriver.chromium.org/security-considerations for suggestions on keeping ChromeDriver safe.
15-Sep-2021 09:20:36 ChromeDriver was started successfully.
15-Sep-2021 09:20:36 Sep 15, 2021 9:20:36 AM org.openqa.selenium.remote.ProtocolHandshake createSession
15-Sep-2021 09:20:36 INFO: Detected dialect: W3C
15-Sep-2021 09:20:42 Tests run: 1, Failures: 0, Errors: 0, Skipped: 0, Time elapsed: 5.931 sec
15-Sep-2021 09:20:42 Running org.openmrs.reference.AddPatientAppointmentTest
15-Sep-2021 09:20:42 Running locally...
15-Sep-2021 09:20:42 Starting ChromeDriver 90.0.4430.24 (4c6d850f087da467d926e8eddb76550aed655991-refs/branch-heads/4430@{#429}) on port 18689
15-Sep-2021 09:20:42 Only local connections are allowed.
15-Sep-2021 09:20:42 Please see https://chromedriver.chromium.org/security-considerations for suggestions on keeping ChromeDriver safe.
15-Sep-2021 09:20:42 ChromeDriver was started successfully.
15-Sep-2021 09:20:42 Sep 15, 2021 9:20:42 AM org.openqa.selenium.remote.ProtocolHandshake createSession
15-Sep-2021 09:20:42 INFO: Detected dialect: W3C
15-Sep-2021 09:20:57 Tests run: 1, Failures: 0, Errors: 0, Skipped: 0, Time elapsed: 15.43 sec
15-Sep-2021 09:20:57 Running org.openmrs.reference.AdmitExitInpatientTest
15-Sep-2021 09:20:57 Running locally...
15-Sep-2021 09:20:57 Starting ChromeDriver 90.0.4430.24 (4c6d850f087da467d926e8eddb76550aed655991-refs/branch-heads/4430@{#429}) on port 32512
15-Sep-2021 09:20:57 Only local connections are allowed.
15-Sep-2021 09:20:57 Please see https://chromedriver.chromium.org/security-considerations for suggestions on keeping ChromeDriver safe.
15-Sep-2021 09:20:57 ChromeDriver was started successfully.
15-Sep-2021 09:20:58 Sep 15, 2021 9:20:58 AM org.openqa.selenium.remote.ProtocolHandshake createSession
15-Sep-2021 09:20:58 INFO: Detected dialect: W3C
15-Sep-2021 09:21:12 Tests run: 1, Failures: 0, Errors: 0, Skipped: 0, Time elapsed: 14.451 sec
15-Sep-2021 09:21:12 Running org.openmrs.reference.DeleteRequestAppointmentTest
15-Sep-2021 09:21:12 Running locally...
15-Sep-2021 09:21:12 Starting ChromeDriver 90.0.4430.24 (4c6d850f087da467d926e8eddb76550aed655991-refs/branch-heads/4430@{#429}) on port 15242
15-Sep-2021 09:21:12 Only local connections are allowed.
15-Sep-2021 09:21:12 Please see https://chromedriver.chromium.org/security-considerations for suggestions on keeping ChromeDriver safe.
15-Sep-2021 09:21:12 ChromeDriver was started successfully.
15-Sep-2021 09:21:12 Sep 15, 2021 9:21:12 AM org.openqa.selenium.remote.ProtocolHandshake createSession
15-Sep-2021 09:21:12 INFO: Detected dialect: W3C
15-Sep-2021 09:21:27 Tests run: 1, Failures: 0, Errors: 0, Skipped: 0, Time elapsed: 15.436 sec
15-Sep-2021 09:21:27 Running org.openmrs.reference.EditAllergyTest
15-Sep-2021 09:21:27 Running locally...
15-Sep-2021 09:21:27 Starting ChromeDriver 90.0.4430.24 (4c6d850f087da467d926e8eddb76550aed655991-refs/branch-heads/4430@{#429}) on port 26075
15-Sep-2021 09:21:27 Only local connections are allowed.
15-Sep-2021 09:21:27 Please see https://chromedriver.chromium.org/security-considerations for suggestions on keeping ChromeDriver safe.
15-Sep-2021 09:21:27 ChromeDriver was started successfully.
15-Sep-2021 09:21:27 Sep 15, 2021 9:21:27 AM org.openqa.selenium.remote.ProtocolHandshake createSession
15-Sep-2021 09:21:27 INFO: Detected dialect: W3C
15-Sep-2021 09:21:37 Tests run: 1, Failures: 0, Errors: 0, Skipped: 0, Time elapsed: 9.638 sec
15-Sep-2021 09:21:37 Running org.openmrs.reference.VisitNoteTest
15-Sep-2021 09:21:37 Running locally...
15-Sep-2021 09:21:37 Starting ChromeDriver 90.0.4430.24 (4c6d850f087da467d926e8eddb76550aed655991-refs/branch-heads/4430@{#429}) on port 22232
15-Sep-2021 09:21:37 Only local connections are allowed.
15-Sep-2021 09:21:37 Please see https://chromedriver.chromium.org/security-considerations for suggestions on keeping ChromeDriver safe.
15-Sep-2021 09:21:37 ChromeDriver was started successfully.
15-Sep-2021 09:21:37 Sep 15, 2021 9:21:37 AM org.openqa.selenium.remote.ProtocolHandshake createSession
15-Sep-2021 09:21:37 INFO: Detected dialect: W3C
15-Sep-2021 09:22:02 Tests run: 1, Failures: 0, Errors: 0, Skipped: 0, Time elapsed: 25.007 sec
15-Sep-2021 09:22:02 Running org.openmrs.reference.CreatePersonTest
15-Sep-2021 09:22:02 Running locally...
15-Sep-2021 09:22:02 Starting ChromeDriver 90.0.4430.24 (4c6d850f087da467d926e8eddb76550aed655991-refs/branch-heads/4430@{#429}) on port 25691
15-Sep-2021 09:22:02 Only local connections are allowed.
15-Sep-2021 09:22:02 Please see https://chromedriver.chromium.org/security-considerations for suggestions on keeping ChromeDriver safe.
15-Sep-2021 09:22:02 ChromeDriver was started successfully.
15-Sep-2021 09:22:02 Sep 15, 2021 9:22:02 AM org.openqa.selenium.remote.ProtocolHandshake createSession
15-Sep-2021 09:22:02 INFO: Detected dialect: W3C
15-Sep-2021 09:22:07 Tests run: 1, Failures: 0, Errors: 0, Skipped: 0, Time elapsed: 4.943 sec
15-Sep-2021 09:22:07 Running org.openmrs.reference.FindPatientByNameTest
15-Sep-2021 09:22:07 Running locally...
15-Sep-2021 09:22:07 Starting ChromeDriver 90.0.4430.24 (4c6d850f087da467d926e8eddb76550aed655991-refs/branch-heads/4430@{#429}) on port 8489
15-Sep-2021 09:22:07 Only local connections are allowed.
15-Sep-2021 09:22:07 Please see https://chromedriver.chromium.org/security-considerations for suggestions on keeping ChromeDriver safe.
15-Sep-2021 09:22:07 ChromeDriver was started successfully.
15-Sep-2021 09:22:07 Sep 15, 2021 9:22:07 AM org.openqa.selenium.remote.ProtocolHandshake createSession
15-Sep-2021 09:22:07 INFO: Detected dialect: W3C
15-Sep-2021 09:22:14 Tests run: 1, Failures: 0, Errors: 0, Skipped: 0, Time elapsed: 7.406 sec
15-Sep-2021 09:22:14 Running org.openmrs.reference.AddUserTest
15-Sep-2021 09:22:14 Running locally...
15-Sep-2021 09:22:14 Starting ChromeDriver 90.0.4430.24 (4c6d850f087da467d926e8eddb76550aed655991-refs/branch-heads/4430@{#429}) on port 26093
15-Sep-2021 09:22:14 Only local connections are allowed.
15-Sep-2021 09:22:14 Please see https://chromedriver.chromium.org/security-considerations for suggestions on keeping ChromeDriver safe.
15-Sep-2021 09:22:14 ChromeDriver was started successfully.
15-Sep-2021 09:22:14 Sep 15, 2021 9:22:14 AM org.openqa.selenium.remote.ProtocolHandshake createSession
15-Sep-2021 09:22:14 INFO: Detected dialect: W3C
15-Sep-2021 09:22:25 Tests run: 1, Failures: 0, Errors: 0, Skipped: 0, Time elapsed: 10.478 sec
15-Sep-2021 09:22:25 Running org.openmrs.reference.AddProviderTest
15-Sep-2021 09:22:25 Running locally...
15-Sep-2021 09:22:25 Starting ChromeDriver 90.0.4430.24 (4c6d850f087da467d926e8eddb76550aed655991-refs/branch-heads/4430@{#429}) on port 32299
15-Sep-2021 09:22:25 Only local connections are allowed.
15-Sep-2021 09:22:25 Please see https://chromedriver.chromium.org/security-considerations for suggestions on keeping ChromeDriver safe.
15-Sep-2021 09:22:25 ChromeDriver was started successfully.
15-Sep-2021 09:22:25 Sep 15, 2021 9:22:25 AM org.openqa.selenium.remote.ProtocolHandshake createSession
15-Sep-2021 09:22:25 INFO: Detected dialect: W3C
15-Sep-2021 09:22:31 Tests run: 1, Failures: 0, Errors: 0, Skipped: 0, Time elapsed: 6.726 sec
15-Sep-2021 09:22:31 Running org.openmrs.reference.AddPastVisitTest
15-Sep-2021 09:22:31 Running locally...
15-Sep-2021 09:22:31 Starting ChromeDriver 90.0.4430.24 (4c6d850f087da467d926e8eddb76550aed655991-refs/branch-heads/4430@{#429}) on port 31119
15-Sep-2021 09:22:31 Only local connections are allowed.
15-Sep-2021 09:22:31 Please see https://chromedriver.chromium.org/security-considerations for suggestions on keeping ChromeDriver safe.
15-Sep-2021 09:22:31 ChromeDriver was started successfully.
15-Sep-2021 09:22:32 Sep 15, 2021 9:22:32 AM org.openqa.selenium.remote.ProtocolHandshake createSession
15-Sep-2021 09:22:32 INFO: Detected dialect: W3C
15-Sep-2021 09:22:41 Tests run: 1, Failures: 0, Errors: 0, Skipped: 0, Time elapsed: 9.446 sec
15-Sep-2021 09:22:41 Running org.openmrs.reference.RecordMergeIssueTest
15-Sep-2021 09:22:41 Running locally...
15-Sep-2021 09:22:41 Starting ChromeDriver 90.0.4430.24 (4c6d850f087da467d926e8eddb76550aed655991-refs/branch-heads/4430@{#429}) on port 1367
15-Sep-2021 09:22:41 Only local connections are allowed.
15-Sep-2021 09:22:41 Please see https://chromedriver.chromium.org/security-considerations for suggestions on keeping ChromeDriver safe.
15-Sep-2021 09:22:41 ChromeDriver was started successfully.
15-Sep-2021 09:22:41 Sep 15, 2021 9:22:41 AM org.openqa.selenium.remote.ProtocolHandshake createSession
15-Sep-2021 09:22:41 INFO: Detected dialect: W3C
15-Sep-2021 09:22:53 Tests run: 1, Failures: 0, Errors: 0, Skipped: 0, Time elapsed: 12.074 sec
15-Sep-2021 09:22:53 Running org.openmrs.reference.CaptureVitalsTest
15-Sep-2021 09:22:53 Running locally...
15-Sep-2021 09:22:53 Starting ChromeDriver 90.0.4430.24 (4c6d850f087da467d926e8eddb76550aed655991-refs/branch-heads/4430@{#429}) on port 11322
15-Sep-2021 09:22:53 Only local connections are allowed.
15-Sep-2021 09:22:53 Please see https://chromedriver.chromium.org/security-considerations for suggestions on keeping ChromeDriver safe.
15-Sep-2021 09:22:53 ChromeDriver was started successfully.
15-Sep-2021 09:22:53 Sep 15, 2021 9:22:53 AM org.openqa.selenium.remote.ProtocolHandshake createSession
15-Sep-2021 09:22:53 INFO: Detected dialect: W3C
15-Sep-2021 09:23:04 Tests run: 1, Failures: 0, Errors: 0, Skipped: 0, Time elapsed: 11.098 sec
15-Sep-2021 09:23:04 Running org.openmrs.reference.NamePatientAccentedLetterTest
15-Sep-2021 09:23:04 Running locally...
15-Sep-2021 09:23:04 Starting ChromeDriver 90.0.4430.24 (4c6d850f087da467d926e8eddb76550aed655991-refs/branch-heads/4430@{#429}) on port 3566
15-Sep-2021 09:23:04 Only local connections are allowed.
15-Sep-2021 09:23:04 Please see https://chromedriver.chromium.org/security-considerations for suggestions on keeping ChromeDriver safe.
15-Sep-2021 09:23:04 ChromeDriver was started successfully.
15-Sep-2021 09:23:04 Sep 15, 2021 9:23:04 AM org.openqa.selenium.remote.ProtocolHandshake createSession
15-Sep-2021 09:23:04 INFO: Detected dialect: W3C
15-Sep-2021 09:23:12 Tests run: 1, Failures: 0, Errors: 0, Skipped: 0, Time elapsed: 7.595 sec
15-Sep-2021 09:23:12 Running org.openmrs.reference.RetirePersonTest
15-Sep-2021 09:23:12 Running locally...
15-Sep-2021 09:23:12 Starting ChromeDriver 90.0.4430.24 (4c6d850f087da467d926e8eddb76550aed655991-refs/branch-heads/4430@{#429}) on port 26508
15-Sep-2021 09:23:12 Only local connections are allowed.
15-Sep-2021 09:23:12 Please see https://chromedriver.chromium.org/security-considerations for suggestions on keeping ChromeDriver safe.
15-Sep-2021 09:23:12 ChromeDriver was started successfully.
15-Sep-2021 09:23:12 Sep 15, 2021 9:23:12 AM org.openqa.selenium.remote.ProtocolHandshake createSession
15-Sep-2021 09:23:12 INFO: Detected dialect: W3C
15-Sep-2021 09:23:17 Tests run: 1, Failures: 0, Errors: 0, Skipped: 0, Time elapsed: 5.15 sec
15-Sep-2021 09:23:17 Running org.openmrs.reference.EndVisitTest
15-Sep-2021 09:23:17 Running locally...
15-Sep-2021 09:23:17 Starting ChromeDriver 90.0.4430.24 (4c6d850f087da467d926e8eddb76550aed655991-refs/branch-heads/4430@{#429}) on port 11231
15-Sep-2021 09:23:17 Only local connections are allowed.
15-Sep-2021 09:23:17 Please see https://chromedriver.chromium.org/security-considerations for suggestions on keeping ChromeDriver safe.
15-Sep-2021 09:23:17 ChromeDriver was started successfully.
15-Sep-2021 09:23:17 Sep 15, 2021 9:23:17 AM org.openqa.selenium.remote.ProtocolHandshake createSession
15-Sep-2021 09:23:17 INFO: Detected dialect: W3C
15-Sep-2021 09:23:27 Tests run: 1, Failures: 0, Errors: 0, Skipped: 0, Time elapsed: 10.692 sec
15-Sep-2021 09:23:27 Running org.openmrs.reference.DeleteAppointmentBlockTest
15-Sep-2021 09:23:27 Running locally...
15-Sep-2021 09:23:27 Starting ChromeDriver 90.0.4430.24 (4c6d850f087da467d926e8eddb76550aed655991-refs/branch-heads/4430@{#429}) on port 30825
15-Sep-2021 09:23:27 Only local connections are allowed.
15-Sep-2021 09:23:27 Please see https://chromedriver.chromium.org/security-considerations for suggestions on keeping ChromeDriver safe.
15-Sep-2021 09:23:27 ChromeDriver was started successfully.
15-Sep-2021 09:23:28 Sep 15, 2021 9:23:28 AM org.openqa.selenium.remote.ProtocolHandshake createSession
15-Sep-2021 09:23:28 INFO: Detected dialect: W3C
15-Sep-2021 09:23:33 Tests run: 1, Failures: 0, Errors: 0, Skipped: 0, Time elapsed: 5.735 sec
15-Sep-2021 09:23:33 Running org.openmrs.reference.BookRequestAppointmentTest
15-Sep-2021 09:23:33 Running locally...
15-Sep-2021 09:23:33 Starting ChromeDriver 90.0.4430.24 (4c6d850f087da467d926e8eddb76550aed655991-refs/branch-heads/4430@{#429}) on port 21140
15-Sep-2021 09:23:33 Only local connections are allowed.
15-Sep-2021 09:23:33 Please see https://chromedriver.chromium.org/security-considerations for suggestions on keeping ChromeDriver safe.
15-Sep-2021 09:23:33 ChromeDriver was started successfully.
15-Sep-2021 09:23:33 Sep 15, 2021 9:23:33 AM org.openqa.selenium.remote.ProtocolHandshake createSession
15-Sep-2021 09:23:33 INFO: Detected dialect: W3C
15-Sep-2021 09:23:52 Tests run: 1, Failures: 0, Errors: 0, Skipped: 0, Time elapsed: 19.332 sec
15-Sep-2021 09:23:52 Running org.openmrs.reference.AddDeleteServiceTest
15-Sep-2021 09:23:52 Running locally...
15-Sep-2021 09:23:52 Starting ChromeDriver 90.0.4430.24 (4c6d850f087da467d926e8eddb76550aed655991-refs/branch-heads/4430@{#429}) on port 9021
15-Sep-2021 09:23:52 Only local connections are allowed.
15-Sep-2021 09:23:52 Please see https://chromedriver.chromium.org/security-considerations for suggestions on keeping ChromeDriver safe.
15-Sep-2021 09:23:52 ChromeDriver was started successfully.
15-Sep-2021 09:23:53 Sep 15, 2021 9:23:53 AM org.openqa.selenium.remote.ProtocolHandshake createSession
15-Sep-2021 09:23:53 INFO: Detected dialect: W3C
15-Sep-2021 09:23:58 Tests run: 1, Failures: 0, Errors: 0, Skipped: 0, Time elapsed: 5.642 sec
15-Sep-2021 09:23:58 Running org.openmrs.reference.AddEditAppointmentBlockTest
15-Sep-2021 09:23:58 Running locally...
15-Sep-2021 09:23:58 Starting ChromeDriver 90.0.4430.24 (4c6d850f087da467d926e8eddb76550aed655991-refs/branch-heads/4430@{#429}) on port 4997
15-Sep-2021 09:23:58 Only local connections are allowed.
15-Sep-2021 09:23:58 Please see https://chromedriver.chromium.org/security-considerations for suggestions on keeping ChromeDriver safe.
15-Sep-2021 09:23:58 ChromeDriver was started successfully.
15-Sep-2021 09:23:58 Sep 15, 2021 9:23:58 AM org.openqa.selenium.remote.ProtocolHandshake createSession
15-Sep-2021 09:23:58 INFO: Detected dialect: W3C
15-Sep-2021 09:24:05 Tests run: 1, Failures: 0, Errors: 0, Skipped: 0, Time elapsed: 6.98 sec
15-Sep-2021 09:24:05 Running org.openmrs.reference.RetireProviderTest
15-Sep-2021 09:24:05 Running locally...
15-Sep-2021 09:24:05 Starting ChromeDriver 90.0.4430.24 (4c6d850f087da467d926e8eddb76550aed655991-refs/branch-heads/4430@{#429}) on port 10447
15-Sep-2021 09:24:05 Only local connections are allowed.
15-Sep-2021 09:24:05 Please see https://chromedriver.chromium.org/security-considerations for suggestions on keeping ChromeDriver safe.
15-Sep-2021 09:24:05 ChromeDriver was started successfully.
15-Sep-2021 09:24:05 Sep 15, 2021 9:24:05 AM org.openqa.selenium.remote.ProtocolHandshake createSession
15-Sep-2021 09:24:05 INFO: Detected dialect: W3C
15-Sep-2021 09:24:10 Tests run: 1, Failures: 0, Errors: 0, Skipped: 0, Time elapsed: 5.02 sec
15-Sep-2021 09:24:10 Running org.openmrs.reference.MergePatientTest
15-Sep-2021 09:24:10 Running locally...
15-Sep-2021 09:24:10 Starting ChromeDriver 90.0.4430.24 (4c6d850f087da467d926e8eddb76550aed655991-refs/branch-heads/4430@{#429}) on port 23192
15-Sep-2021 09:24:10 Only local connections are allowed.
15-Sep-2021 09:24:10 Please see https://chromedriver.chromium.org/security-considerations for suggestions on keeping ChromeDriver safe.
15-Sep-2021 09:24:10 ChromeDriver was started successfully.
15-Sep-2021 09:24:10 Sep 15, 2021 9:24:10 AM org.openqa.selenium.remote.ProtocolHandshake createSession
15-Sep-2021 09:24:10 INFO: Detected dialect: W3C
15-Sep-2021 09:26:18 Tests run: 3, Failures: 0, Errors: 3, Skipped: 0, Time elapsed: 127.444 sec <<< FAILURE!
15-Sep-2021 09:26:18 Running org.openmrs.reference.AddDeleteLocationTest
15-Sep-2021 09:26:18 Running locally...
15-Sep-2021 09:26:18 Starting ChromeDriver 90.0.4430.24 (4c6d850f087da467d926e8eddb76550aed655991-refs/branch-heads/4430@{#429}) on port 5212
15-Sep-2021 09:26:18 Only local connections are allowed.
15-Sep-2021 09:26:18 Please see https://chromedriver.chromium.org/security-considerations for suggestions on keeping ChromeDriver safe.
15-Sep-2021 09:26:18 ChromeDriver was started successfully.
15-Sep-2021 09:26:18 Sep 15, 2021 9:26:18 AM org.openqa.selenium.remote.ProtocolHandshake createSession
15-Sep-2021 09:26:18 INFO: Detected dialect: W3C
15-Sep-2021 09:28:19 Failed to login in AddDeleteLocationTest.addLocationTest, trying again...
15-Sep-2021 09:28:50 Test killed due to server failure in AddDeleteLocationTest.addLocationTest
15-Sep-2021 09:28:50 org.openmrs.uitestframework.page.exception.PageRejectedException: Page url https://qa-refapp.openmrs.org/openmrs/index.htm?lang= contains 'index.htm', which is not allowed
15-Sep-2021 09:28:50         at org.openmrs.uitestframework.page.Page.waitForPage(Page.java:124)
15-Sep-2021 09:28:50         at org.openmrs.uitestframework.test.TestBase.goToLoginPage(TestBase.java:249)
15-Sep-2021 09:28:50         at org.openmrs.uitestframework.test.TestBase.login(TestBase.java:231)
15-Sep-2021 09:28:50         at org.openmrs.uitestframework.test.TestBase.launchBrowser(TestBase.java:191)
15-Sep-2021 09:28:50         at org.openmrs.uitestframework.test.TestBase.startWebDriver(TestBase.java:130)
15-Sep-2021 09:28:50         at sun.reflect.GeneratedMethodAccessor6.invoke(Unknown Source)
15-Sep-2021 09:28:50         at sun.reflect.DelegatingMethodAccessorImpl.invoke(DelegatingMethodAccessorImpl.java:43)
15-Sep-2021 09:28:50         at java.lang.reflect.Method.invoke(Method.java:498)
15-Sep-2021 09:28:50         at org.junit.runners.model.FrameworkMethod$1.runReflectiveCall(FrameworkMethod.java:59)
15-Sep-2021 09:28:50         at org.junit.internal.runners.model.ReflectiveCallable.run(ReflectiveCallable.java:12)
15-Sep-2021 09:28:50         at org.junit.runners.model.FrameworkMethod.invokeExplosively(FrameworkMethod.java:56)
15-Sep-2021 09:28:50         at org.junit.internal.runners.statements.RunBefores.invokeMethod(RunBefores.java:33)
15-Sep-2021 09:28:50         at org.junit.internal.runners.statements.RunBefores.evaluate(RunBefores.java:24)
15-Sep-2021 09:28:50         at org.junit.internal.runners.statements.RunAfters.evaluate(RunAfters.java:27)
15-Sep-2021 09:28:50         at org.junit.rules.TestWatcher$1.evaluate(TestWatcher.java:61)
15-Sep-2021 09:28:50         at org.junit.rules.TestWatcher$1.evaluate(TestWatcher.java:61)
15-Sep-2021 09:28:50         at org.junit.runners.ParentRunner$3.evaluate(ParentRunner.java:306)
15-Sep-2021 09:28:50         at org.junit.runners.BlockJUnit4ClassRunner$1.evaluate(BlockJUnit4ClassRunner.java:100)
15-Sep-2021 09:28:50         at org.junit.runners.ParentRunner.runLeaf(ParentRunner.java:366)
15-Sep-2021 09:28:50         at org.junit.runners.BlockJUnit4ClassRunner.runChild(BlockJUnit4ClassRunner.java:103)
15-Sep-2021 09:28:50         at org.junit.runners.BlockJUnit4ClassRunner.runChild(BlockJUnit4ClassRunner.java:63)
15-Sep-2021 09:28:50         at org.junit.runners.ParentRunner$4.run(ParentRunner.java:331)
15-Sep-2021 09:28:50         at org.junit.runners.ParentRunner$1.schedule(ParentRunner.java:79)
15-Sep-2021 09:28:50         at org.junit.runners.ParentRunner.runChildren(ParentRunner.java:329)
15-Sep-2021 09:28:50         at org.junit.runners.ParentRunner.access$100(ParentRunner.java:66)
15-Sep-2021 09:28:50         at org.junit.runners.ParentRunner$2.evaluate(ParentRunner.java:293)
15-Sep-2021 09:28:50         at org.junit.runners.ParentRunner$3.evaluate(ParentRunner.java:306)
15-Sep-2021 09:28:50         at org.junit.runners.ParentRunner.run(ParentRunner.java:413)
15-Sep-2021 09:28:50         at org.apache.maven.surefire.junit4.JUnit4Provider.execute(JUnit4Provider.java:236)
15-Sep-2021 09:28:50         at org.apache.maven.surefire.junit4.JUnit4Provider.executeTestSet(JUnit4Provider.java:134)
15-Sep-2021 09:28:50         at org.apache.maven.surefire.junit4.JUnit4Provider.invoke(JUnit4Provider.java:113)
15-Sep-2021 09:28:50         at sun.reflect.NativeMethodAccessorImpl.invoke0(Native Method)
15-Sep-2021 09:28:50         at sun.reflect.NativeMethodAccessorImpl.invoke(NativeMethodAccessorImpl.java:62)
15-Sep-2021 09:28:50         at sun.reflect.DelegatingMethodAccessorImpl.invoke(DelegatingMethodAccessorImpl.java:43)
15-Sep-2021 09:28:50         at java.lang.reflect.Method.invoke(Method.java:498)
15-Sep-2021 09:28:50         at org.apache.maven.surefire.util.ReflectionUtils.invokeMethodWithArray(ReflectionUtils.java:189)
15-Sep-2021 09:28:50         at org.apache.maven.surefire.booter.ProviderFactory$ProviderProxy.invoke(ProviderFactory.java:165)
15-Sep-2021 09:28:50         at org.apache.maven.surefire.booter.ProviderFactory.invokeProvider(ProviderFactory.java:85)
15-Sep-2021 09:28:50         at org.apache.maven.surefire.booter.ForkedBooter.runSuitesInProcess(ForkedBooter.java:103)
15-Sep-2021 09:28:50         at org.apache.maven.surefire.booter.ForkedBooter.main(ForkedBooter.java:74)
15-Sep-2021 09:28:50 Tests run: 3, Failures: 1, Errors: 2, Skipped: 0, Time elapsed: 152.898 sec <<< FAILURE!
15-Sep-2021 09:28:50 Running org.openmrs.reference.DuplicatePatientRegisterTest
15-Sep-2021 09:28:51 Tests run: 2, Failures: 1, Errors: 1, Skipped: 0, Time elapsed: 0.005 sec <<< FAILURE!
15-Sep-2021 09:28:51 Running org.openmrs.reference.UsingBackButtonInMergePatientTest
15-Sep-2021 09:28:51 Tests run: 2, Failures: 1, Errors: 1, Skipped: 0, Time elapsed: 0.004 sec <<< FAILURE!
15-Sep-2021 09:28:51 Running org.openmrs.reference.AddDiagnosisToVisitNoteTest
15-Sep-2021 09:28:51 Tests run: 1, Failures: 1, Errors: 0, Skipped: 0, Time elapsed: 0 sec <<< FAILURE!
15-Sep-2021 09:28:51 Running org.openmrs.reference.MergeVisitsTest
15-Sep-2021 09:28:51 Tests run: 2, Failures: 1, Errors: 1, Skipped: 0, Time elapsed: 0.001 sec <<< FAILURE!
15-Sep-2021 09:28:51 Running org.openmrs.reference.EditServiceTest
15-Sep-2021 09:28:51 Tests run: 1, Failures: 1, Errors: 0, Skipped: 0, Time elapsed: 0.002 sec <<< FAILURE!
15-Sep-2021 09:28:51 Running org.openmrs.reference.AddNewAllergyTest
15-Sep-2021 09:28:51 Tests run: 1, Failures: 1, Errors: 0, Skipped: 0, Time elapsed: 0.001 sec <<< FAILURE!
15-Sep-2021 09:28:51 Running org.openmrs.reference.LoginTest
15-Sep-2021 09:28:51 Tests run: 5, Failures: 5, Errors: 0, Skipped: 0, Time elapsed: 0.016 sec <<< FAILURE!
15-Sep-2021 09:28:51 Running org.openmrs.reference.DeleteProviderTest
15-Sep-2021 09:28:51 Tests run: 2, Failures: 1, Errors: 1, Skipped: 0, Time elapsed: 0.065 sec <<< FAILURE!
15-Sep-2021 09:28:51 Running org.openmrs.reference.RegisterPatientTest
15-Sep-2021 09:28:51 Tests run: 2, Failures: 1, Errors: 1, Skipped: 0, Time elapsed: 0.004 sec <<< FAILURE!
15-Sep-2021 09:28:51 Running org.openmrs.reference.ContactInfoTest
15-Sep-2021 09:28:51 Tests run: 1, Failures: 1, Errors: 0, Skipped: 0, Time elapsed: 0.005 sec <<< FAILURE!
15-Sep-2021 09:28:51 Running org.openmrs.reference.StartVisitTest
15-Sep-2021 09:28:51 Tests run: 1, Failures: 1, Errors: 0, Skipped: 0, Time elapsed: 0.001 sec <<< FAILURE!
15-Sep-2021 09:28:51 Running org.openmrs.reference.DeletePersonTest
15-Sep-2021 09:28:51 Tests run: 2, Failures: 1, Errors: 1, Skipped: 0, Time elapsed: 0.065 sec <<< FAILURE!
15-Sep-2021 09:28:51 Running org.openmrs.reference.EditProviderTest
15-Sep-2021 09:28:51 Tests run: 2, Failures: 1, Errors: 1, Skipped: 0, Time elapsed: 0.051 sec <<< FAILURE!
15-Sep-2021 09:28:51 Running org.openmrs.reference.RetireVisitTypeTest
15-Sep-2021 09:28:51 Tests run: 2, Failures: 1, Errors: 1, Skipped: 0, Time elapsed: 0.04 sec <<< FAILURE!
15-Sep-2021 09:28:51
15-Sep-2021 09:28:51 Results :
15-Sep-2021 09:28:51
15-Sep-2021 09:28:51 Failed tests:   addLocationTest(org.openmrs.reference.AddDeleteLocationTest): Test killed due to server failure
15-Sep-2021 09:28:51   duplicatePatientRegisterTest(org.openmrs.reference.DuplicatePatientRegisterTest): Test killed due to server failure
15-Sep-2021 09:28:51   usingBackButtonInMergePatientTest(org.openmrs.reference.UsingBackButtonInMergePatientTest): Test killed due to server failure
15-Sep-2021 09:28:51   addDiagnosisToVisitNoteTest(org.openmrs.reference.AddDiagnosisToVisitNoteTest): Test killed due to server failure
15-Sep-2021 09:28:51   mergeVisitsTest(org.openmrs.reference.MergeVisitsTest): Test killed due to server failure
15-Sep-2021 09:28:51   editServiceTest(org.openmrs.reference.EditServiceTest): Test killed due to server failure
15-Sep-2021 09:28:51   addNewAllergyTest(org.openmrs.reference.AddNewAllergyTest): Test killed due to server failure
15-Sep-2021 09:28:51   verifyNurseModulesAvailableOnHomePage(org.openmrs.reference.LoginTest): Test killed due to server failure
15-Sep-2021 09:28:51   verifyModulesAvailableOnHomePage(org.openmrs.reference.LoginTest): Test killed due to server failure
15-Sep-2021 09:28:51   verifySysadminModulesAvailableOnHomePage(org.openmrs.reference.LoginTest): Test killed due to server failure
15-Sep-2021 09:28:51   verifyClerkModulesAvailableOnHomePage(org.openmrs.reference.LoginTest): Test killed due to server failure
15-Sep-2021 09:28:51   verifyDoctorModulesAvailableOnHomePage(org.openmrs.reference.LoginTest): Test killed due to server failure
15-Sep-2021 09:28:51   deleteProviderTest(org.openmrs.reference.DeleteProviderTest): Test killed due to server failure
15-Sep-2021 09:28:51   registerPatientTest(org.openmrs.reference.RegisterPatientTest): Test killed due to server failure
15-Sep-2021 09:28:51   contactInfoTest(org.openmrs.reference.ContactInfoTest): Test killed due to server failure
15-Sep-2021 09:28:51   startVisitTest(org.openmrs.reference.StartVisitTest): Test killed due to server failure
15-Sep-2021 09:28:51   deletePersonTest(org.openmrs.reference.DeletePersonTest): Test killed due to server failure
15-Sep-2021 09:28:51   editProviderTest(org.openmrs.reference.EditProviderTest): Test killed due to server failure
15-Sep-2021 09:28:51   retireVisitTypeTest(org.openmrs.reference.RetireVisitTypeTest): Test killed due to server failure
15-Sep-2021 09:28:51
15-Sep-2021 09:28:51 Tests in error:
15-Sep-2021 09:28:51   mergePatientTest(org.openmrs.reference.MergePatientTest): Error communicating with the remote browser. It may have died.(..)
15-Sep-2021 09:28:51   mergePatientTest(org.openmrs.reference.MergePatientTest): Delete request failed: https://qa-refapp.openmrs.org/openmrs/ws/rest/v1/patient/c972ff56-993c-4fa3-8b64-7229d4e32b0b
15-Sep-2021 09:28:51   mergePatientTest(org.openmrs.reference.MergePatientTest): Session ID is null. Using WebDriver after calling quit()?(..)
15-Sep-2021 09:28:51   addLocationTest(org.openmrs.reference.AddDeleteLocationTest): Delete request failed: https://qa-refapp.openmrs.org/openmrs/ws/rest/v1//locationtag/null?purge=true
15-Sep-2021 09:28:51   addLocationTest(org.openmrs.reference.AddDeleteLocationTest): Session ID is null. Using WebDriver after calling quit()?(..)
15-Sep-2021 09:28:51   duplicatePatientRegisterTest(org.openmrs.reference.DuplicatePatientRegisterTest)
15-Sep-2021 09:28:51   usingBackButtonInMergePatientTest(org.openmrs.reference.UsingBackButtonInMergePatientTest)
15-Sep-2021 09:28:51   mergeVisitsTest(org.openmrs.reference.MergeVisitsTest)
15-Sep-2021 09:28:51   deleteProviderTest(org.openmrs.reference.DeleteProviderTest): Delete request failed: https://qa-refapp.openmrs.org/openmrs/ws/rest/v1/provider/null?purge=true
15-Sep-2021 09:28:51   registerPatientTest(org.openmrs.reference.RegisterPatientTest)
15-Sep-2021 09:28:51   deletePersonTest(org.openmrs.reference.DeletePersonTest): Delete request failed: https://qa-refapp.openmrs.org/openmrs/ws/rest/v1/person/null?purge=true
15-Sep-2021 09:28:51   editProviderTest(org.openmrs.reference.EditProviderTest): Delete request failed: https://qa-refapp.openmrs.org/openmrs/ws/rest/v1/provider/null?purge=true
15-Sep-2021 09:28:51   retireVisitTypeTest(org.openmrs.reference.RetireVisitTypeTest): Delete request failed: https://qa-refapp.openmrs.org/openmrs/ws/rest/v1/visittype/null?purge=true
15-Sep-2021 09:28:51
15-Sep-2021 09:28:51 Tests run: 70, Failures: 19, Errors: 13, Skipped: 0
15-Sep-2021 09:28:51
15-Sep-2021 09:28:51 [INFO] ------------------------------------------------------------------------
15-Sep-2021 09:28:51 [INFO] Reactor Summary:
15-Sep-2021 09:28:51 [INFO]
15-Sep-2021 09:28:51 [INFO] Reference Application Distribution ................. SUCCESS [  0.370 s]
15-Sep-2021 09:28:51 [INFO] Reference Application Distribution Package ......... SUCCESS [ 31.122 s]
15-Sep-2021 09:28:51 [INFO] Reference Application Distribution UI Tests ........ FAILURE [10:32 min]
15-Sep-2021 09:28:51 [INFO] ------------------------------------------------------------------------
15-Sep-2021 09:28:51 [INFO] BUILD FAILURE
15-Sep-2021 09:28:51 [INFO] ------------------------------------------------------------------------
15-Sep-2021 09:28:51 [INFO] Total time: 11:04 min
15-Sep-2021 09:28:51 [INFO] Finished at: 2021-09-15T09:28:51+00:00
15-Sep-2021 09:28:52 [INFO] Final Memory: 63M/363M
15-Sep-2021 09:28:52 [INFO] ------------------------------------------------------------------------
15-Sep-2021 09:28:52 [ERROR] Failed to execute goal org.apache.maven.plugins:maven-surefire-plugin:2.12:test (default-test) on project referenceapplication-ui-tests: There are test failures.
15-Sep-2021 09:28:52 [ERROR]
15-Sep-2021 09:28:52 [ERROR] Please refer to /home/bamboo-agent/bamboo-agent/xml-data/build-dir/REFAPP-UI-FRAMEWORK/ui-tests/target/surefire-reports for the individual test results.
15-Sep-2021 09:28:52 [ERROR] -> [Help 1]
15-Sep-2021 09:28:52 org.apache.maven.lifecycle.LifecycleExecutionException: Failed to execute goal org.apache.maven.plugins:maven-surefire-plugin:2.12:test (default-test) on project referenceapplication-ui-tests: There are test failures.
15-Sep-2021 09:28:52
15-Sep-2021 09:28:52 Please refer to /home/bamboo-agent/bamboo-agent/xml-data/build-dir/REFAPP-UI-FRAMEWORK/ui-tests/target/surefire-reports for the individual test results.
15-Sep-2021 09:28:52         at org.apache.maven.lifecycle.internal.MojoExecutor.execute(MojoExecutor.java:212)
15-Sep-2021 09:28:52         at org.apache.maven.lifecycle.internal.MojoExecutor.execute(MojoExecutor.java:153)
15-Sep-2021 09:28:52         at org.apache.maven.lifecycle.internal.MojoExecutor.execute(MojoExecutor.java:145)
15-Sep-2021 09:28:52         at org.apache.maven.lifecycle.internal.LifecycleModuleBuilder.buildProject(LifecycleModuleBuilder.java:116)
15-Sep-2021 09:28:52         at org.apache.maven.lifecycle.internal.LifecycleModuleBuilder.buildProject(LifecycleModuleBuilder.java:80)
15-Sep-2021 09:28:52         at org.apache.maven.lifecycle.internal.builder.singlethreaded.SingleThreadedBuilder.build(SingleThreadedBuilder.java:51)
15-Sep-2021 09:28:52         at org.apache.maven.lifecycle.internal.LifecycleStarter.execute(LifecycleStarter.java:128)
15-Sep-2021 09:28:52         at org.apache.maven.DefaultMaven.doExecute(DefaultMaven.java:307)
15-Sep-2021 09:28:52         at org.apache.maven.DefaultMaven.doExecute(DefaultMaven.java:193)
15-Sep-2021 09:28:52         at org.apache.maven.DefaultMaven.execute(DefaultMaven.java:106)
15-Sep-2021 09:28:52         at org.apache.maven.cli.MavenCli.execute(MavenCli.java:863)
15-Sep-2021 09:28:52         at org.apache.maven.cli.MavenCli.doMain(MavenCli.java:288)
15-Sep-2021 09:28:52         at org.apache.maven.cli.MavenCli.main(MavenCli.java:199)
15-Sep-2021 09:28:52         at sun.reflect.NativeMethodAccessorImpl.invoke0(Native Method)
15-Sep-2021 09:28:52         at sun.reflect.NativeMethodAccessorImpl.invoke(NativeMethodAccessorImpl.java:62)
15-Sep-2021 09:28:52         at sun.reflect.DelegatingMethodAccessorImpl.invoke(DelegatingMethodAccessorImpl.java:43)
15-Sep-2021 09:28:52         at java.lang.reflect.Method.invoke(Method.java:498)
15-Sep-2021 09:28:52         at org.codehaus.plexus.classworlds.launcher.Launcher.launchEnhanced(Launcher.java:289)
15-Sep-2021 09:28:52         at org.codehaus.plexus.classworlds.launcher.Launcher.launch(Launcher.java:229)
15-Sep-2021 09:28:52         at org.codehaus.plexus.classworlds.launcher.Launcher.mainWithExitCode(Launcher.java:415)
15-Sep-2021 09:28:52         at org.codehaus.plexus.classworlds.launcher.Launcher.main(Launcher.java:356)
15-Sep-2021 09:28:52 Caused by: org.apache.maven.plugin.MojoFailureException: There are test failures.
15-Sep-2021 09:28:52
15-Sep-2021 09:28:52 Please refer to /home/bamboo-agent/bamboo-agent/xml-data/build-dir/REFAPP-UI-FRAMEWORK/ui-tests/target/surefire-reports for the individual test results.
15-Sep-2021 09:28:52         at org.apache.maven.plugin.surefire.SurefireHelper.reportExecution(SurefireHelper.java:83)
15-Sep-2021 09:28:52         at org.apache.maven.plugin.surefire.SurefirePlugin.writeSummary(SurefirePlugin.java:673)
15-Sep-2021 09:28:52         at org.apache.maven.plugin.surefire.SurefirePlugin.handleSummary(SurefirePlugin.java:647)
15-Sep-2021 09:28:52         at org.apache.maven.plugin.surefire.AbstractSurefireMojo.executeAfterPreconditionsChecked(AbstractSurefireMojo.java:137)
15-Sep-2021 09:28:52         at org.apache.maven.plugin.surefire.AbstractSurefireMojo.execute(AbstractSurefireMojo.java:98)
15-Sep-2021 09:28:52         at org.apache.maven.plugin.DefaultBuildPluginManager.executeMojo(DefaultBuildPluginManager.java:134)
15-Sep-2021 09:28:52         at org.apache.maven.lifecycle.internal.MojoExecutor.execute(MojoExecutor.java:207)
15-Sep-2021 09:28:52         ... 20 more
15-Sep-2021 09:28:52 [ERROR]
15-Sep-2021 09:28:52 [ERROR] Re-run Maven using the -X switch to enable full debug logging.
15-Sep-2021 09:28:52 [ERROR]
15-Sep-2021 09:28:52 [ERROR] For more information about the errors and possible solutions, please read the following articles:
15-Sep-2021 09:28:52 [ERROR] [Help 1] http://cwiki.apache.org/confluence/display/MAVEN/MojoFailureException
15-Sep-2021 09:28:52 [ERROR]
15-Sep-2021 09:28:52 [ERROR] After correcting the problems, you can resume the build with the command
15-Sep-2021 09:28:52 [ERROR]   mvn <goals> -rf :referenceapplication-ui-tests
15-Sep-2021 09:28:52 Failing task since return code of [/usr/share/apache-maven-3.3.9/bin/mvn --batch-mode -Djava.io.tmpdir=/home/bamboo-agent/bamboo-agent/.agent_tmp/REFAPP-UI-FRAMEWORK clean install -DskipTests=false -e] was 1 while expected 0
15-Sep-2021 09:28:52 Parsing test results under /home/bamboo-agent/bamboo-agent/xml-data/build-dir/REFAPP-UI-FRAMEWORK...
15-Sep-2021 09:28:53 Finished task 'Build distribution' with result: Failed
15-Sep-2021 09:28:53 Running post build plugin 'Docker Container Cleanup'
15-Sep-2021 09:28:53 Running post build plugin 'NCover Results Collector'
15-Sep-2021 09:28:53 Running post build plugin 'Clover Results Collector'
15-Sep-2021 09:28:53 Running post build plugin 'Sauce OnDemand Post Runner'
15-Sep-2021 09:28:53 Running post build plugin 'npm Cache Cleanup'
15-Sep-2021 09:28:53 Running post build plugin 'Artifact Copier'
15-Sep-2021 09:28:53 Finalising the build...
15-Sep-2021 09:28:53 Stopping timer.
15-Sep-2021 09:28:53 Build REFAPP-UI-FRAMEWORK-562 completed.
15-Sep-2021 09:28:53 Running on server: post build plugin 'NCover Results Collector'
15-Sep-2021 09:28:53 Running on server: post build plugin 'Build Hanging Detection Configuration'
15-Sep-2021 09:28:53 Running on server: post build plugin 'Clover Delta Calculator'
15-Sep-2021 09:28:53 Running on server: post build plugin 'Maven Dependencies Postprocessor'
15-Sep-2021 09:28:53 All post build plugins have finished
15-Sep-2021 09:28:53 Generating build results summary...
15-Sep-2021 09:28:54 Saving build results to disk...
15-Sep-2021 09:28:54 Logging substituted variables...
15-Sep-2021 09:28:54 Indexing build results...
15-Sep-2021 09:28:54 Finished building REFAPP-UI-FRAMEWORK-562.