UI tests for the reference application

Build: #567 failed

Job: Run QA UI Tests failed

Stages & jobs

  1. Ref App UI Testing

Build log

The build generated 1,235 lines of output.The output is too long and has been truncated to the last 1,000 lines. Download or view full build log

17-Sep-2021 13:53:49 [INFO] Configured Artifact: org.openmrs.module:reportingrest-omod:1.12.0:jar
17-Sep-2021 13:53:49 [INFO] Configured Artifact: org.openmrs.module:owa-omod:1.13.0:jar
17-Sep-2021 13:53:49 [INFO] Configured Artifact: org.openmrs.module:fhir2-omod:1.2.2:jar
17-Sep-2021 13:53:49 [INFO] Downloading: http://mavenrepo.openmrs.org/nexus/content/repositories/public/org/openmrs/module/fhir2-omod/1.2.2/fhir2-omod-1.2.2.jar
17-Sep-2021 13:53:53 [INFO] Downloaded: http://mavenrepo.openmrs.org/nexus/content/repositories/public/org/openmrs/module/fhir2-omod/1.2.2/fhir2-omod-1.2.2.jar (36085 KB at 8653.4 KB/sec)
17-Sep-2021 13:53:53 [INFO] Configured Artifact: org.openmrs.module:serialization.xstream-omod:0.2.15:omod
17-Sep-2021 13:53:53 [INFO] Configured Artifact: org.openmrs.module:registrationapp-omod:1.24.0:jar
17-Sep-2021 13:53:53 [INFO] Downloading: http://mavenrepo.openmrs.org/nexus/content/repositories/public/org/openmrs/module/registrationapp-omod/1.24.0/registrationapp-omod-1.24.0.jar
17-Sep-2021 13:53:54 [INFO] Downloaded: http://mavenrepo.openmrs.org/nexus/content/repositories/public/org/openmrs/module/registrationapp-omod/1.24.0/registrationapp-omod-1.24.0.jar (895 KB at 2018.2 KB/sec)
17-Sep-2021 13:53:54 [INFO] Configured Artifact: org.openmrs:event-omod:2.10.0-SNAPSHOT:jar
17-Sep-2021 13:53:54 [INFO] Downloading: http://mavenrepo.openmrs.org/nexus/content/repositories/public/org/openmrs/event-omod/2.10.0-SNAPSHOT/maven-metadata.xml
17-Sep-2021 13:53:55 [INFO] Downloaded: http://mavenrepo.openmrs.org/nexus/content/repositories/public/org/openmrs/event-omod/2.10.0-SNAPSHOT/maven-metadata.xml (987 B at 0.8 KB/sec)
17-Sep-2021 13:53:55 [INFO] Downloading: http://mavenrepo.openmrs.org/nexus/content/repositories/public/org/openmrs/event-omod/2.10.0-SNAPSHOT/event-omod-2.10.0-20210702.124301-3.jar
17-Sep-2021 13:53:56 [INFO] Downloaded: http://mavenrepo.openmrs.org/nexus/content/repositories/public/org/openmrs/event-omod/2.10.0-SNAPSHOT/event-omod-2.10.0-20210702.124301-3.jar (4666 KB at 4865.2 KB/sec)
17-Sep-2021 13:53:56 [INFO] Configured Artifact: org.openmrs.module:uilibrary-omod:2.0.7:jar
17-Sep-2021 13:53:56 [INFO] Configured Artifact: org.openmrs.module:htmlwidgets-omod:1.10.0:jar
17-Sep-2021 13:53:56 [INFO] Configured Artifact: org.openmrs.module:dataexchange-omod:1.3.7:jar
17-Sep-2021 13:53:56 [INFO] Configured Artifact: org.openmrs.module:appui-omod:1.14.0:jar
17-Sep-2021 13:53:56 [INFO] Configured Artifact: org.openmrs.module:allergyui-omod:1.8.4:jar
17-Sep-2021 13:53:56 [INFO] Configured Artifact: org.openmrs.module:providermanagement-omod:2.13.0:jar
17-Sep-2021 13:53:56 [INFO] Configured Artifact: org.openmrs.module:appointmentschedulingui-omod:1.12.0:jar
17-Sep-2021 13:53:56 [INFO] Configured Artifact: org.openmrs.module:attachments-omod:2.5.0:jar
17-Sep-2021 13:53:56 [INFO] Configured Artifact: org.openmrs.module:formentryapp-omod:1.4.2:jar
17-Sep-2021 13:53:56 [INFO] Configured Artifact: org.openmrs.module:idgen-omod:4.7.0:jar
17-Sep-2021 13:53:56 [INFO] Configured Artifact: org.openmrs.module:metadatamapping-omod:1.4.0:jar
17-Sep-2021 13:53:56 [INFO] Configured Artifact: org.openmrs.module:htmlformentryui-omod:2.0.0:jar
17-Sep-2021 13:53:56 [INFO] Configured Artifact: org.openmrs.module:referencedemodata-omod:1.4.7:jar
17-Sep-2021 13:53:56 [INFO] Configured Artifact: org.openmrs.module:emrapi-omod:1.32.0:jar
17-Sep-2021 13:53:56 [INFO] Configured Artifact: org.openmrs.module:referenceapplication-omod:2.12.0-SNAPSHOT:jar
17-Sep-2021 13:53:56 [INFO] Downloading: http://mavenrepo.openmrs.org/nexus/content/repositories/public/org/openmrs/module/referenceapplication-omod/2.12.0-SNAPSHOT/maven-metadata.xml
17-Sep-2021 13:53:57 [INFO] Downloaded: http://mavenrepo.openmrs.org/nexus/content/repositories/public/org/openmrs/module/referenceapplication-omod/2.12.0-SNAPSHOT/maven-metadata.xml (802 B at 1.2 KB/sec)
17-Sep-2021 13:53:57 [INFO] Downloading: http://mavenrepo.openmrs.org/nexus/content/repositories/public/org/openmrs/module/referenceapplication-omod/2.12.0-SNAPSHOT/referenceapplication-omod-2.12.0-20210916.160538-271.jar
17-Sep-2021 13:53:57 [INFO] Downloaded: http://mavenrepo.openmrs.org/nexus/content/repositories/public/org/openmrs/module/referenceapplication-omod/2.12.0-SNAPSHOT/referenceapplication-omod-2.12.0-20210916.160538-271.jar (1902 KB at 2677.6 KB/sec)
17-Sep-2021 13:53:57 [INFO] Configured Artifact: org.openmrs.module:htmlformentry-omod:4.1.0:jar
17-Sep-2021 13:53:57 [INFO] Configured Artifact: org.openmrs.module:appframework-omod:2.16.0:jar
17-Sep-2021 13:53:57 [INFO] Configured Artifact: org.openmrs.module:referencemetadata-omod:2.12.0:jar
17-Sep-2021 13:53:57 [INFO] Configured Artifact: org.openmrs.module:reportingui-omod:1.8.0:jar
17-Sep-2021 13:53:57 [INFO] Configured Artifact: org.openmrs.module:coreapps-omod:1.34.0-SNAPSHOT:jar
17-Sep-2021 13:53:57 [INFO] Downloading: http://mavenrepo.openmrs.org/nexus/content/repositories/public/org/openmrs/module/coreapps-omod/1.34.0-SNAPSHOT/maven-metadata.xml
17-Sep-2021 13:53:58 [INFO] Downloaded: http://mavenrepo.openmrs.org/nexus/content/repositories/public/org/openmrs/module/coreapps-omod/1.34.0-SNAPSHOT/maven-metadata.xml (787 B at 2.9 KB/sec)
17-Sep-2021 13:53:58 [INFO] Downloading: http://mavenrepo.openmrs.org/nexus/content/repositories/public/org/openmrs/module/coreapps-omod/1.34.0-SNAPSHOT/coreapps-omod-1.34.0-20210916.134244-36.jar
17-Sep-2021 13:53:59 [INFO] Downloaded: http://mavenrepo.openmrs.org/nexus/content/repositories/public/org/openmrs/module/coreapps-omod/1.34.0-SNAPSHOT/coreapps-omod-1.34.0-20210916.134244-36.jar (3859 KB at 3905.5 KB/sec)
17-Sep-2021 13:53:59 [INFO] Configured Artifact: org.openmrs.module:reportingcompatibility-omod:2.0.8:jar
17-Sep-2021 13:53:59 [INFO] Configured Artifact: org.openmrs.module:reporting-omod:1.23.0:jar
17-Sep-2021 13:53:59 [INFO] Configured Artifact: org.openmrs.module:adminui-omod:1.5.0:jar
17-Sep-2021 13:53:59 [INFO] Configured Artifact: org.openmrs.module:registrationcore-omod:1.11.0:jar
17-Sep-2021 13:53:59 [INFO] Configured Artifact: org.openmrs.module:appointmentscheduling-omod:1.16.0:jar
17-Sep-2021 13:53:59 [INFO] Configured Artifact: org.openmrs.module:atlas-omod:2.2.5:omod
17-Sep-2021 13:53:59 [INFO] Configured Artifact: org.openmrs.module:calculation-omod:1.3.0:jar
17-Sep-2021 13:53:59 [INFO] Configured Artifact: org.openmrs.module:webservices.rest-omod:2.32.0-SNAPSHOT:jar
17-Sep-2021 13:53:59 [INFO] Downloading: http://mavenrepo.openmrs.org/nexus/content/repositories/public/org/openmrs/module/webservices.rest-omod/2.32.0-SNAPSHOT/maven-metadata.xml
17-Sep-2021 13:53:59 [INFO] Downloaded: http://mavenrepo.openmrs.org/nexus/content/repositories/public/org/openmrs/module/webservices.rest-omod/2.32.0-SNAPSHOT/maven-metadata.xml (1009 B at 3.9 KB/sec)
17-Sep-2021 13:53:59 [INFO] Downloading: http://mavenrepo.openmrs.org/nexus/content/repositories/public/org/openmrs/module/webservices.rest-omod/2.32.0-SNAPSHOT/webservices.rest-omod-2.32.0-20210916.132343-69.jar
17-Sep-2021 13:54:00 [INFO] Downloaded: http://mavenrepo.openmrs.org/nexus/content/repositories/public/org/openmrs/module/webservices.rest-omod/2.32.0-SNAPSHOT/webservices.rest-omod-2.32.0-20210916.132343-69.jar (6750 KB at 5164.5 KB/sec)
17-Sep-2021 13:54:00 [INFO] Configured Artifact: org.openmrs.module:spa-omod:1.0.8:jar
17-Sep-2021 13:54:00 [INFO] Configured Artifact: org.openmrs.module:uicommons-omod:2.18.0:jar
17-Sep-2021 13:54:00 [INFO] Configured Artifact: org.openmrs.module:uiframework-omod:3.21.0:jar
17-Sep-2021 13:54:00 [INFO] Configured Artifact: org.openmrs.module:metadatasharing-omod:1.8.0:jar
17-Sep-2021 13:54:00 [INFO] Copying addresshierarchy-omod-2.14.2.jar to /home/bamboo-agent/bamboo-agent/xml-data/build-dir/REFAPP-UI-FRAMEWORK/package/target/distro/web/modules/addresshierarchy-2.14.2.omod
17-Sep-2021 13:54:00 [INFO] Copying legacyui-omod-1.8.3.jar to /home/bamboo-agent/bamboo-agent/xml-data/build-dir/REFAPP-UI-FRAMEWORK/package/target/distro/web/modules/legacyui-1.8.3.omod
17-Sep-2021 13:54:01 [INFO] Copying openconceptlab-omod-1.2.6.jar to /home/bamboo-agent/bamboo-agent/xml-data/build-dir/REFAPP-UI-FRAMEWORK/package/target/distro/web/modules/openconceptlab-1.2.6.omod
17-Sep-2021 13:54:01 [INFO] Copying metadatadeploy-omod-1.13.0.jar to /home/bamboo-agent/bamboo-agent/xml-data/build-dir/REFAPP-UI-FRAMEWORK/package/target/distro/web/modules/metadatadeploy-1.13.0.omod
17-Sep-2021 13:54:01 [INFO] Copying reportingrest-omod-1.12.0.jar to /home/bamboo-agent/bamboo-agent/xml-data/build-dir/REFAPP-UI-FRAMEWORK/package/target/distro/web/modules/reportingrest-1.12.0.omod
17-Sep-2021 13:54:01 [INFO] Copying owa-omod-1.13.0.jar to /home/bamboo-agent/bamboo-agent/xml-data/build-dir/REFAPP-UI-FRAMEWORK/package/target/distro/web/modules/owa-1.13.0.omod
17-Sep-2021 13:54:01 [INFO] Copying fhir2-omod-1.2.2.jar to /home/bamboo-agent/bamboo-agent/xml-data/build-dir/REFAPP-UI-FRAMEWORK/package/target/distro/web/modules/fhir2-1.2.2.omod
17-Sep-2021 13:54:01 [INFO] Copying serialization.xstream-omod-0.2.15.omod to /home/bamboo-agent/bamboo-agent/xml-data/build-dir/REFAPP-UI-FRAMEWORK/package/target/distro/web/modules/serialization.xstream-0.2.15.omod
17-Sep-2021 13:54:01 [INFO] Copying registrationapp-omod-1.24.0.jar to /home/bamboo-agent/bamboo-agent/xml-data/build-dir/REFAPP-UI-FRAMEWORK/package/target/distro/web/modules/registrationapp-1.24.0.omod
17-Sep-2021 13:54:01 [INFO] Copying event-omod-2.10.0-SNAPSHOT.jar to /home/bamboo-agent/bamboo-agent/xml-data/build-dir/REFAPP-UI-FRAMEWORK/package/target/distro/web/modules/event-2.10.0-SNAPSHOT.omod
17-Sep-2021 13:54:01 [INFO] Copying uilibrary-omod-2.0.7.jar to /home/bamboo-agent/bamboo-agent/xml-data/build-dir/REFAPP-UI-FRAMEWORK/package/target/distro/web/modules/uilibrary-2.0.7.omod
17-Sep-2021 13:54:01 [INFO] Copying htmlwidgets-omod-1.10.0.jar to /home/bamboo-agent/bamboo-agent/xml-data/build-dir/REFAPP-UI-FRAMEWORK/package/target/distro/web/modules/htmlwidgets-1.10.0.omod
17-Sep-2021 13:54:01 [INFO] Copying dataexchange-omod-1.3.7.jar to /home/bamboo-agent/bamboo-agent/xml-data/build-dir/REFAPP-UI-FRAMEWORK/package/target/distro/web/modules/dataexchange-1.3.7.omod
17-Sep-2021 13:54:01 [INFO] Copying appui-omod-1.14.0.jar to /home/bamboo-agent/bamboo-agent/xml-data/build-dir/REFAPP-UI-FRAMEWORK/package/target/distro/web/modules/appui-1.14.0.omod
17-Sep-2021 13:54:01 [INFO] Copying allergyui-omod-1.8.4.jar to /home/bamboo-agent/bamboo-agent/xml-data/build-dir/REFAPP-UI-FRAMEWORK/package/target/distro/web/modules/allergyui-1.8.4.omod
17-Sep-2021 13:54:01 [INFO] Copying providermanagement-omod-2.13.0.jar to /home/bamboo-agent/bamboo-agent/xml-data/build-dir/REFAPP-UI-FRAMEWORK/package/target/distro/web/modules/providermanagement-2.13.0.omod
17-Sep-2021 13:54:01 [INFO] Copying appointmentschedulingui-omod-1.12.0.jar to /home/bamboo-agent/bamboo-agent/xml-data/build-dir/REFAPP-UI-FRAMEWORK/package/target/distro/web/modules/appointmentschedulingui-1.12.0.omod
17-Sep-2021 13:54:01 [INFO] Copying attachments-omod-2.5.0.jar to /home/bamboo-agent/bamboo-agent/xml-data/build-dir/REFAPP-UI-FRAMEWORK/package/target/distro/web/modules/attachments-2.5.0.omod
17-Sep-2021 13:54:01 [INFO] Copying formentryapp-omod-1.4.2.jar to /home/bamboo-agent/bamboo-agent/xml-data/build-dir/REFAPP-UI-FRAMEWORK/package/target/distro/web/modules/formentryapp-1.4.2.omod
17-Sep-2021 13:54:01 [INFO] Copying idgen-omod-4.7.0.jar to /home/bamboo-agent/bamboo-agent/xml-data/build-dir/REFAPP-UI-FRAMEWORK/package/target/distro/web/modules/idgen-4.7.0.omod
17-Sep-2021 13:54:02 [INFO] Copying metadatamapping-omod-1.4.0.jar to /home/bamboo-agent/bamboo-agent/xml-data/build-dir/REFAPP-UI-FRAMEWORK/package/target/distro/web/modules/metadatamapping-1.4.0.omod
17-Sep-2021 13:54:02 [INFO] Copying htmlformentryui-omod-2.0.0.jar to /home/bamboo-agent/bamboo-agent/xml-data/build-dir/REFAPP-UI-FRAMEWORK/package/target/distro/web/modules/htmlformentryui-2.0.0.omod
17-Sep-2021 13:54:02 [INFO] Copying referencedemodata-omod-1.4.7.jar to /home/bamboo-agent/bamboo-agent/xml-data/build-dir/REFAPP-UI-FRAMEWORK/package/target/distro/web/modules/referencedemodata-1.4.7.omod
17-Sep-2021 13:54:02 [INFO] Copying emrapi-omod-1.32.0.jar to /home/bamboo-agent/bamboo-agent/xml-data/build-dir/REFAPP-UI-FRAMEWORK/package/target/distro/web/modules/emrapi-1.32.0.omod
17-Sep-2021 13:54:02 [INFO] Copying referenceapplication-omod-2.12.0-SNAPSHOT.jar to /home/bamboo-agent/bamboo-agent/xml-data/build-dir/REFAPP-UI-FRAMEWORK/package/target/distro/web/modules/referenceapplication-2.12.0-SNAPSHOT.omod
17-Sep-2021 13:54:02 [INFO] Copying htmlformentry-omod-4.1.0.jar to /home/bamboo-agent/bamboo-agent/xml-data/build-dir/REFAPP-UI-FRAMEWORK/package/target/distro/web/modules/htmlformentry-4.1.0.omod
17-Sep-2021 13:54:02 [INFO] Copying appframework-omod-2.16.0.jar to /home/bamboo-agent/bamboo-agent/xml-data/build-dir/REFAPP-UI-FRAMEWORK/package/target/distro/web/modules/appframework-2.16.0.omod
17-Sep-2021 13:54:02 [INFO] Copying referencemetadata-omod-2.12.0.jar to /home/bamboo-agent/bamboo-agent/xml-data/build-dir/REFAPP-UI-FRAMEWORK/package/target/distro/web/modules/referencemetadata-2.12.0.omod
17-Sep-2021 13:54:02 [INFO] Copying reportingui-omod-1.8.0.jar to /home/bamboo-agent/bamboo-agent/xml-data/build-dir/REFAPP-UI-FRAMEWORK/package/target/distro/web/modules/reportingui-1.8.0.omod
17-Sep-2021 13:54:02 [INFO] Copying coreapps-omod-1.34.0-SNAPSHOT.jar to /home/bamboo-agent/bamboo-agent/xml-data/build-dir/REFAPP-UI-FRAMEWORK/package/target/distro/web/modules/coreapps-1.34.0-SNAPSHOT.omod
17-Sep-2021 13:54:02 [INFO] Copying reportingcompatibility-omod-2.0.8.jar to /home/bamboo-agent/bamboo-agent/xml-data/build-dir/REFAPP-UI-FRAMEWORK/package/target/distro/web/modules/reportingcompatibility-2.0.8.omod
17-Sep-2021 13:54:02 [INFO] Copying reporting-omod-1.23.0.jar to /home/bamboo-agent/bamboo-agent/xml-data/build-dir/REFAPP-UI-FRAMEWORK/package/target/distro/web/modules/reporting-1.23.0.omod
17-Sep-2021 13:54:03 [INFO] Copying adminui-omod-1.5.0.jar to /home/bamboo-agent/bamboo-agent/xml-data/build-dir/REFAPP-UI-FRAMEWORK/package/target/distro/web/modules/adminui-1.5.0.omod
17-Sep-2021 13:54:03 [INFO] Copying registrationcore-omod-1.11.0.jar to /home/bamboo-agent/bamboo-agent/xml-data/build-dir/REFAPP-UI-FRAMEWORK/package/target/distro/web/modules/registrationcore-1.11.0.omod
17-Sep-2021 13:54:03 [INFO] Copying appointmentscheduling-omod-1.16.0.jar to /home/bamboo-agent/bamboo-agent/xml-data/build-dir/REFAPP-UI-FRAMEWORK/package/target/distro/web/modules/appointmentscheduling-1.16.0.omod
17-Sep-2021 13:54:03 [INFO] Copying atlas-omod-2.2.5.omod to /home/bamboo-agent/bamboo-agent/xml-data/build-dir/REFAPP-UI-FRAMEWORK/package/target/distro/web/modules/atlas-2.2.5.omod
17-Sep-2021 13:54:03 [INFO] Copying calculation-omod-1.3.0.jar to /home/bamboo-agent/bamboo-agent/xml-data/build-dir/REFAPP-UI-FRAMEWORK/package/target/distro/web/modules/calculation-1.3.0.omod
17-Sep-2021 13:54:03 [INFO] Copying webservices.rest-omod-2.32.0-SNAPSHOT.jar to /home/bamboo-agent/bamboo-agent/xml-data/build-dir/REFAPP-UI-FRAMEWORK/package/target/distro/web/modules/webservices.rest-2.32.0-SNAPSHOT.omod
17-Sep-2021 13:54:03 [INFO] Copying spa-omod-1.0.8.jar to /home/bamboo-agent/bamboo-agent/xml-data/build-dir/REFAPP-UI-FRAMEWORK/package/target/distro/web/modules/spa-1.0.8.omod
17-Sep-2021 13:54:03 [INFO] Copying uicommons-omod-2.18.0.jar to /home/bamboo-agent/bamboo-agent/xml-data/build-dir/REFAPP-UI-FRAMEWORK/package/target/distro/web/modules/uicommons-2.18.0.omod
17-Sep-2021 13:54:03 [INFO] Copying uiframework-omod-3.21.0.jar to /home/bamboo-agent/bamboo-agent/xml-data/build-dir/REFAPP-UI-FRAMEWORK/package/target/distro/web/modules/uiframework-3.21.0.omod
17-Sep-2021 13:54:03 [INFO] Copying metadatasharing-omod-1.8.0.jar to /home/bamboo-agent/bamboo-agent/xml-data/build-dir/REFAPP-UI-FRAMEWORK/package/target/distro/web/modules/metadatasharing-1.8.0.omod
17-Sep-2021 13:54:03
17-Sep-2021 13:54:03 Downloading OWAs...
17-Sep-2021 13:54:03
17-Sep-2021 13:54:03
17-Sep-2021 13:54:03 Downloading OWA: org.openmrs.owa:openmrs-owa-sysadmin:1.2
17-Sep-2021 13:54:03 [INFO] Configured Artifact: org.openmrs.owa:sysadmin:1.2:zip
17-Sep-2021 13:54:03 [INFO] Copying sysadmin-1.2.zip to /home/bamboo-agent/bamboo-agent/xml-data/build-dir/REFAPP-UI-FRAMEWORK/package/target/distro/web/owa/sysadmin-1.2.zip
17-Sep-2021 13:54:03
17-Sep-2021 13:54:03 Creating Docker Compose configuration...
17-Sep-2021 13:54:03
17-Sep-2021 13:54:05
17-Sep-2021 13:54:05 The 'referenceapplication' distribution created! To start up the server run 'docker-compose up' from /home/bamboo-agent/bamboo-agent/xml-data/build-dir/REFAPP-UI-FRAMEWORK/package/target/distro
17-Sep-2021 13:54:05
17-Sep-2021 13:54:05 [INFO]
17-Sep-2021 13:54:05 [INFO] --- openmrs-sdk-maven-plugin:4.0.0:build-distro (build-bundled-distro) @ referenceapplication-package ---
17-Sep-2021 13:54:05
17-Sep-2021 13:54:05 Downloading modules...
17-Sep-2021 13:54:05
17-Sep-2021 13:54:05 [INFO] Configured Artifact: org.openmrs.web:openmrs-webapp:2.4.0:war
17-Sep-2021 13:54:05 [INFO] Copying openmrs-webapp-2.4.0.war to /home/bamboo-agent/bamboo-agent/xml-data/build-dir/REFAPP-UI-FRAMEWORK/package/target/bundled-distro/web/openmrs-2.4.0.war
17-Sep-2021 13:54:05 file:/home/bamboo-agent/bamboo-agent/xml-data/build-dir/REFAPP-UI-FRAMEWORK/package/target/bundled-distro/web/openmrs-2.4.0.war
17-Sep-2021 13:54:05 target:/home/bamboo-agent/bamboo-agent/xml-data/build-dir/REFAPP-UI-FRAMEWORK/package/target/bundled-distro/web
17-Sep-2021 13:54:05 [INFO] Configured Artifact: org.openmrs.module:addresshierarchy-omod:2.14.2:jar
17-Sep-2021 13:54:05 [INFO] Configured Artifact: org.openmrs.module:legacyui-omod:1.8.3:jar
17-Sep-2021 13:54:05 [INFO] Configured Artifact: org.openmrs.module:openconceptlab-omod:1.2.6:jar
17-Sep-2021 13:54:05 [INFO] Configured Artifact: org.openmrs.module:metadatadeploy-omod:1.13.0:jar
17-Sep-2021 13:54:05 [INFO] Configured Artifact: org.openmrs.module:reportingrest-omod:1.12.0:jar
17-Sep-2021 13:54:05 [INFO] Configured Artifact: org.openmrs.module:owa-omod:1.13.0:jar
17-Sep-2021 13:54:05 [INFO] Configured Artifact: org.openmrs.module:fhir2-omod:1.2.2:jar
17-Sep-2021 13:54:05 [INFO] Configured Artifact: org.openmrs.module:serialization.xstream-omod:0.2.15:omod
17-Sep-2021 13:54:05 [INFO] Configured Artifact: org.openmrs.module:registrationapp-omod:1.24.0:jar
17-Sep-2021 13:54:05 [INFO] Configured Artifact: org.openmrs:event-omod:2.10.0-SNAPSHOT:jar
17-Sep-2021 13:54:05 [INFO] Configured Artifact: org.openmrs.module:uilibrary-omod:2.0.7:jar
17-Sep-2021 13:54:05 [INFO] Configured Artifact: org.openmrs.module:htmlwidgets-omod:1.10.0:jar
17-Sep-2021 13:54:05 [INFO] Configured Artifact: org.openmrs.module:dataexchange-omod:1.3.7:jar
17-Sep-2021 13:54:05 [INFO] Configured Artifact: org.openmrs.module:appui-omod:1.14.0:jar
17-Sep-2021 13:54:05 [INFO] Configured Artifact: org.openmrs.module:allergyui-omod:1.8.4:jar
17-Sep-2021 13:54:05 [INFO] Configured Artifact: org.openmrs.module:providermanagement-omod:2.13.0:jar
17-Sep-2021 13:54:05 [INFO] Configured Artifact: org.openmrs.module:appointmentschedulingui-omod:1.12.0:jar
17-Sep-2021 13:54:05 [INFO] Configured Artifact: org.openmrs.module:attachments-omod:2.5.0:jar
17-Sep-2021 13:54:05 [INFO] Configured Artifact: org.openmrs.module:formentryapp-omod:1.4.2:jar
17-Sep-2021 13:54:05 [INFO] Configured Artifact: org.openmrs.module:idgen-omod:4.7.0:jar
17-Sep-2021 13:54:05 [INFO] Configured Artifact: org.openmrs.module:metadatamapping-omod:1.4.0:jar
17-Sep-2021 13:54:05 [INFO] Configured Artifact: org.openmrs.module:htmlformentryui-omod:2.0.0:jar
17-Sep-2021 13:54:05 [INFO] Configured Artifact: org.openmrs.module:referencedemodata-omod:1.4.7:jar
17-Sep-2021 13:54:05 [INFO] Configured Artifact: org.openmrs.module:emrapi-omod:1.32.0:jar
17-Sep-2021 13:54:05 [INFO] Configured Artifact: org.openmrs.module:referenceapplication-omod:2.12.0-SNAPSHOT:jar
17-Sep-2021 13:54:05 [INFO] Configured Artifact: org.openmrs.module:htmlformentry-omod:4.1.0:jar
17-Sep-2021 13:54:05 [INFO] Configured Artifact: org.openmrs.module:appframework-omod:2.16.0:jar
17-Sep-2021 13:54:05 [INFO] Configured Artifact: org.openmrs.module:referencemetadata-omod:2.12.0:jar
17-Sep-2021 13:54:05 [INFO] Configured Artifact: org.openmrs.module:reportingui-omod:1.8.0:jar
17-Sep-2021 13:54:05 [INFO] Configured Artifact: org.openmrs.module:coreapps-omod:1.34.0-SNAPSHOT:jar
17-Sep-2021 13:54:05 [INFO] Configured Artifact: org.openmrs.module:reportingcompatibility-omod:2.0.8:jar
17-Sep-2021 13:54:05 [INFO] Configured Artifact: org.openmrs.module:reporting-omod:1.23.0:jar
17-Sep-2021 13:54:05 [INFO] Configured Artifact: org.openmrs.module:adminui-omod:1.5.0:jar
17-Sep-2021 13:54:05 [INFO] Configured Artifact: org.openmrs.module:registrationcore-omod:1.11.0:jar
17-Sep-2021 13:54:05 [INFO] Configured Artifact: org.openmrs.module:appointmentscheduling-omod:1.16.0:jar
17-Sep-2021 13:54:05 [INFO] Configured Artifact: org.openmrs.module:atlas-omod:2.2.5:omod
17-Sep-2021 13:54:05 [INFO] Configured Artifact: org.openmrs.module:calculation-omod:1.3.0:jar
17-Sep-2021 13:54:05 [INFO] Configured Artifact: org.openmrs.module:webservices.rest-omod:2.32.0-SNAPSHOT:jar
17-Sep-2021 13:54:05 [INFO] Configured Artifact: org.openmrs.module:spa-omod:1.0.8:jar
17-Sep-2021 13:54:05 [INFO] Configured Artifact: org.openmrs.module:uicommons-omod:2.18.0:jar
17-Sep-2021 13:54:05 [INFO] Configured Artifact: org.openmrs.module:uiframework-omod:3.21.0:jar
17-Sep-2021 13:54:05 [INFO] Configured Artifact: org.openmrs.module:metadatasharing-omod:1.8.0:jar
17-Sep-2021 13:54:05 [INFO] Copying addresshierarchy-omod-2.14.2.jar to /home/bamboo-agent/bamboo-agent/xml-data/build-dir/REFAPP-UI-FRAMEWORK/package/target/bundled-distro/web/WEB-INF/bundledModules/addresshierarchy-2.14.2.omod
17-Sep-2021 13:54:05 [INFO] Copying legacyui-omod-1.8.3.jar to /home/bamboo-agent/bamboo-agent/xml-data/build-dir/REFAPP-UI-FRAMEWORK/package/target/bundled-distro/web/WEB-INF/bundledModules/legacyui-1.8.3.omod
17-Sep-2021 13:54:05 [INFO] Copying openconceptlab-omod-1.2.6.jar to /home/bamboo-agent/bamboo-agent/xml-data/build-dir/REFAPP-UI-FRAMEWORK/package/target/bundled-distro/web/WEB-INF/bundledModules/openconceptlab-1.2.6.omod
17-Sep-2021 13:54:05 [INFO] Copying metadatadeploy-omod-1.13.0.jar to /home/bamboo-agent/bamboo-agent/xml-data/build-dir/REFAPP-UI-FRAMEWORK/package/target/bundled-distro/web/WEB-INF/bundledModules/metadatadeploy-1.13.0.omod
17-Sep-2021 13:54:05 [INFO] Copying reportingrest-omod-1.12.0.jar to /home/bamboo-agent/bamboo-agent/xml-data/build-dir/REFAPP-UI-FRAMEWORK/package/target/bundled-distro/web/WEB-INF/bundledModules/reportingrest-1.12.0.omod
17-Sep-2021 13:54:05 [INFO] Copying owa-omod-1.13.0.jar to /home/bamboo-agent/bamboo-agent/xml-data/build-dir/REFAPP-UI-FRAMEWORK/package/target/bundled-distro/web/WEB-INF/bundledModules/owa-1.13.0.omod
17-Sep-2021 13:54:05 [INFO] Copying fhir2-omod-1.2.2.jar to /home/bamboo-agent/bamboo-agent/xml-data/build-dir/REFAPP-UI-FRAMEWORK/package/target/bundled-distro/web/WEB-INF/bundledModules/fhir2-1.2.2.omod
17-Sep-2021 13:54:05 [INFO] Copying serialization.xstream-omod-0.2.15.omod to /home/bamboo-agent/bamboo-agent/xml-data/build-dir/REFAPP-UI-FRAMEWORK/package/target/bundled-distro/web/WEB-INF/bundledModules/serialization.xstream-0.2.15.omod
17-Sep-2021 13:54:05 [INFO] Copying registrationapp-omod-1.24.0.jar to /home/bamboo-agent/bamboo-agent/xml-data/build-dir/REFAPP-UI-FRAMEWORK/package/target/bundled-distro/web/WEB-INF/bundledModules/registrationapp-1.24.0.omod
17-Sep-2021 13:54:05 [INFO] Copying event-omod-2.10.0-SNAPSHOT.jar to /home/bamboo-agent/bamboo-agent/xml-data/build-dir/REFAPP-UI-FRAMEWORK/package/target/bundled-distro/web/WEB-INF/bundledModules/event-2.10.0-SNAPSHOT.omod
17-Sep-2021 13:54:05 [INFO] Copying uilibrary-omod-2.0.7.jar to /home/bamboo-agent/bamboo-agent/xml-data/build-dir/REFAPP-UI-FRAMEWORK/package/target/bundled-distro/web/WEB-INF/bundledModules/uilibrary-2.0.7.omod
17-Sep-2021 13:54:05 [INFO] Copying htmlwidgets-omod-1.10.0.jar to /home/bamboo-agent/bamboo-agent/xml-data/build-dir/REFAPP-UI-FRAMEWORK/package/target/bundled-distro/web/WEB-INF/bundledModules/htmlwidgets-1.10.0.omod
17-Sep-2021 13:54:05 [INFO] Copying dataexchange-omod-1.3.7.jar to /home/bamboo-agent/bamboo-agent/xml-data/build-dir/REFAPP-UI-FRAMEWORK/package/target/bundled-distro/web/WEB-INF/bundledModules/dataexchange-1.3.7.omod
17-Sep-2021 13:54:05 [INFO] Copying appui-omod-1.14.0.jar to /home/bamboo-agent/bamboo-agent/xml-data/build-dir/REFAPP-UI-FRAMEWORK/package/target/bundled-distro/web/WEB-INF/bundledModules/appui-1.14.0.omod
17-Sep-2021 13:54:05 [INFO] Copying allergyui-omod-1.8.4.jar to /home/bamboo-agent/bamboo-agent/xml-data/build-dir/REFAPP-UI-FRAMEWORK/package/target/bundled-distro/web/WEB-INF/bundledModules/allergyui-1.8.4.omod
17-Sep-2021 13:54:05 [INFO] Copying providermanagement-omod-2.13.0.jar to /home/bamboo-agent/bamboo-agent/xml-data/build-dir/REFAPP-UI-FRAMEWORK/package/target/bundled-distro/web/WEB-INF/bundledModules/providermanagement-2.13.0.omod
17-Sep-2021 13:54:05 [INFO] Copying appointmentschedulingui-omod-1.12.0.jar to /home/bamboo-agent/bamboo-agent/xml-data/build-dir/REFAPP-UI-FRAMEWORK/package/target/bundled-distro/web/WEB-INF/bundledModules/appointmentschedulingui-1.12.0.omod
17-Sep-2021 13:54:05 [INFO] Copying attachments-omod-2.5.0.jar to /home/bamboo-agent/bamboo-agent/xml-data/build-dir/REFAPP-UI-FRAMEWORK/package/target/bundled-distro/web/WEB-INF/bundledModules/attachments-2.5.0.omod
17-Sep-2021 13:54:05 [INFO] Copying formentryapp-omod-1.4.2.jar to /home/bamboo-agent/bamboo-agent/xml-data/build-dir/REFAPP-UI-FRAMEWORK/package/target/bundled-distro/web/WEB-INF/bundledModules/formentryapp-1.4.2.omod
17-Sep-2021 13:54:05 [INFO] Copying idgen-omod-4.7.0.jar to /home/bamboo-agent/bamboo-agent/xml-data/build-dir/REFAPP-UI-FRAMEWORK/package/target/bundled-distro/web/WEB-INF/bundledModules/idgen-4.7.0.omod
17-Sep-2021 13:54:05 [INFO] Copying metadatamapping-omod-1.4.0.jar to /home/bamboo-agent/bamboo-agent/xml-data/build-dir/REFAPP-UI-FRAMEWORK/package/target/bundled-distro/web/WEB-INF/bundledModules/metadatamapping-1.4.0.omod
17-Sep-2021 13:54:05 [INFO] Copying htmlformentryui-omod-2.0.0.jar to /home/bamboo-agent/bamboo-agent/xml-data/build-dir/REFAPP-UI-FRAMEWORK/package/target/bundled-distro/web/WEB-INF/bundledModules/htmlformentryui-2.0.0.omod
17-Sep-2021 13:54:05 [INFO] Copying referencedemodata-omod-1.4.7.jar to /home/bamboo-agent/bamboo-agent/xml-data/build-dir/REFAPP-UI-FRAMEWORK/package/target/bundled-distro/web/WEB-INF/bundledModules/referencedemodata-1.4.7.omod
17-Sep-2021 13:54:05 [INFO] Copying emrapi-omod-1.32.0.jar to /home/bamboo-agent/bamboo-agent/xml-data/build-dir/REFAPP-UI-FRAMEWORK/package/target/bundled-distro/web/WEB-INF/bundledModules/emrapi-1.32.0.omod
17-Sep-2021 13:54:05 [INFO] Copying referenceapplication-omod-2.12.0-SNAPSHOT.jar to /home/bamboo-agent/bamboo-agent/xml-data/build-dir/REFAPP-UI-FRAMEWORK/package/target/bundled-distro/web/WEB-INF/bundledModules/referenceapplication-2.12.0-SNAPSHOT.omod
17-Sep-2021 13:54:05 [INFO] Copying htmlformentry-omod-4.1.0.jar to /home/bamboo-agent/bamboo-agent/xml-data/build-dir/REFAPP-UI-FRAMEWORK/package/target/bundled-distro/web/WEB-INF/bundledModules/htmlformentry-4.1.0.omod
17-Sep-2021 13:54:05 [INFO] Copying appframework-omod-2.16.0.jar to /home/bamboo-agent/bamboo-agent/xml-data/build-dir/REFAPP-UI-FRAMEWORK/package/target/bundled-distro/web/WEB-INF/bundledModules/appframework-2.16.0.omod
17-Sep-2021 13:54:05 [INFO] Copying referencemetadata-omod-2.12.0.jar to /home/bamboo-agent/bamboo-agent/xml-data/build-dir/REFAPP-UI-FRAMEWORK/package/target/bundled-distro/web/WEB-INF/bundledModules/referencemetadata-2.12.0.omod
17-Sep-2021 13:54:05 [INFO] Copying reportingui-omod-1.8.0.jar to /home/bamboo-agent/bamboo-agent/xml-data/build-dir/REFAPP-UI-FRAMEWORK/package/target/bundled-distro/web/WEB-INF/bundledModules/reportingui-1.8.0.omod
17-Sep-2021 13:54:05 [INFO] Copying coreapps-omod-1.34.0-SNAPSHOT.jar to /home/bamboo-agent/bamboo-agent/xml-data/build-dir/REFAPP-UI-FRAMEWORK/package/target/bundled-distro/web/WEB-INF/bundledModules/coreapps-1.34.0-SNAPSHOT.omod
17-Sep-2021 13:54:05 [INFO] Copying reportingcompatibility-omod-2.0.8.jar to /home/bamboo-agent/bamboo-agent/xml-data/build-dir/REFAPP-UI-FRAMEWORK/package/target/bundled-distro/web/WEB-INF/bundledModules/reportingcompatibility-2.0.8.omod
17-Sep-2021 13:54:05 [INFO] Copying reporting-omod-1.23.0.jar to /home/bamboo-agent/bamboo-agent/xml-data/build-dir/REFAPP-UI-FRAMEWORK/package/target/bundled-distro/web/WEB-INF/bundledModules/reporting-1.23.0.omod
17-Sep-2021 13:54:05 [INFO] Copying adminui-omod-1.5.0.jar to /home/bamboo-agent/bamboo-agent/xml-data/build-dir/REFAPP-UI-FRAMEWORK/package/target/bundled-distro/web/WEB-INF/bundledModules/adminui-1.5.0.omod
17-Sep-2021 13:54:05 [INFO] Copying registrationcore-omod-1.11.0.jar to /home/bamboo-agent/bamboo-agent/xml-data/build-dir/REFAPP-UI-FRAMEWORK/package/target/bundled-distro/web/WEB-INF/bundledModules/registrationcore-1.11.0.omod
17-Sep-2021 13:54:05 [INFO] Copying appointmentscheduling-omod-1.16.0.jar to /home/bamboo-agent/bamboo-agent/xml-data/build-dir/REFAPP-UI-FRAMEWORK/package/target/bundled-distro/web/WEB-INF/bundledModules/appointmentscheduling-1.16.0.omod
17-Sep-2021 13:54:05 [INFO] Copying atlas-omod-2.2.5.omod to /home/bamboo-agent/bamboo-agent/xml-data/build-dir/REFAPP-UI-FRAMEWORK/package/target/bundled-distro/web/WEB-INF/bundledModules/atlas-2.2.5.omod
17-Sep-2021 13:54:05 [INFO] Copying calculation-omod-1.3.0.jar to /home/bamboo-agent/bamboo-agent/xml-data/build-dir/REFAPP-UI-FRAMEWORK/package/target/bundled-distro/web/WEB-INF/bundledModules/calculation-1.3.0.omod
17-Sep-2021 13:54:05 [INFO] Copying webservices.rest-omod-2.32.0-SNAPSHOT.jar to /home/bamboo-agent/bamboo-agent/xml-data/build-dir/REFAPP-UI-FRAMEWORK/package/target/bundled-distro/web/WEB-INF/bundledModules/webservices.rest-2.32.0-SNAPSHOT.omod
17-Sep-2021 13:54:05 [INFO] Copying spa-omod-1.0.8.jar to /home/bamboo-agent/bamboo-agent/xml-data/build-dir/REFAPP-UI-FRAMEWORK/package/target/bundled-distro/web/WEB-INF/bundledModules/spa-1.0.8.omod
17-Sep-2021 13:54:05 [INFO] Copying uicommons-omod-2.18.0.jar to /home/bamboo-agent/bamboo-agent/xml-data/build-dir/REFAPP-UI-FRAMEWORK/package/target/bundled-distro/web/WEB-INF/bundledModules/uicommons-2.18.0.omod
17-Sep-2021 13:54:05 [INFO] Copying uiframework-omod-3.21.0.jar to /home/bamboo-agent/bamboo-agent/xml-data/build-dir/REFAPP-UI-FRAMEWORK/package/target/bundled-distro/web/WEB-INF/bundledModules/uiframework-3.21.0.omod
17-Sep-2021 13:54:06 [INFO] Copying metadatasharing-omod-1.8.0.jar to /home/bamboo-agent/bamboo-agent/xml-data/build-dir/REFAPP-UI-FRAMEWORK/package/target/bundled-distro/web/WEB-INF/bundledModules/metadatasharing-1.8.0.omod
17-Sep-2021 13:54:06
17-Sep-2021 13:54:06 Downloading OWAs...
17-Sep-2021 13:54:06
17-Sep-2021 13:54:06
17-Sep-2021 13:54:06 Downloading OWA: org.openmrs.owa:openmrs-owa-sysadmin:1.2
17-Sep-2021 13:54:06 [INFO] Configured Artifact: org.openmrs.owa:sysadmin:1.2:zip
17-Sep-2021 13:54:06 [INFO] Copying sysadmin-1.2.zip to /home/bamboo-agent/bamboo-agent/xml-data/build-dir/REFAPP-UI-FRAMEWORK/package/target/bundled-distro/web/WEB-INF/bundledOwas/sysadmin-1.2.zip
17-Sep-2021 13:54:07
17-Sep-2021 13:54:07 Creating Docker Compose configuration...
17-Sep-2021 13:54:07
17-Sep-2021 13:54:09
17-Sep-2021 13:54:09 The 'referenceapplication' distribution created! To start up the server run 'docker-compose up' from /home/bamboo-agent/bamboo-agent/xml-data/build-dir/REFAPP-UI-FRAMEWORK/package/target/bundled-distro
17-Sep-2021 13:54:09
17-Sep-2021 13:54:09 [INFO]
17-Sep-2021 13:54:09 [INFO] --- maven-compiler-plugin:3.1:compile (default-compile) @ referenceapplication-package ---
17-Sep-2021 13:54:09 [INFO] No sources to compile
17-Sep-2021 13:54:09 [INFO]
17-Sep-2021 13:54:09 [INFO] --- maven-resources-plugin:2.6:testResources (default-testResources) @ referenceapplication-package ---
17-Sep-2021 13:54:09 [INFO] Using 'UTF-8' encoding to copy filtered resources.
17-Sep-2021 13:54:09 [INFO] skip non existing resourceDirectory /home/bamboo-agent/bamboo-agent/xml-data/build-dir/REFAPP-UI-FRAMEWORK/package/src/test/resources
17-Sep-2021 13:54:09 [INFO] skip non existing resourceDirectory /home/bamboo-agent/bamboo-agent/xml-data/build-dir/REFAPP-UI-FRAMEWORK/package/src/test/resources
17-Sep-2021 13:54:09 [INFO]
17-Sep-2021 13:54:09 [INFO] --- maven-compiler-plugin:3.1:testCompile (default-testCompile) @ referenceapplication-package ---
17-Sep-2021 13:54:09 [INFO] No sources to compile
17-Sep-2021 13:54:09 [INFO]
17-Sep-2021 13:54:09 [INFO] --- maven-surefire-plugin:2.12:test (default-test) @ referenceapplication-package ---
17-Sep-2021 13:54:09 [INFO] No tests to run.
17-Sep-2021 13:54:09 [INFO] Surefire report directory: /home/bamboo-agent/bamboo-agent/xml-data/build-dir/REFAPP-UI-FRAMEWORK/package/target/surefire-reports
17-Sep-2021 13:54:10
17-Sep-2021 13:54:10 -------------------------------------------------------
17-Sep-2021 13:54:10 T E S T S
17-Sep-2021 13:54:10 -------------------------------------------------------
17-Sep-2021 13:54:17
17-Sep-2021 13:54:17 Results :
17-Sep-2021 13:54:17
17-Sep-2021 13:54:17 Tests run: 0, Failures: 0, Errors: 0, Skipped: 0
17-Sep-2021 13:54:17
17-Sep-2021 13:54:17 [INFO]
17-Sep-2021 13:54:17 [INFO] --- maven-jar-plugin:2.4:jar (default-jar) @ referenceapplication-package ---
17-Sep-2021 13:54:17 [INFO] Building jar: /home/bamboo-agent/bamboo-agent/xml-data/build-dir/REFAPP-UI-FRAMEWORK/package/target/referenceapplication-package-2.12.0-SNAPSHOT.jar
17-Sep-2021 13:54:17 [INFO]
17-Sep-2021 13:54:17 [INFO] --- maven-assembly-plugin:2.3:single (make-assembly) @ referenceapplication-package ---
17-Sep-2021 13:54:18 [INFO] Reading assembly descriptor: /home/bamboo-agent/bamboo-agent/xml-data/build-dir/REFAPP-UI-FRAMEWORK/package/src/main/assembly/assembly.xml
17-Sep-2021 13:54:18 [INFO] Building zip: /home/bamboo-agent/bamboo-agent/xml-data/build-dir/REFAPP-UI-FRAMEWORK/package/target/referenceapplication-package-2.12.0-SNAPSHOT-addons.zip
17-Sep-2021 13:54:23 [INFO]
17-Sep-2021 13:54:23 [INFO] --- build-helper-maven-plugin:3.0.0:attach-artifact (attach-artifacts) @ referenceapplication-package ---
17-Sep-2021 13:54:23 [INFO]
17-Sep-2021 13:54:23 [INFO] --- maven-jar-plugin:2.4:test-jar (default) @ referenceapplication-package ---
17-Sep-2021 13:54:23 [WARNING] JAR will be empty - no content was marked for inclusion!
17-Sep-2021 13:54:23 [INFO] Building jar: /home/bamboo-agent/bamboo-agent/xml-data/build-dir/REFAPP-UI-FRAMEWORK/package/target/referenceapplication-package-2.12.0-SNAPSHOT-tests.jar
17-Sep-2021 13:54:23 [INFO]
17-Sep-2021 13:54:23 [INFO] --- maven-install-plugin:2.4:install (default-install) @ referenceapplication-package ---
17-Sep-2021 13:54:23 [INFO] Installing /home/bamboo-agent/bamboo-agent/xml-data/build-dir/REFAPP-UI-FRAMEWORK/package/target/referenceapplication-package-2.12.0-SNAPSHOT.jar to /home/bamboo-agent/.m2/repository/org/openmrs/distro/referenceapplication-package/2.12.0-SNAPSHOT/referenceapplication-package-2.12.0-SNAPSHOT.jar
17-Sep-2021 13:54:23 [INFO] Installing /home/bamboo-agent/bamboo-agent/xml-data/build-dir/REFAPP-UI-FRAMEWORK/package/pom.xml to /home/bamboo-agent/.m2/repository/org/openmrs/distro/referenceapplication-package/2.12.0-SNAPSHOT/referenceapplication-package-2.12.0-SNAPSHOT.pom
17-Sep-2021 13:54:24 [INFO] Installing /home/bamboo-agent/bamboo-agent/xml-data/build-dir/REFAPP-UI-FRAMEWORK/package/target/referenceapplication-package-2.12.0-SNAPSHOT-addons.zip to /home/bamboo-agent/.m2/repository/org/openmrs/distro/referenceapplication-package/2.12.0-SNAPSHOT/referenceapplication-package-2.12.0-SNAPSHOT-addons.zip
17-Sep-2021 13:54:24 [INFO] Installing /home/bamboo-agent/bamboo-agent/xml-data/build-dir/REFAPP-UI-FRAMEWORK/package/target/bundled-distro/web/openmrs.war to /home/bamboo-agent/.m2/repository/org/openmrs/distro/referenceapplication-package/2.12.0-SNAPSHOT/referenceapplication-package-2.12.0-SNAPSHOT.war
17-Sep-2021 13:54:24 [INFO] Installing /home/bamboo-agent/bamboo-agent/xml-data/build-dir/REFAPP-UI-FRAMEWORK/package/target/referenceapplication-package-2.12.0-SNAPSHOT-tests.jar to /home/bamboo-agent/.m2/repository/org/openmrs/distro/referenceapplication-package/2.12.0-SNAPSHOT/referenceapplication-package-2.12.0-SNAPSHOT-tests.jar
17-Sep-2021 13:54:24 [INFO]                                                                         
17-Sep-2021 13:54:24 [INFO] ------------------------------------------------------------------------
17-Sep-2021 13:54:24 [INFO] Building Reference Application Distribution UI Tests 2.12.0-SNAPSHOT
17-Sep-2021 13:54:24 [INFO] ------------------------------------------------------------------------
17-Sep-2021 13:54:25 [INFO]
17-Sep-2021 13:54:25 [INFO] --- maven-clean-plugin:2.5:clean (default-clean) @ referenceapplication-ui-tests ---
17-Sep-2021 13:54:25 [INFO]
17-Sep-2021 13:54:25 [INFO] --- maven-resources-plugin:2.6:resources (default-resources) @ referenceapplication-ui-tests ---
17-Sep-2021 13:54:25 [INFO] Using 'UTF-8' encoding to copy filtered resources.
17-Sep-2021 13:54:25 [INFO] skip non existing resourceDirectory /home/bamboo-agent/bamboo-agent/xml-data/build-dir/REFAPP-UI-FRAMEWORK/ui-tests/src/main/resources
17-Sep-2021 13:54:25 [INFO]
17-Sep-2021 13:54:25 [INFO] --- maven-compiler-plugin:3.1:compile (default-compile) @ referenceapplication-ui-tests ---
17-Sep-2021 13:54:25 [INFO] No sources to compile
17-Sep-2021 13:54:25 [INFO]
17-Sep-2021 13:54:25 [INFO] --- maven-resources-plugin:2.6:testResources (default-testResources) @ referenceapplication-ui-tests ---
17-Sep-2021 13:54:25 [INFO] Using 'UTF-8' encoding to copy filtered resources.
17-Sep-2021 13:54:25 [INFO] Copying 2 resources
17-Sep-2021 13:54:27 [INFO] Copying 2 resources
17-Sep-2021 13:54:27 [INFO]
17-Sep-2021 13:54:27 [INFO] --- maven-compiler-plugin:3.1:testCompile (default-testCompile) @ referenceapplication-ui-tests ---
17-Sep-2021 13:54:27 [INFO] Changes detected - recompiling the module!
17-Sep-2021 13:54:27 [INFO] Compiling 121 source files to /home/bamboo-agent/bamboo-agent/xml-data/build-dir/REFAPP-UI-FRAMEWORK/ui-tests/target/test-classes
17-Sep-2021 13:54:33 [WARNING] /home/bamboo-agent/bamboo-agent/xml-data/build-dir/REFAPP-UI-FRAMEWORK/ui-tests/src/test/java/org/openmrs/reference/AddDeleteLocationTest.java: Some input files use or override a deprecated API.
17-Sep-2021 13:54:33 [WARNING] /home/bamboo-agent/bamboo-agent/xml-data/build-dir/REFAPP-UI-FRAMEWORK/ui-tests/src/test/java/org/openmrs/reference/AddDeleteLocationTest.java: Recompile with -Xlint:deprecation for details.
17-Sep-2021 13:54:33 [WARNING] /home/bamboo-agent/bamboo-agent/xml-data/build-dir/REFAPP-UI-FRAMEWORK/ui-tests/src/test/java/org/openmrs/reference/AddRolesToUserTest.java: /home/bamboo-agent/bamboo-agent/xml-data/build-dir/REFAPP-UI-FRAMEWORK/ui-tests/src/test/java/org/openmrs/reference/AddRolesToUserTest.java uses unchecked or unsafe operations.
17-Sep-2021 13:54:33 [WARNING] /home/bamboo-agent/bamboo-agent/xml-data/build-dir/REFAPP-UI-FRAMEWORK/ui-tests/src/test/java/org/openmrs/reference/AddRolesToUserTest.java: Recompile with -Xlint:unchecked for details.
17-Sep-2021 13:54:33 [INFO]
17-Sep-2021 13:54:33 [INFO] --- maven-antrun-plugin:1.8:run (make-mac-chromedriver-executable) @ referenceapplication-ui-tests ---
17-Sep-2021 13:54:34 [INFO] Executing tasks
17-Sep-2021 13:54:34
17-Sep-2021 13:54:34 main:
17-Sep-2021 13:54:34 [INFO] An Ant BuildException has occured: /home/bamboo-agent/bamboo-agent/xml-data/build-dir/REFAPP-UI-FRAMEWORK/ui-tests/target/test-classes/chromedriver/mac does not exist.
17-Sep-2021 13:54:34 around Ant part ...<chmod file="target/test-classes/chromedriver/mac/chromedriver" perm="755"/>... @ 4:79 in /home/bamboo-agent/bamboo-agent/xml-data/build-dir/REFAPP-UI-FRAMEWORK/ui-tests/target/antrun/build-main.xml
17-Sep-2021 13:54:34 /home/bamboo-agent/bamboo-agent/xml-data/build-dir/REFAPP-UI-FRAMEWORK/ui-tests/target/antrun/build-main.xml:4: /home/bamboo-agent/bamboo-agent/xml-data/build-dir/REFAPP-UI-FRAMEWORK/ui-tests/target/test-classes/chromedriver/mac does not exist.
17-Sep-2021 13:54:34         at org.apache.tools.ant.types.AbstractFileSet.getDirectoryScanner(AbstractFileSet.java:484)
17-Sep-2021 13:54:34         at org.apache.tools.ant.taskdefs.ExecuteOn.runExec(ExecuteOn.java:369)
17-Sep-2021 13:54:34         at org.apache.tools.ant.taskdefs.ExecTask.execute(ExecTask.java:495)
17-Sep-2021 13:54:34         at org.apache.tools.ant.taskdefs.Chmod.execute(Chmod.java:181)
17-Sep-2021 13:54:34         at org.apache.tools.ant.UnknownElement.execute(UnknownElement.java:292)
17-Sep-2021 13:54:34         at sun.reflect.NativeMethodAccessorImpl.invoke0(Native Method)
17-Sep-2021 13:54:34         at sun.reflect.NativeMethodAccessorImpl.invoke(NativeMethodAccessorImpl.java:62)
17-Sep-2021 13:54:34         at sun.reflect.DelegatingMethodAccessorImpl.invoke(DelegatingMethodAccessorImpl.java:43)
17-Sep-2021 13:54:34         at java.lang.reflect.Method.invoke(Method.java:498)
17-Sep-2021 13:54:34         at org.apache.tools.ant.dispatch.DispatchUtils.execute(DispatchUtils.java:106)
17-Sep-2021 13:54:34         at org.apache.tools.ant.Task.perform(Task.java:348)
17-Sep-2021 13:54:34         at org.apache.tools.ant.Target.execute(Target.java:435)
17-Sep-2021 13:54:34         at org.apache.tools.ant.Target.performTasks(Target.java:456)
17-Sep-2021 13:54:34         at org.apache.tools.ant.Project.executeSortedTargets(Project.java:1393)
17-Sep-2021 13:54:34         at org.apache.tools.ant.Project.executeTarget(Project.java:1364)
17-Sep-2021 13:54:34         at org.apache.maven.plugin.antrun.AntRunMojo.execute(AntRunMojo.java:313)
17-Sep-2021 13:54:34         at org.apache.maven.plugin.DefaultBuildPluginManager.executeMojo(DefaultBuildPluginManager.java:134)
17-Sep-2021 13:54:34         at org.apache.maven.lifecycle.internal.MojoExecutor.execute(MojoExecutor.java:207)
17-Sep-2021 13:54:34         at org.apache.maven.lifecycle.internal.MojoExecutor.execute(MojoExecutor.java:153)
17-Sep-2021 13:54:34         at org.apache.maven.lifecycle.internal.MojoExecutor.execute(MojoExecutor.java:145)
17-Sep-2021 13:54:34         at org.apache.maven.lifecycle.internal.LifecycleModuleBuilder.buildProject(LifecycleModuleBuilder.java:116)
17-Sep-2021 13:54:34         at org.apache.maven.lifecycle.internal.LifecycleModuleBuilder.buildProject(LifecycleModuleBuilder.java:80)
17-Sep-2021 13:54:34         at org.apache.maven.lifecycle.internal.builder.singlethreaded.SingleThreadedBuilder.build(SingleThreadedBuilder.java:51)
17-Sep-2021 13:54:34         at org.apache.maven.lifecycle.internal.LifecycleStarter.execute(LifecycleStarter.java:128)
17-Sep-2021 13:54:34         at org.apache.maven.DefaultMaven.doExecute(DefaultMaven.java:307)
17-Sep-2021 13:54:34         at org.apache.maven.DefaultMaven.doExecute(DefaultMaven.java:193)
17-Sep-2021 13:54:34         at org.apache.maven.DefaultMaven.execute(DefaultMaven.java:106)
17-Sep-2021 13:54:34         at org.apache.maven.cli.MavenCli.execute(MavenCli.java:863)
17-Sep-2021 13:54:34         at org.apache.maven.cli.MavenCli.doMain(MavenCli.java:288)
17-Sep-2021 13:54:34         at org.apache.maven.cli.MavenCli.main(MavenCli.java:199)
17-Sep-2021 13:54:34         at sun.reflect.NativeMethodAccessorImpl.invoke0(Native Method)
17-Sep-2021 13:54:34         at sun.reflect.NativeMethodAccessorImpl.invoke(NativeMethodAccessorImpl.java:62)
17-Sep-2021 13:54:34         at sun.reflect.DelegatingMethodAccessorImpl.invoke(DelegatingMethodAccessorImpl.java:43)
17-Sep-2021 13:54:34         at java.lang.reflect.Method.invoke(Method.java:498)
17-Sep-2021 13:54:34         at org.codehaus.plexus.classworlds.launcher.Launcher.launchEnhanced(Launcher.java:289)
17-Sep-2021 13:54:34         at org.codehaus.plexus.classworlds.launcher.Launcher.launch(Launcher.java:229)
17-Sep-2021 13:54:34         at org.codehaus.plexus.classworlds.launcher.Launcher.mainWithExitCode(Launcher.java:415)
17-Sep-2021 13:54:34         at org.codehaus.plexus.classworlds.launcher.Launcher.main(Launcher.java:356)
17-Sep-2021 13:54:34 [INFO]
17-Sep-2021 13:54:34 [INFO] --- maven-antrun-plugin:1.8:run (make-linux-chromedriver-executable) @ referenceapplication-ui-tests ---
17-Sep-2021 13:54:34 [INFO] Executing tasks
17-Sep-2021 13:54:34
17-Sep-2021 13:54:34 main:
17-Sep-2021 13:54:34 [INFO] Executed tasks
17-Sep-2021 13:54:34 [INFO]
17-Sep-2021 13:54:34 [INFO] --- maven-antrun-plugin:1.8:run (make-mac-firefoxdriver-executable) @ referenceapplication-ui-tests ---
17-Sep-2021 13:54:34 [INFO] Executing tasks
17-Sep-2021 13:54:34
17-Sep-2021 13:54:34 main:
17-Sep-2021 13:54:34 [INFO] An Ant BuildException has occured: /home/bamboo-agent/bamboo-agent/xml-data/build-dir/REFAPP-UI-FRAMEWORK/ui-tests/target/test-classes/firefoxdriver/mac does not exist.
17-Sep-2021 13:54:34 around Ant part ...<chmod file="target/test-classes/firefoxdriver/mac/geckodriver" perm="755"/>... @ 4:79 in /home/bamboo-agent/bamboo-agent/xml-data/build-dir/REFAPP-UI-FRAMEWORK/ui-tests/target/antrun/build-main.xml
17-Sep-2021 13:54:34 /home/bamboo-agent/bamboo-agent/xml-data/build-dir/REFAPP-UI-FRAMEWORK/ui-tests/target/antrun/build-main.xml:4: /home/bamboo-agent/bamboo-agent/xml-data/build-dir/REFAPP-UI-FRAMEWORK/ui-tests/target/test-classes/firefoxdriver/mac does not exist.
17-Sep-2021 13:54:34         at org.apache.tools.ant.types.AbstractFileSet.getDirectoryScanner(AbstractFileSet.java:484)
17-Sep-2021 13:54:34         at org.apache.tools.ant.taskdefs.ExecuteOn.runExec(ExecuteOn.java:369)
17-Sep-2021 13:54:34         at org.apache.tools.ant.taskdefs.ExecTask.execute(ExecTask.java:495)
17-Sep-2021 13:54:34         at org.apache.tools.ant.taskdefs.Chmod.execute(Chmod.java:181)
17-Sep-2021 13:54:34         at org.apache.tools.ant.UnknownElement.execute(UnknownElement.java:292)
17-Sep-2021 13:54:34         at sun.reflect.NativeMethodAccessorImpl.invoke0(Native Method)
17-Sep-2021 13:54:34         at sun.reflect.NativeMethodAccessorImpl.invoke(NativeMethodAccessorImpl.java:62)
17-Sep-2021 13:54:34         at sun.reflect.DelegatingMethodAccessorImpl.invoke(DelegatingMethodAccessorImpl.java:43)
17-Sep-2021 13:54:34         at java.lang.reflect.Method.invoke(Method.java:498)
17-Sep-2021 13:54:34         at org.apache.tools.ant.dispatch.DispatchUtils.execute(DispatchUtils.java:106)
17-Sep-2021 13:54:34         at org.apache.tools.ant.Task.perform(Task.java:348)
17-Sep-2021 13:54:34         at org.apache.tools.ant.Target.execute(Target.java:435)
17-Sep-2021 13:54:34         at org.apache.tools.ant.Target.performTasks(Target.java:456)
17-Sep-2021 13:54:34         at org.apache.tools.ant.Project.executeSortedTargets(Project.java:1393)
17-Sep-2021 13:54:34         at org.apache.tools.ant.Project.executeTarget(Project.java:1364)
17-Sep-2021 13:54:34         at org.apache.maven.plugin.antrun.AntRunMojo.execute(AntRunMojo.java:313)
17-Sep-2021 13:54:34         at org.apache.maven.plugin.DefaultBuildPluginManager.executeMojo(DefaultBuildPluginManager.java:134)
17-Sep-2021 13:54:34         at org.apache.maven.lifecycle.internal.MojoExecutor.execute(MojoExecutor.java:207)
17-Sep-2021 13:54:34         at org.apache.maven.lifecycle.internal.MojoExecutor.execute(MojoExecutor.java:153)
17-Sep-2021 13:54:34         at org.apache.maven.lifecycle.internal.MojoExecutor.execute(MojoExecutor.java:145)
17-Sep-2021 13:54:34         at org.apache.maven.lifecycle.internal.LifecycleModuleBuilder.buildProject(LifecycleModuleBuilder.java:116)
17-Sep-2021 13:54:34         at org.apache.maven.lifecycle.internal.LifecycleModuleBuilder.buildProject(LifecycleModuleBuilder.java:80)
17-Sep-2021 13:54:34         at org.apache.maven.lifecycle.internal.builder.singlethreaded.SingleThreadedBuilder.build(SingleThreadedBuilder.java:51)
17-Sep-2021 13:54:34         at org.apache.maven.lifecycle.internal.LifecycleStarter.execute(LifecycleStarter.java:128)
17-Sep-2021 13:54:34         at org.apache.maven.DefaultMaven.doExecute(DefaultMaven.java:307)
17-Sep-2021 13:54:34         at org.apache.maven.DefaultMaven.doExecute(DefaultMaven.java:193)
17-Sep-2021 13:54:34         at org.apache.maven.DefaultMaven.execute(DefaultMaven.java:106)
17-Sep-2021 13:54:34         at org.apache.maven.cli.MavenCli.execute(MavenCli.java:863)
17-Sep-2021 13:54:34         at org.apache.maven.cli.MavenCli.doMain(MavenCli.java:288)
17-Sep-2021 13:54:34         at org.apache.maven.cli.MavenCli.main(MavenCli.java:199)
17-Sep-2021 13:54:34         at sun.reflect.NativeMethodAccessorImpl.invoke0(Native Method)
17-Sep-2021 13:54:34         at sun.reflect.NativeMethodAccessorImpl.invoke(NativeMethodAccessorImpl.java:62)
17-Sep-2021 13:54:34         at sun.reflect.DelegatingMethodAccessorImpl.invoke(DelegatingMethodAccessorImpl.java:43)
17-Sep-2021 13:54:34         at java.lang.reflect.Method.invoke(Method.java:498)
17-Sep-2021 13:54:34         at org.codehaus.plexus.classworlds.launcher.Launcher.launchEnhanced(Launcher.java:289)
17-Sep-2021 13:54:34         at org.codehaus.plexus.classworlds.launcher.Launcher.launch(Launcher.java:229)
17-Sep-2021 13:54:34         at org.codehaus.plexus.classworlds.launcher.Launcher.mainWithExitCode(Launcher.java:415)
17-Sep-2021 13:54:34         at org.codehaus.plexus.classworlds.launcher.Launcher.main(Launcher.java:356)
17-Sep-2021 13:54:34 [INFO]
17-Sep-2021 13:54:34 [INFO] --- maven-antrun-plugin:1.8:run (make-linux-firefoxdriver-executable) @ referenceapplication-ui-tests ---
17-Sep-2021 13:54:34 [INFO] Executing tasks
17-Sep-2021 13:54:34
17-Sep-2021 13:54:34 main:
17-Sep-2021 13:54:35 [INFO] Executed tasks
17-Sep-2021 13:54:35 [INFO]
17-Sep-2021 13:54:35 [INFO] --- maven-surefire-plugin:2.12:test (default-test) @ referenceapplication-ui-tests ---
17-Sep-2021 13:54:35 [INFO] Surefire report directory: /home/bamboo-agent/bamboo-agent/xml-data/build-dir/REFAPP-UI-FRAMEWORK/ui-tests/target/surefire-reports
17-Sep-2021 13:54:35
17-Sep-2021 13:54:35 -------------------------------------------------------
17-Sep-2021 13:54:35 T E S T S
17-Sep-2021 13:54:35 -------------------------------------------------------
17-Sep-2021 13:54:35 Running org.openmrs.reference.UnidentifiedPatientKeyboardTest
17-Sep-2021 13:54:35 Running locally...
17-Sep-2021 13:54:44 Starting ChromeDriver 90.0.4430.24 (4c6d850f087da467d926e8eddb76550aed655991-refs/branch-heads/4430@{#429}) on port 31386
17-Sep-2021 13:54:44 Only local connections are allowed.
17-Sep-2021 13:54:44 Please see https://chromedriver.chromium.org/security-considerations for suggestions on keeping ChromeDriver safe.
17-Sep-2021 13:54:44 ChromeDriver was started successfully.
17-Sep-2021 13:55:01 Sep 17, 2021 1:55:01 PM org.openqa.selenium.remote.ProtocolHandshake createSession
17-Sep-2021 13:55:01 INFO: Detected dialect: W3C
17-Sep-2021 13:55:14 Tests run: 1, Failures: 0, Errors: 0, Skipped: 0, Time elapsed: 38.623 sec
17-Sep-2021 13:55:14 Running org.openmrs.reference.DeleteAllergyTest
17-Sep-2021 13:55:14 Running locally...
17-Sep-2021 13:55:14 Starting ChromeDriver 90.0.4430.24 (4c6d850f087da467d926e8eddb76550aed655991-refs/branch-heads/4430@{#429}) on port 15954
17-Sep-2021 13:55:14 Only local connections are allowed.
17-Sep-2021 13:55:14 Please see https://chromedriver.chromium.org/security-considerations for suggestions on keeping ChromeDriver safe.
17-Sep-2021 13:55:14 ChromeDriver was started successfully.
17-Sep-2021 13:55:14 Sep 17, 2021 1:55:14 PM org.openqa.selenium.remote.ProtocolHandshake createSession
17-Sep-2021 13:55:14 INFO: Detected dialect: W3C
17-Sep-2021 13:55:24 Tests run: 1, Failures: 0, Errors: 0, Skipped: 0, Time elapsed: 9.665 sec
17-Sep-2021 13:55:24 Running org.openmrs.reference.SearchActiveVisitsTest
17-Sep-2021 13:55:24 Running locally...
17-Sep-2021 13:55:24 Starting ChromeDriver 90.0.4430.24 (4c6d850f087da467d926e8eddb76550aed655991-refs/branch-heads/4430@{#429}) on port 25945
17-Sep-2021 13:55:24 Only local connections are allowed.
17-Sep-2021 13:55:24 Please see https://chromedriver.chromium.org/security-considerations for suggestions on keeping ChromeDriver safe.
17-Sep-2021 13:55:24 ChromeDriver was started successfully.
17-Sep-2021 13:55:24 Sep 17, 2021 1:55:24 PM org.openqa.selenium.remote.ProtocolHandshake createSession
17-Sep-2021 13:55:24 INFO: Detected dialect: W3C
17-Sep-2021 13:55:28 Tests run: 1, Failures: 0, Errors: 0, Skipped: 0, Time elapsed: 4.712 sec
17-Sep-2021 13:55:28 Running org.openmrs.reference.AddVisitTypeTest
17-Sep-2021 13:55:28 Running locally...
17-Sep-2021 13:55:28 Starting ChromeDriver 90.0.4430.24 (4c6d850f087da467d926e8eddb76550aed655991-refs/branch-heads/4430@{#429}) on port 9849
17-Sep-2021 13:55:28 Only local connections are allowed.
17-Sep-2021 13:55:28 Please see https://chromedriver.chromium.org/security-considerations for suggestions on keeping ChromeDriver safe.
17-Sep-2021 13:55:28 ChromeDriver was started successfully.
17-Sep-2021 13:55:29 Sep 17, 2021 1:55:29 PM org.openqa.selenium.remote.ProtocolHandshake createSession
17-Sep-2021 13:55:29 INFO: Detected dialect: W3C
17-Sep-2021 13:55:32 Tests run: 1, Failures: 0, Errors: 0, Skipped: 0, Time elapsed: 4.143 sec
17-Sep-2021 13:55:32 Running org.openmrs.reference.FindPatientRecordTest
17-Sep-2021 13:55:32 Running locally...
17-Sep-2021 13:55:32 Starting ChromeDriver 90.0.4430.24 (4c6d850f087da467d926e8eddb76550aed655991-refs/branch-heads/4430@{#429}) on port 18230
17-Sep-2021 13:55:32 Only local connections are allowed.
17-Sep-2021 13:55:32 Please see https://chromedriver.chromium.org/security-considerations for suggestions on keeping ChromeDriver safe.
17-Sep-2021 13:55:32 ChromeDriver was started successfully.
17-Sep-2021 13:55:33 Sep 17, 2021 1:55:33 PM org.openqa.selenium.remote.ProtocolHandshake createSession
17-Sep-2021 13:55:33 INFO: Detected dialect: W3C
17-Sep-2021 13:55:37 Tests run: 1, Failures: 0, Errors: 0, Skipped: 0, Time elapsed: 4.518 sec
17-Sep-2021 13:55:37 Running org.openmrs.reference.EditPersonTest
17-Sep-2021 13:55:37 Running locally...
17-Sep-2021 13:55:37 Starting ChromeDriver 90.0.4430.24 (4c6d850f087da467d926e8eddb76550aed655991-refs/branch-heads/4430@{#429}) on port 15703
17-Sep-2021 13:55:37 Only local connections are allowed.
17-Sep-2021 13:55:37 Please see https://chromedriver.chromium.org/security-considerations for suggestions on keeping ChromeDriver safe.
17-Sep-2021 13:55:37 ChromeDriver was started successfully.
17-Sep-2021 13:55:37 Sep 17, 2021 1:55:37 PM org.openqa.selenium.remote.ProtocolHandshake createSession
17-Sep-2021 13:55:37 INFO: Detected dialect: W3C
17-Sep-2021 13:55:42 Tests run: 1, Failures: 0, Errors: 0, Skipped: 0, Time elapsed: 4.616 sec
17-Sep-2021 13:55:42 Running org.openmrs.reference.RetireLocationTest
17-Sep-2021 13:55:42 Running locally...
17-Sep-2021 13:55:42 Starting ChromeDriver 90.0.4430.24 (4c6d850f087da467d926e8eddb76550aed655991-refs/branch-heads/4430@{#429}) on port 2705
17-Sep-2021 13:55:42 Only local connections are allowed.
17-Sep-2021 13:55:42 Please see https://chromedriver.chromium.org/security-considerations for suggestions on keeping ChromeDriver safe.
17-Sep-2021 13:55:42 ChromeDriver was started successfully.
17-Sep-2021 13:55:42 Sep 17, 2021 1:55:42 PM org.openqa.selenium.remote.ProtocolHandshake createSession
17-Sep-2021 13:55:42 INFO: Detected dialect: W3C
17-Sep-2021 13:55:45 Tests run: 1, Failures: 0, Errors: 0, Skipped: 0, Time elapsed: 3.288 sec
17-Sep-2021 13:55:45 Running org.openmrs.reference.XSSOnPhoneNumberFieldTest
17-Sep-2021 13:55:45 Running locally...
17-Sep-2021 13:55:45 Starting ChromeDriver 90.0.4430.24 (4c6d850f087da467d926e8eddb76550aed655991-refs/branch-heads/4430@{#429}) on port 3226
17-Sep-2021 13:55:45 Only local connections are allowed.
17-Sep-2021 13:55:45 Please see https://chromedriver.chromium.org/security-considerations for suggestions on keeping ChromeDriver safe.
17-Sep-2021 13:55:45 ChromeDriver was started successfully.
17-Sep-2021 13:55:45 Sep 17, 2021 1:55:45 PM org.openqa.selenium.remote.ProtocolHandshake createSession
17-Sep-2021 13:55:45 INFO: Detected dialect: W3C
17-Sep-2021 13:55:55 Tests run: 1, Failures: 0, Errors: 0, Skipped: 0, Time elapsed: 9.994 sec
17-Sep-2021 13:55:55 Running org.openmrs.reference.TransferToWardServiceTest
17-Sep-2021 13:55:55 Running locally...
17-Sep-2021 13:55:55 Starting ChromeDriver 90.0.4430.24 (4c6d850f087da467d926e8eddb76550aed655991-refs/branch-heads/4430@{#429}) on port 4354
17-Sep-2021 13:55:55 Only local connections are allowed.
17-Sep-2021 13:55:55 Please see https://chromedriver.chromium.org/security-considerations for suggestions on keeping ChromeDriver safe.
17-Sep-2021 13:55:55 ChromeDriver was started successfully.
17-Sep-2021 13:55:55 Sep 17, 2021 1:55:55 PM org.openqa.selenium.remote.ProtocolHandshake createSession
17-Sep-2021 13:55:55 INFO: Detected dialect: W3C
17-Sep-2021 13:56:10 Tests run: 1, Failures: 0, Errors: 0, Skipped: 0, Time elapsed: 14.704 sec
17-Sep-2021 13:56:10 Running org.openmrs.reference.EditVisitTypeTest
17-Sep-2021 13:56:10 Running locally...
17-Sep-2021 13:56:10 Starting ChromeDriver 90.0.4430.24 (4c6d850f087da467d926e8eddb76550aed655991-refs/branch-heads/4430@{#429}) on port 18323
17-Sep-2021 13:56:10 Only local connections are allowed.
17-Sep-2021 13:56:10 Please see https://chromedriver.chromium.org/security-considerations for suggestions on keeping ChromeDriver safe.
17-Sep-2021 13:56:10 ChromeDriver was started successfully.
17-Sep-2021 13:56:10 Sep 17, 2021 1:56:10 PM org.openqa.selenium.remote.ProtocolHandshake createSession
17-Sep-2021 13:56:10 INFO: Detected dialect: W3C
17-Sep-2021 13:56:13 Tests run: 1, Failures: 0, Errors: 0, Skipped: 0, Time elapsed: 3.368 sec
17-Sep-2021 13:56:13 Running org.openmrs.reference.ComeBackToApplicationAfterLogoutTest
17-Sep-2021 13:56:13 Running locally...
17-Sep-2021 13:56:13 Starting ChromeDriver 90.0.4430.24 (4c6d850f087da467d926e8eddb76550aed655991-refs/branch-heads/4430@{#429}) on port 2274
17-Sep-2021 13:56:13 Only local connections are allowed.
17-Sep-2021 13:56:13 Please see https://chromedriver.chromium.org/security-considerations for suggestions on keeping ChromeDriver safe.
17-Sep-2021 13:56:13 ChromeDriver was started successfully.
17-Sep-2021 13:56:13 Sep 17, 2021 1:56:13 PM org.openqa.selenium.remote.ProtocolHandshake createSession
17-Sep-2021 13:56:13 INFO: Detected dialect: W3C
17-Sep-2021 13:56:15 Tests run: 1, Failures: 0, Errors: 0, Skipped: 0, Time elapsed: 1.911 sec
17-Sep-2021 13:56:15 Running org.openmrs.reference.EditDemographicTest
17-Sep-2021 13:56:15 Running locally...
17-Sep-2021 13:56:15 Starting ChromeDriver 90.0.4430.24 (4c6d850f087da467d926e8eddb76550aed655991-refs/branch-heads/4430@{#429}) on port 13244
17-Sep-2021 13:56:15 Only local connections are allowed.
17-Sep-2021 13:56:15 Please see https://chromedriver.chromium.org/security-considerations for suggestions on keeping ChromeDriver safe.
17-Sep-2021 13:56:15 ChromeDriver was started successfully.
17-Sep-2021 13:56:15 Sep 17, 2021 1:56:15 PM org.openqa.selenium.remote.ProtocolHandshake createSession
17-Sep-2021 13:56:15 INFO: Detected dialect: W3C
17-Sep-2021 13:56:23 Tests run: 1, Failures: 0, Errors: 0, Skipped: 0, Time elapsed: 8.52 sec
17-Sep-2021 13:56:23 Running org.openmrs.reference.DeleteVisitTypeTest
17-Sep-2021 13:56:23 Running locally...
17-Sep-2021 13:56:23 Starting ChromeDriver 90.0.4430.24 (4c6d850f087da467d926e8eddb76550aed655991-refs/branch-heads/4430@{#429}) on port 15105
17-Sep-2021 13:56:23 Only local connections are allowed.
17-Sep-2021 13:56:23 Please see https://chromedriver.chromium.org/security-considerations for suggestions on keeping ChromeDriver safe.
17-Sep-2021 13:56:23 ChromeDriver was started successfully.
17-Sep-2021 13:56:24 Sep 17, 2021 1:56:24 PM org.openqa.selenium.remote.ProtocolHandshake createSession
17-Sep-2021 13:56:24 INFO: Detected dialect: W3C
17-Sep-2021 13:56:27 Tests run: 1, Failures: 0, Errors: 0, Skipped: 0, Time elapsed: 3.401 sec
17-Sep-2021 13:56:27 Running org.openmrs.reference.FormTest
17-Sep-2021 13:56:27 Running locally...
17-Sep-2021 13:56:27 Starting ChromeDriver 90.0.4430.24 (4c6d850f087da467d926e8eddb76550aed655991-refs/branch-heads/4430@{#429}) on port 16531
17-Sep-2021 13:56:27 Only local connections are allowed.
17-Sep-2021 13:56:27 Please see https://chromedriver.chromium.org/security-considerations for suggestions on keeping ChromeDriver safe.
17-Sep-2021 13:56:27 ChromeDriver was started successfully.
17-Sep-2021 13:56:27 Sep 17, 2021 1:56:27 PM org.openqa.selenium.remote.ProtocolHandshake createSession
17-Sep-2021 13:56:27 INFO: Detected dialect: W3C
17-Sep-2021 13:56:33 Running locally...
17-Sep-2021 13:56:33 Starting ChromeDriver 90.0.4430.24 (4c6d850f087da467d926e8eddb76550aed655991-refs/branch-heads/4430@{#429}) on port 3603
17-Sep-2021 13:56:33 Only local connections are allowed.
17-Sep-2021 13:56:33 Please see https://chromedriver.chromium.org/security-considerations for suggestions on keeping ChromeDriver safe.
17-Sep-2021 13:56:33 ChromeDriver was started successfully.
17-Sep-2021 13:56:33 Sep 17, 2021 1:56:33 PM org.openqa.selenium.remote.ProtocolHandshake createSession
17-Sep-2021 13:56:33 INFO: Detected dialect: W3C
17-Sep-2021 13:56:39 Running locally...
17-Sep-2021 13:56:40 Starting ChromeDriver 90.0.4430.24 (4c6d850f087da467d926e8eddb76550aed655991-refs/branch-heads/4430@{#429}) on port 29300
17-Sep-2021 13:56:40 Only local connections are allowed.
17-Sep-2021 13:56:40 Please see https://chromedriver.chromium.org/security-considerations for suggestions on keeping ChromeDriver safe.
17-Sep-2021 13:56:40 ChromeDriver was started successfully.
17-Sep-2021 13:56:40 Sep 17, 2021 1:56:40 PM org.openqa.selenium.remote.ProtocolHandshake createSession
17-Sep-2021 13:56:40 INFO: Detected dialect: W3C
17-Sep-2021 13:56:43 Running locally...
17-Sep-2021 13:56:43 Starting ChromeDriver 90.0.4430.24 (4c6d850f087da467d926e8eddb76550aed655991-refs/branch-heads/4430@{#429}) on port 20919
17-Sep-2021 13:56:43 Only local connections are allowed.
17-Sep-2021 13:56:43 Please see https://chromedriver.chromium.org/security-considerations for suggestions on keeping ChromeDriver safe.
17-Sep-2021 13:56:43 ChromeDriver was started successfully.
17-Sep-2021 13:56:44 Sep 17, 2021 1:56:44 PM org.openqa.selenium.remote.ProtocolHandshake createSession
17-Sep-2021 13:56:44 INFO: Detected dialect: W3C
17-Sep-2021 13:56:48 Tests run: 4, Failures: 0, Errors: 0, Skipped: 0, Time elapsed: 21.466 sec
17-Sep-2021 13:56:48 Running org.openmrs.reference.RegisterUnidentifiedPatientTest
17-Sep-2021 13:56:48 Running locally...
17-Sep-2021 13:56:48 Starting ChromeDriver 90.0.4430.24 (4c6d850f087da467d926e8eddb76550aed655991-refs/branch-heads/4430@{#429}) on port 10137
17-Sep-2021 13:56:48 Only local connections are allowed.
17-Sep-2021 13:56:48 Please see https://chromedriver.chromium.org/security-considerations for suggestions on keeping ChromeDriver safe.
17-Sep-2021 13:56:48 ChromeDriver was started successfully.
17-Sep-2021 13:56:48 Sep 17, 2021 1:56:48 PM org.openqa.selenium.remote.ProtocolHandshake createSession
17-Sep-2021 13:56:48 INFO: Detected dialect: W3C
17-Sep-2021 13:56:54 Tests run: 1, Failures: 0, Errors: 0, Skipped: 0, Time elapsed: 5.863 sec
17-Sep-2021 13:56:54 Running org.openmrs.reference.AddPatientAppointmentTest
17-Sep-2021 13:56:54 Running locally...
17-Sep-2021 13:56:54 Starting ChromeDriver 90.0.4430.24 (4c6d850f087da467d926e8eddb76550aed655991-refs/branch-heads/4430@{#429}) on port 28908
17-Sep-2021 13:56:54 Only local connections are allowed.
17-Sep-2021 13:56:54 Please see https://chromedriver.chromium.org/security-considerations for suggestions on keeping ChromeDriver safe.
17-Sep-2021 13:56:54 ChromeDriver was started successfully.
17-Sep-2021 13:56:54 Sep 17, 2021 1:56:54 PM org.openqa.selenium.remote.ProtocolHandshake createSession
17-Sep-2021 13:56:54 INFO: Detected dialect: W3C
17-Sep-2021 13:57:09 Tests run: 1, Failures: 0, Errors: 0, Skipped: 0, Time elapsed: 14.891 sec
17-Sep-2021 13:57:09 Running org.openmrs.reference.AdmitExitInpatientTest
17-Sep-2021 13:57:09 Running locally...
17-Sep-2021 13:57:09 Starting ChromeDriver 90.0.4430.24 (4c6d850f087da467d926e8eddb76550aed655991-refs/branch-heads/4430@{#429}) on port 28540
17-Sep-2021 13:57:09 Only local connections are allowed.
17-Sep-2021 13:57:09 Please see https://chromedriver.chromium.org/security-considerations for suggestions on keeping ChromeDriver safe.
17-Sep-2021 13:57:09 ChromeDriver was started successfully.
17-Sep-2021 13:57:09 Sep 17, 2021 1:57:09 PM org.openqa.selenium.remote.ProtocolHandshake createSession
17-Sep-2021 13:57:09 INFO: Detected dialect: W3C
17-Sep-2021 13:57:22 Tests run: 1, Failures: 0, Errors: 0, Skipped: 0, Time elapsed: 13.343 sec
17-Sep-2021 13:57:22 Running org.openmrs.reference.DeleteRequestAppointmentTest
17-Sep-2021 13:57:22 Running locally...
17-Sep-2021 13:57:22 Starting ChromeDriver 90.0.4430.24 (4c6d850f087da467d926e8eddb76550aed655991-refs/branch-heads/4430@{#429}) on port 8006
17-Sep-2021 13:57:22 Only local connections are allowed.
17-Sep-2021 13:57:22 Please see https://chromedriver.chromium.org/security-considerations for suggestions on keeping ChromeDriver safe.
17-Sep-2021 13:57:22 ChromeDriver was started successfully.
17-Sep-2021 13:57:23 Sep 17, 2021 1:57:23 PM org.openqa.selenium.remote.ProtocolHandshake createSession
17-Sep-2021 13:57:23 INFO: Detected dialect: W3C
17-Sep-2021 13:57:35 Tests run: 1, Failures: 0, Errors: 0, Skipped: 0, Time elapsed: 13.138 sec
17-Sep-2021 13:57:35 Running org.openmrs.reference.EditAllergyTest
17-Sep-2021 13:57:35 Running locally...
17-Sep-2021 13:57:35 Starting ChromeDriver 90.0.4430.24 (4c6d850f087da467d926e8eddb76550aed655991-refs/branch-heads/4430@{#429}) on port 17510
17-Sep-2021 13:57:35 Only local connections are allowed.
17-Sep-2021 13:57:35 Please see https://chromedriver.chromium.org/security-considerations for suggestions on keeping ChromeDriver safe.
17-Sep-2021 13:57:35 ChromeDriver was started successfully.
17-Sep-2021 13:57:36 Sep 17, 2021 1:57:36 PM org.openqa.selenium.remote.ProtocolHandshake createSession
17-Sep-2021 13:57:36 INFO: Detected dialect: W3C
17-Sep-2021 13:57:45 Tests run: 1, Failures: 0, Errors: 0, Skipped: 0, Time elapsed: 9.055 sec
17-Sep-2021 13:57:45 Running org.openmrs.reference.VisitNoteTest
17-Sep-2021 13:57:45 Running locally...
17-Sep-2021 13:57:45 Starting ChromeDriver 90.0.4430.24 (4c6d850f087da467d926e8eddb76550aed655991-refs/branch-heads/4430@{#429}) on port 22822
17-Sep-2021 13:57:45 Only local connections are allowed.
17-Sep-2021 13:57:45 Please see https://chromedriver.chromium.org/security-considerations for suggestions on keeping ChromeDriver safe.
17-Sep-2021 13:57:45 ChromeDriver was started successfully.
17-Sep-2021 13:57:45 Sep 17, 2021 1:57:45 PM org.openqa.selenium.remote.ProtocolHandshake createSession
17-Sep-2021 13:57:45 INFO: Detected dialect: W3C
17-Sep-2021 13:58:08 Tests run: 1, Failures: 0, Errors: 0, Skipped: 0, Time elapsed: 23.247 sec
17-Sep-2021 13:58:08 Running org.openmrs.reference.CreatePersonTest
17-Sep-2021 13:58:08 Running locally...
17-Sep-2021 13:58:08 Starting ChromeDriver 90.0.4430.24 (4c6d850f087da467d926e8eddb76550aed655991-refs/branch-heads/4430@{#429}) on port 28912
17-Sep-2021 13:58:08 Only local connections are allowed.
17-Sep-2021 13:58:08 Please see https://chromedriver.chromium.org/security-considerations for suggestions on keeping ChromeDriver safe.
17-Sep-2021 13:58:08 ChromeDriver was started successfully.
17-Sep-2021 13:58:08 Sep 17, 2021 1:58:08 PM org.openqa.selenium.remote.ProtocolHandshake createSession
17-Sep-2021 13:58:08 INFO: Detected dialect: W3C
17-Sep-2021 13:58:13 Tests run: 1, Failures: 0, Errors: 0, Skipped: 0, Time elapsed: 5.121 sec
17-Sep-2021 13:58:13 Running org.openmrs.reference.FindPatientByNameTest
17-Sep-2021 13:58:13 Running locally...
17-Sep-2021 13:58:13 Starting ChromeDriver 90.0.4430.24 (4c6d850f087da467d926e8eddb76550aed655991-refs/branch-heads/4430@{#429}) on port 27619
17-Sep-2021 13:58:13 Only local connections are allowed.
17-Sep-2021 13:58:13 Please see https://chromedriver.chromium.org/security-considerations for suggestions on keeping ChromeDriver safe.
17-Sep-2021 13:58:13 ChromeDriver was started successfully.
17-Sep-2021 13:58:13 Sep 17, 2021 1:58:13 PM org.openqa.selenium.remote.ProtocolHandshake createSession
17-Sep-2021 13:58:13 INFO: Detected dialect: W3C
17-Sep-2021 13:58:20 Tests run: 1, Failures: 0, Errors: 0, Skipped: 0, Time elapsed: 6.635 sec
17-Sep-2021 13:58:20 Running org.openmrs.reference.AddUserTest
17-Sep-2021 13:58:20 Running locally...
17-Sep-2021 13:58:20 Starting ChromeDriver 90.0.4430.24 (4c6d850f087da467d926e8eddb76550aed655991-refs/branch-heads/4430@{#429}) on port 4928
17-Sep-2021 13:58:20 Only local connections are allowed.
17-Sep-2021 13:58:20 Please see https://chromedriver.chromium.org/security-considerations for suggestions on keeping ChromeDriver safe.
17-Sep-2021 13:58:20 ChromeDriver was started successfully.
17-Sep-2021 13:58:20 Sep 17, 2021 1:58:20 PM org.openqa.selenium.remote.ProtocolHandshake createSession
17-Sep-2021 13:58:20 INFO: Detected dialect: W3C
17-Sep-2021 14:00:26 Tests run: 2, Failures: 0, Errors: 2, Skipped: 0, Time elapsed: 126.151 sec <<< FAILURE!
17-Sep-2021 14:00:26 Running org.openmrs.reference.AddProviderTest
17-Sep-2021 14:00:26 Running locally...
17-Sep-2021 14:00:26 Starting ChromeDriver 90.0.4430.24 (4c6d850f087da467d926e8eddb76550aed655991-refs/branch-heads/4430@{#429}) on port 20993
17-Sep-2021 14:00:26 Only local connections are allowed.
17-Sep-2021 14:00:26 Please see https://chromedriver.chromium.org/security-considerations for suggestions on keeping ChromeDriver safe.
17-Sep-2021 14:00:26 ChromeDriver was started successfully.
17-Sep-2021 14:00:26 Sep 17, 2021 2:00:26 PM org.openqa.selenium.remote.ProtocolHandshake createSession
17-Sep-2021 14:00:26 INFO: Detected dialect: W3C
17-Sep-2021 14:02:27 Failed to login in AddProviderTest.addProviderTest, trying again...
17-Sep-2021 14:03:20 Tests run: 1, Failures: 0, Errors: 0, Skipped: 0, Time elapsed: 174.254 sec
17-Sep-2021 14:03:20 Running org.openmrs.reference.AddPastVisitTest
17-Sep-2021 14:03:20 Running locally...
17-Sep-2021 14:03:20 Starting ChromeDriver 90.0.4430.24 (4c6d850f087da467d926e8eddb76550aed655991-refs/branch-heads/4430@{#429}) on port 2166
17-Sep-2021 14:03:20 Only local connections are allowed.
17-Sep-2021 14:03:20 Please see https://chromedriver.chromium.org/security-considerations for suggestions on keeping ChromeDriver safe.
17-Sep-2021 14:03:20 ChromeDriver was started successfully.
17-Sep-2021 14:03:20 Sep 17, 2021 2:03:20 PM org.openqa.selenium.remote.ProtocolHandshake createSession
17-Sep-2021 14:03:20 INFO: Detected dialect: W3C
17-Sep-2021 14:03:35 Tests run: 1, Failures: 0, Errors: 0, Skipped: 0, Time elapsed: 15.076 sec
17-Sep-2021 14:03:35 Running org.openmrs.reference.RecordMergeIssueTest
17-Sep-2021 14:03:35 Running locally...
17-Sep-2021 14:03:35 Starting ChromeDriver 90.0.4430.24 (4c6d850f087da467d926e8eddb76550aed655991-refs/branch-heads/4430@{#429}) on port 8312
17-Sep-2021 14:03:35 Only local connections are allowed.
17-Sep-2021 14:03:35 Please see https://chromedriver.chromium.org/security-considerations for suggestions on keeping ChromeDriver safe.
17-Sep-2021 14:03:35 ChromeDriver was started successfully.
17-Sep-2021 14:03:36 Sep 17, 2021 2:03:36 PM org.openqa.selenium.remote.ProtocolHandshake createSession
17-Sep-2021 14:03:36 INFO: Detected dialect: W3C
17-Sep-2021 14:03:50 Tests run: 1, Failures: 0, Errors: 0, Skipped: 0, Time elapsed: 15.406 sec
17-Sep-2021 14:03:50 Running org.openmrs.reference.CaptureVitalsTest
17-Sep-2021 14:03:50 Running locally...
17-Sep-2021 14:03:50 Starting ChromeDriver 90.0.4430.24 (4c6d850f087da467d926e8eddb76550aed655991-refs/branch-heads/4430@{#429}) on port 16462
17-Sep-2021 14:03:50 Only local connections are allowed.
17-Sep-2021 14:03:50 Please see https://chromedriver.chromium.org/security-considerations for suggestions on keeping ChromeDriver safe.
17-Sep-2021 14:03:50 ChromeDriver was started successfully.
17-Sep-2021 14:03:51 Sep 17, 2021 2:03:51 PM org.openqa.selenium.remote.ProtocolHandshake createSession
17-Sep-2021 14:03:51 INFO: Detected dialect: W3C
17-Sep-2021 14:04:03 Tests run: 1, Failures: 0, Errors: 0, Skipped: 0, Time elapsed: 12.544 sec
17-Sep-2021 14:04:03 Running org.openmrs.reference.NamePatientAccentedLetterTest
17-Sep-2021 14:04:03 Running locally...
17-Sep-2021 14:04:03 Starting ChromeDriver 90.0.4430.24 (4c6d850f087da467d926e8eddb76550aed655991-refs/branch-heads/4430@{#429}) on port 10323
17-Sep-2021 14:04:03 Only local connections are allowed.
17-Sep-2021 14:04:03 Please see https://chromedriver.chromium.org/security-considerations for suggestions on keeping ChromeDriver safe.
17-Sep-2021 14:04:03 ChromeDriver was started successfully.
17-Sep-2021 14:04:03 Sep 17, 2021 2:04:03 PM org.openqa.selenium.remote.ProtocolHandshake createSession
17-Sep-2021 14:04:03 INFO: Detected dialect: W3C
17-Sep-2021 14:04:11 Tests run: 1, Failures: 0, Errors: 0, Skipped: 0, Time elapsed: 8.09 sec
17-Sep-2021 14:04:11 Running org.openmrs.reference.RetirePersonTest
17-Sep-2021 14:04:11 Running locally...
17-Sep-2021 14:04:11 Starting ChromeDriver 90.0.4430.24 (4c6d850f087da467d926e8eddb76550aed655991-refs/branch-heads/4430@{#429}) on port 19033
17-Sep-2021 14:04:11 Only local connections are allowed.
17-Sep-2021 14:04:11 Please see https://chromedriver.chromium.org/security-considerations for suggestions on keeping ChromeDriver safe.
17-Sep-2021 14:04:11 ChromeDriver was started successfully.
17-Sep-2021 14:04:11 Sep 17, 2021 2:04:11 PM org.openqa.selenium.remote.ProtocolHandshake createSession
17-Sep-2021 14:04:11 INFO: Detected dialect: W3C
17-Sep-2021 14:04:24 Tests run: 1, Failures: 0, Errors: 0, Skipped: 0, Time elapsed: 13.017 sec
17-Sep-2021 14:04:24 Running org.openmrs.reference.EndVisitTest
17-Sep-2021 14:04:24 Running locally...
17-Sep-2021 14:04:24 Starting ChromeDriver 90.0.4430.24 (4c6d850f087da467d926e8eddb76550aed655991-refs/branch-heads/4430@{#429}) on port 16598
17-Sep-2021 14:04:24 Only local connections are allowed.
17-Sep-2021 14:04:24 Please see https://chromedriver.chromium.org/security-considerations for suggestions on keeping ChromeDriver safe.
17-Sep-2021 14:04:24 ChromeDriver was started successfully.
17-Sep-2021 14:04:24 Sep 17, 2021 2:04:24 PM org.openqa.selenium.remote.ProtocolHandshake createSession
17-Sep-2021 14:04:24 INFO: Detected dialect: W3C
17-Sep-2021 14:04:35 Tests run: 1, Failures: 0, Errors: 0, Skipped: 0, Time elapsed: 11.303 sec
17-Sep-2021 14:04:35 Running org.openmrs.reference.DeleteAppointmentBlockTest
17-Sep-2021 14:04:35 Running locally...
17-Sep-2021 14:04:35 Starting ChromeDriver 90.0.4430.24 (4c6d850f087da467d926e8eddb76550aed655991-refs/branch-heads/4430@{#429}) on port 25851
17-Sep-2021 14:04:35 Only local connections are allowed.
17-Sep-2021 14:04:35 Please see https://chromedriver.chromium.org/security-considerations for suggestions on keeping ChromeDriver safe.
17-Sep-2021 14:04:35 ChromeDriver was started successfully.
17-Sep-2021 14:04:36 Sep 17, 2021 2:04:36 PM org.openqa.selenium.remote.ProtocolHandshake createSession
17-Sep-2021 14:04:36 INFO: Detected dialect: W3C
17-Sep-2021 14:04:41 Tests run: 1, Failures: 0, Errors: 0, Skipped: 0, Time elapsed: 5.841 sec
17-Sep-2021 14:04:41 Running org.openmrs.reference.BookRequestAppointmentTest
17-Sep-2021 14:04:41 Running locally...
17-Sep-2021 14:04:41 Starting ChromeDriver 90.0.4430.24 (4c6d850f087da467d926e8eddb76550aed655991-refs/branch-heads/4430@{#429}) on port 6248
17-Sep-2021 14:04:41 Only local connections are allowed.
17-Sep-2021 14:04:41 Please see https://chromedriver.chromium.org/security-considerations for suggestions on keeping ChromeDriver safe.
17-Sep-2021 14:04:41 ChromeDriver was started successfully.
17-Sep-2021 14:04:42 Sep 17, 2021 2:04:42 PM org.openqa.selenium.remote.ProtocolHandshake createSession
17-Sep-2021 14:04:42 INFO: Detected dialect: W3C
17-Sep-2021 14:05:01 Tests run: 1, Failures: 0, Errors: 0, Skipped: 0, Time elapsed: 20.136 sec
17-Sep-2021 14:05:01 Running org.openmrs.reference.AddDeleteServiceTest
17-Sep-2021 14:05:01 Running locally...
17-Sep-2021 14:05:01 Starting ChromeDriver 90.0.4430.24 (4c6d850f087da467d926e8eddb76550aed655991-refs/branch-heads/4430@{#429}) on port 14361
17-Sep-2021 14:05:01 Only local connections are allowed.
17-Sep-2021 14:05:01 Please see https://chromedriver.chromium.org/security-considerations for suggestions on keeping ChromeDriver safe.
17-Sep-2021 14:05:01 ChromeDriver was started successfully.
17-Sep-2021 14:05:02 Sep 17, 2021 2:05:02 PM org.openqa.selenium.remote.ProtocolHandshake createSession
17-Sep-2021 14:05:02 INFO: Detected dialect: W3C
17-Sep-2021 14:05:07 Tests run: 1, Failures: 0, Errors: 0, Skipped: 0, Time elapsed: 5.249 sec
17-Sep-2021 14:05:07 Running org.openmrs.reference.AddEditAppointmentBlockTest
17-Sep-2021 14:05:07 Running locally...
17-Sep-2021 14:05:07 Starting ChromeDriver 90.0.4430.24 (4c6d850f087da467d926e8eddb76550aed655991-refs/branch-heads/4430@{#429}) on port 26772
17-Sep-2021 14:05:07 Only local connections are allowed.
17-Sep-2021 14:05:07 Please see https://chromedriver.chromium.org/security-considerations for suggestions on keeping ChromeDriver safe.
17-Sep-2021 14:05:07 ChromeDriver was started successfully.
17-Sep-2021 14:05:07 Sep 17, 2021 2:05:07 PM org.openqa.selenium.remote.ProtocolHandshake createSession
17-Sep-2021 14:05:07 INFO: Detected dialect: W3C
17-Sep-2021 14:05:13 Tests run: 1, Failures: 0, Errors: 0, Skipped: 0, Time elapsed: 6.516 sec
17-Sep-2021 14:05:13 Running org.openmrs.reference.RetireProviderTest
17-Sep-2021 14:05:13 Running locally...
17-Sep-2021 14:05:13 Starting ChromeDriver 90.0.4430.24 (4c6d850f087da467d926e8eddb76550aed655991-refs/branch-heads/4430@{#429}) on port 9854
17-Sep-2021 14:05:13 Only local connections are allowed.
17-Sep-2021 14:05:13 Please see https://chromedriver.chromium.org/security-considerations for suggestions on keeping ChromeDriver safe.
17-Sep-2021 14:05:13 ChromeDriver was started successfully.
17-Sep-2021 14:05:13 Sep 17, 2021 2:05:13 PM org.openqa.selenium.remote.ProtocolHandshake createSession
17-Sep-2021 14:05:13 INFO: Detected dialect: W3C
17-Sep-2021 14:05:18 Tests run: 1, Failures: 0, Errors: 0, Skipped: 0, Time elapsed: 5.349 sec
17-Sep-2021 14:05:18 Running org.openmrs.reference.MergePatientTest
17-Sep-2021 14:05:18 Running locally...
17-Sep-2021 14:05:19 Starting ChromeDriver 90.0.4430.24 (4c6d850f087da467d926e8eddb76550aed655991-refs/branch-heads/4430@{#429}) on port 30915
17-Sep-2021 14:05:19 Only local connections are allowed.
17-Sep-2021 14:05:19 Please see https://chromedriver.chromium.org/security-considerations for suggestions on keeping ChromeDriver safe.
17-Sep-2021 14:05:19 ChromeDriver was started successfully.
17-Sep-2021 14:05:19 Sep 17, 2021 2:05:19 PM org.openqa.selenium.remote.ProtocolHandshake createSession
17-Sep-2021 14:05:19 INFO: Detected dialect: W3C
17-Sep-2021 14:05:26 Tests run: 1, Failures: 0, Errors: 0, Skipped: 0, Time elapsed: 7.389 sec
17-Sep-2021 14:05:26 Running org.openmrs.reference.AddDeleteLocationTest
17-Sep-2021 14:05:26 Running locally...
17-Sep-2021 14:05:26 Starting ChromeDriver 90.0.4430.24 (4c6d850f087da467d926e8eddb76550aed655991-refs/branch-heads/4430@{#429}) on port 12040
17-Sep-2021 14:05:26 Only local connections are allowed.
17-Sep-2021 14:05:26 Please see https://chromedriver.chromium.org/security-considerations for suggestions on keeping ChromeDriver safe.
17-Sep-2021 14:05:26 ChromeDriver was started successfully.
17-Sep-2021 14:05:26 Sep 17, 2021 2:05:26 PM org.openqa.selenium.remote.ProtocolHandshake createSession
17-Sep-2021 14:05:26 INFO: Detected dialect: W3C
17-Sep-2021 14:05:30 Tests run: 1, Failures: 0, Errors: 0, Skipped: 0, Time elapsed: 4.237 sec
17-Sep-2021 14:05:30 Running org.openmrs.reference.DuplicatePatientRegisterTest
17-Sep-2021 14:05:30 Running locally...
17-Sep-2021 14:05:30 Starting ChromeDriver 90.0.4430.24 (4c6d850f087da467d926e8eddb76550aed655991-refs/branch-heads/4430@{#429}) on port 16444
17-Sep-2021 14:05:30 Only local connections are allowed.
17-Sep-2021 14:05:30 Please see https://chromedriver.chromium.org/security-considerations for suggestions on keeping ChromeDriver safe.
17-Sep-2021 14:05:30 ChromeDriver was started successfully.
17-Sep-2021 14:05:31 Sep 17, 2021 2:05:31 PM org.openqa.selenium.remote.ProtocolHandshake createSession
17-Sep-2021 14:05:31 INFO: Detected dialect: W3C
17-Sep-2021 14:05:42 Tests run: 1, Failures: 0, Errors: 0, Skipped: 0, Time elapsed: 12.044 sec
17-Sep-2021 14:05:42 Running org.openmrs.reference.UsingBackButtonInMergePatientTest
17-Sep-2021 14:05:42 Running locally...
17-Sep-2021 14:05:42 Starting ChromeDriver 90.0.4430.24 (4c6d850f087da467d926e8eddb76550aed655991-refs/branch-heads/4430@{#429}) on port 31293
17-Sep-2021 14:05:42 Only local connections are allowed.
17-Sep-2021 14:05:42 Please see https://chromedriver.chromium.org/security-considerations for suggestions on keeping ChromeDriver safe.
17-Sep-2021 14:05:42 ChromeDriver was started successfully.
17-Sep-2021 14:05:42 Sep 17, 2021 2:05:42 PM org.openqa.selenium.remote.ProtocolHandshake createSession
17-Sep-2021 14:05:42 INFO: Detected dialect: W3C
17-Sep-2021 14:05:55 Tests run: 1, Failures: 0, Errors: 0, Skipped: 0, Time elapsed: 12.763 sec
17-Sep-2021 14:05:55 Running org.openmrs.reference.AddDiagnosisToVisitNoteTest
17-Sep-2021 14:05:55 Running locally...
17-Sep-2021 14:05:55 Starting ChromeDriver 90.0.4430.24 (4c6d850f087da467d926e8eddb76550aed655991-refs/branch-heads/4430@{#429}) on port 17869
17-Sep-2021 14:05:55 Only local connections are allowed.
17-Sep-2021 14:05:55 Please see https://chromedriver.chromium.org/security-considerations for suggestions on keeping ChromeDriver safe.
17-Sep-2021 14:05:55 ChromeDriver was started successfully.
17-Sep-2021 14:05:55 Sep 17, 2021 2:05:55 PM org.openqa.selenium.remote.ProtocolHandshake createSession
17-Sep-2021 14:05:55 INFO: Detected dialect: W3C
17-Sep-2021 14:06:08 Tests run: 1, Failures: 0, Errors: 0, Skipped: 0, Time elapsed: 13.219 sec
17-Sep-2021 14:06:08 Running org.openmrs.reference.MergeVisitsTest
17-Sep-2021 14:06:08 Running locally...
17-Sep-2021 14:06:08 Starting ChromeDriver 90.0.4430.24 (4c6d850f087da467d926e8eddb76550aed655991-refs/branch-heads/4430@{#429}) on port 7859
17-Sep-2021 14:06:08 Only local connections are allowed.
17-Sep-2021 14:06:08 Please see https://chromedriver.chromium.org/security-considerations for suggestions on keeping ChromeDriver safe.
17-Sep-2021 14:06:08 ChromeDriver was started successfully.
17-Sep-2021 14:06:09 Sep 17, 2021 2:06:09 PM org.openqa.selenium.remote.ProtocolHandshake createSession
17-Sep-2021 14:06:09 INFO: Detected dialect: W3C
17-Sep-2021 14:06:21 Tests run: 1, Failures: 0, Errors: 0, Skipped: 0, Time elapsed: 13.076 sec
17-Sep-2021 14:06:21 Running org.openmrs.reference.EditServiceTest
17-Sep-2021 14:06:21 Running locally...
17-Sep-2021 14:06:21 Starting ChromeDriver 90.0.4430.24 (4c6d850f087da467d926e8eddb76550aed655991-refs/branch-heads/4430@{#429}) on port 7553
17-Sep-2021 14:06:21 Only local connections are allowed.
17-Sep-2021 14:06:21 Please see https://chromedriver.chromium.org/security-considerations for suggestions on keeping ChromeDriver safe.
17-Sep-2021 14:06:21 ChromeDriver was started successfully.
17-Sep-2021 14:06:22 Sep 17, 2021 2:06:22 PM org.openqa.selenium.remote.ProtocolHandshake createSession
17-Sep-2021 14:06:22 INFO: Detected dialect: W3C
17-Sep-2021 14:06:27 Tests run: 1, Failures: 0, Errors: 0, Skipped: 0, Time elapsed: 5.995 sec
17-Sep-2021 14:06:27 Running org.openmrs.reference.AddNewAllergyTest
17-Sep-2021 14:06:27 Running locally...
17-Sep-2021 14:06:27 Starting ChromeDriver 90.0.4430.24 (4c6d850f087da467d926e8eddb76550aed655991-refs/branch-heads/4430@{#429}) on port 20239
17-Sep-2021 14:06:27 Only local connections are allowed.
17-Sep-2021 14:06:27 Please see https://chromedriver.chromium.org/security-considerations for suggestions on keeping ChromeDriver safe.
17-Sep-2021 14:06:27 ChromeDriver was started successfully.
17-Sep-2021 14:06:28 Sep 17, 2021 2:06:28 PM org.openqa.selenium.remote.ProtocolHandshake createSession
17-Sep-2021 14:06:28 INFO: Detected dialect: W3C
17-Sep-2021 14:06:36 Tests run: 1, Failures: 0, Errors: 0, Skipped: 0, Time elapsed: 8.895 sec
17-Sep-2021 14:06:36 Running org.openmrs.reference.LoginTest
17-Sep-2021 14:06:36 Running locally...
17-Sep-2021 14:06:36 Starting ChromeDriver 90.0.4430.24 (4c6d850f087da467d926e8eddb76550aed655991-refs/branch-heads/4430@{#429}) on port 31763
17-Sep-2021 14:06:36 Only local connections are allowed.
17-Sep-2021 14:06:36 Please see https://chromedriver.chromium.org/security-considerations for suggestions on keeping ChromeDriver safe.
17-Sep-2021 14:06:36 ChromeDriver was started successfully.
17-Sep-2021 14:06:36 Sep 17, 2021 2:06:36 PM org.openqa.selenium.remote.ProtocolHandshake createSession
17-Sep-2021 14:06:36 INFO: Detected dialect: W3C
17-Sep-2021 14:06:39 Running locally...
17-Sep-2021 14:06:39 Starting ChromeDriver 90.0.4430.24 (4c6d850f087da467d926e8eddb76550aed655991-refs/branch-heads/4430@{#429}) on port 26392
17-Sep-2021 14:06:39 Only local connections are allowed.
17-Sep-2021 14:06:39 Please see https://chromedriver.chromium.org/security-considerations for suggestions on keeping ChromeDriver safe.
17-Sep-2021 14:06:39 ChromeDriver was started successfully.
17-Sep-2021 14:06:39 Sep 17, 2021 2:06:39 PM org.openqa.selenium.remote.ProtocolHandshake createSession
17-Sep-2021 14:06:39 INFO: Detected dialect: W3C
17-Sep-2021 14:06:41 Running locally...
17-Sep-2021 14:06:41 Starting ChromeDriver 90.0.4430.24 (4c6d850f087da467d926e8eddb76550aed655991-refs/branch-heads/4430@{#429}) on port 32475
17-Sep-2021 14:06:41 Only local connections are allowed.
17-Sep-2021 14:06:41 Please see https://chromedriver.chromium.org/security-considerations for suggestions on keeping ChromeDriver safe.
17-Sep-2021 14:06:41 ChromeDriver was started successfully.
17-Sep-2021 14:06:41 Sep 17, 2021 2:06:41 PM org.openqa.selenium.remote.ProtocolHandshake createSession
17-Sep-2021 14:06:41 INFO: Detected dialect: W3C
17-Sep-2021 14:06:43 Running locally...
17-Sep-2021 14:06:43 Starting ChromeDriver 90.0.4430.24 (4c6d850f087da467d926e8eddb76550aed655991-refs/branch-heads/4430@{#429}) on port 10159
17-Sep-2021 14:06:43 Only local connections are allowed.
17-Sep-2021 14:06:43 Please see https://chromedriver.chromium.org/security-considerations for suggestions on keeping ChromeDriver safe.
17-Sep-2021 14:06:43 ChromeDriver was started successfully.
17-Sep-2021 14:06:44 Sep 17, 2021 2:06:44 PM org.openqa.selenium.remote.ProtocolHandshake createSession
17-Sep-2021 14:06:44 INFO: Detected dialect: W3C
17-Sep-2021 14:06:46 Running locally...
17-Sep-2021 14:06:46 Starting ChromeDriver 90.0.4430.24 (4c6d850f087da467d926e8eddb76550aed655991-refs/branch-heads/4430@{#429}) on port 21850
17-Sep-2021 14:06:46 Only local connections are allowed.
17-Sep-2021 14:06:46 Please see https://chromedriver.chromium.org/security-considerations for suggestions on keeping ChromeDriver safe.
17-Sep-2021 14:06:46 ChromeDriver was started successfully.
17-Sep-2021 14:06:46 Sep 17, 2021 2:06:46 PM org.openqa.selenium.remote.ProtocolHandshake createSession
17-Sep-2021 14:06:46 INFO: Detected dialect: W3C
17-Sep-2021 14:06:48 Tests run: 5, Failures: 0, Errors: 0, Skipped: 0, Time elapsed: 12.285 sec
17-Sep-2021 14:06:48 Running org.openmrs.reference.DeleteProviderTest
17-Sep-2021 14:06:48 Running locally...
17-Sep-2021 14:06:48 Starting ChromeDriver 90.0.4430.24 (4c6d850f087da467d926e8eddb76550aed655991-refs/branch-heads/4430@{#429}) on port 26223
17-Sep-2021 14:06:48 Only local connections are allowed.
17-Sep-2021 14:06:48 Please see https://chromedriver.chromium.org/security-considerations for suggestions on keeping ChromeDriver safe.
17-Sep-2021 14:06:48 ChromeDriver was started successfully.
17-Sep-2021 14:06:49 Sep 17, 2021 2:06:49 PM org.openqa.selenium.remote.ProtocolHandshake createSession
17-Sep-2021 14:06:49 INFO: Detected dialect: W3C
17-Sep-2021 14:06:54 Tests run: 1, Failures: 0, Errors: 0, Skipped: 0, Time elapsed: 5.491 sec
17-Sep-2021 14:06:54 Running org.openmrs.reference.RegisterPatientTest
17-Sep-2021 14:06:54 Running locally...
17-Sep-2021 14:06:54 Starting ChromeDriver 90.0.4430.24 (4c6d850f087da467d926e8eddb76550aed655991-refs/branch-heads/4430@{#429}) on port 15255
17-Sep-2021 14:06:54 Only local connections are allowed.
17-Sep-2021 14:06:54 Please see https://chromedriver.chromium.org/security-considerations for suggestions on keeping ChromeDriver safe.
17-Sep-2021 14:06:54 ChromeDriver was started successfully.
17-Sep-2021 14:06:54 Sep 17, 2021 2:06:54 PM org.openqa.selenium.remote.ProtocolHandshake createSession
17-Sep-2021 14:06:54 INFO: Detected dialect: W3C
17-Sep-2021 14:07:02 Tests run: 1, Failures: 0, Errors: 0, Skipped: 0, Time elapsed: 7.656 sec
17-Sep-2021 14:07:02 Running org.openmrs.reference.ContactInfoTest
17-Sep-2021 14:07:02 Running locally...
17-Sep-2021 14:07:02 Starting ChromeDriver 90.0.4430.24 (4c6d850f087da467d926e8eddb76550aed655991-refs/branch-heads/4430@{#429}) on port 21668
17-Sep-2021 14:07:02 Only local connections are allowed.
17-Sep-2021 14:07:02 Please see https://chromedriver.chromium.org/security-considerations for suggestions on keeping ChromeDriver safe.
17-Sep-2021 14:07:02 ChromeDriver was started successfully.
17-Sep-2021 14:07:02 Sep 17, 2021 2:07:02 PM org.openqa.selenium.remote.ProtocolHandshake createSession
17-Sep-2021 14:07:02 INFO: Detected dialect: W3C
17-Sep-2021 14:07:14 Tests run: 1, Failures: 0, Errors: 0, Skipped: 0, Time elapsed: 12.353 sec
17-Sep-2021 14:07:14 Running org.openmrs.reference.StartVisitTest
17-Sep-2021 14:07:14 Running locally...
17-Sep-2021 14:07:14 Starting ChromeDriver 90.0.4430.24 (4c6d850f087da467d926e8eddb76550aed655991-refs/branch-heads/4430@{#429}) on port 26680
17-Sep-2021 14:07:14 Only local connections are allowed.
17-Sep-2021 14:07:14 Please see https://chromedriver.chromium.org/security-considerations for suggestions on keeping ChromeDriver safe.
17-Sep-2021 14:07:14 ChromeDriver was started successfully.
17-Sep-2021 14:07:14 Sep 17, 2021 2:07:14 PM org.openqa.selenium.remote.ProtocolHandshake createSession
17-Sep-2021 14:07:14 INFO: Detected dialect: W3C
17-Sep-2021 14:07:23 Tests run: 1, Failures: 0, Errors: 0, Skipped: 0, Time elapsed: 9.224 sec
17-Sep-2021 14:07:23 Running org.openmrs.reference.DeletePersonTest
17-Sep-2021 14:07:23 Running locally...
17-Sep-2021 14:07:23 Starting ChromeDriver 90.0.4430.24 (4c6d850f087da467d926e8eddb76550aed655991-refs/branch-heads/4430@{#429}) on port 19694
17-Sep-2021 14:07:23 Only local connections are allowed.
17-Sep-2021 14:07:23 Please see https://chromedriver.chromium.org/security-considerations for suggestions on keeping ChromeDriver safe.
17-Sep-2021 14:07:23 ChromeDriver was started successfully.
17-Sep-2021 14:07:23 Sep 17, 2021 2:07:23 PM org.openqa.selenium.remote.ProtocolHandshake createSession
17-Sep-2021 14:07:23 INFO: Detected dialect: W3C
17-Sep-2021 14:07:28 Tests run: 1, Failures: 0, Errors: 0, Skipped: 0, Time elapsed: 4.84 sec
17-Sep-2021 14:07:28 Running org.openmrs.reference.EditProviderTest
17-Sep-2021 14:07:28 Running locally...
17-Sep-2021 14:07:28 Starting ChromeDriver 90.0.4430.24 (4c6d850f087da467d926e8eddb76550aed655991-refs/branch-heads/4430@{#429}) on port 31262
17-Sep-2021 14:07:28 Only local connections are allowed.
17-Sep-2021 14:07:28 Please see https://chromedriver.chromium.org/security-considerations for suggestions on keeping ChromeDriver safe.
17-Sep-2021 14:07:28 ChromeDriver was started successfully.
17-Sep-2021 14:07:28 Sep 17, 2021 2:07:28 PM org.openqa.selenium.remote.ProtocolHandshake createSession
17-Sep-2021 14:07:28 INFO: Detected dialect: W3C
17-Sep-2021 14:07:33 Tests run: 1, Failures: 0, Errors: 0, Skipped: 0, Time elapsed: 5.274 sec
17-Sep-2021 14:07:33 Running org.openmrs.reference.RetireVisitTypeTest
17-Sep-2021 14:07:33 Running locally...
17-Sep-2021 14:07:33 Starting ChromeDriver 90.0.4430.24 (4c6d850f087da467d926e8eddb76550aed655991-refs/branch-heads/4430@{#429}) on port 15297
17-Sep-2021 14:07:33 Only local connections are allowed.
17-Sep-2021 14:07:33 Please see https://chromedriver.chromium.org/security-considerations for suggestions on keeping ChromeDriver safe.
17-Sep-2021 14:07:33 ChromeDriver was started successfully.
17-Sep-2021 14:07:34 Sep 17, 2021 2:07:34 PM org.openqa.selenium.remote.ProtocolHandshake createSession
17-Sep-2021 14:07:34 INFO: Detected dialect: W3C
17-Sep-2021 14:07:40 Tests run: 1, Failures: 0, Errors: 0, Skipped: 0, Time elapsed: 6.679 sec
17-Sep-2021 14:07:40
17-Sep-2021 14:07:40 Results :
17-Sep-2021 14:07:40
17-Sep-2021 14:07:40 Tests in error:
17-Sep-2021 14:07:40   addUserTest(org.openmrs.reference.AddUserTest): Expected condition failed: waiting for org.openmrs.uitestframework.page.Page$1@7a73e979 (tried for 120 second(s) with 500 milliseconds interval)(..)
17-Sep-2021 14:07:40   addUserTest(org.openmrs.reference.AddUserTest): Session ID is null. Using WebDriver after calling quit()?(..)
17-Sep-2021 14:07:40
17-Sep-2021 14:07:40 Tests run: 59, Failures: 0, Errors: 2, Skipped: 0
17-Sep-2021 14:07:40
17-Sep-2021 14:07:40 [INFO] ------------------------------------------------------------------------
17-Sep-2021 14:07:40 [INFO] Reactor Summary:
17-Sep-2021 14:07:40 [INFO]
17-Sep-2021 14:07:40 [INFO] Reference Application Distribution ................. SUCCESS [  0.319 s]
17-Sep-2021 14:07:40 [INFO] Reference Application Distribution Package ......... SUCCESS [ 50.263 s]
17-Sep-2021 14:07:40 [INFO] Reference Application Distribution UI Tests ........ FAILURE [13:15 min]
17-Sep-2021 14:07:40 [INFO] ------------------------------------------------------------------------
17-Sep-2021 14:07:40 [INFO] BUILD FAILURE
17-Sep-2021 14:07:40 [INFO] ------------------------------------------------------------------------
17-Sep-2021 14:07:40 [INFO] Total time: 14:06 min
17-Sep-2021 14:07:40 [INFO] Finished at: 2021-09-17T14:07:40+00:00
17-Sep-2021 14:07:41 [INFO] Final Memory: 63M/366M
17-Sep-2021 14:07:41 [INFO] ------------------------------------------------------------------------
17-Sep-2021 14:07:41 [ERROR] Failed to execute goal org.apache.maven.plugins:maven-surefire-plugin:2.12:test (default-test) on project referenceapplication-ui-tests: There are test failures.
17-Sep-2021 14:07:41 [ERROR]
17-Sep-2021 14:07:41 [ERROR] Please refer to /home/bamboo-agent/bamboo-agent/xml-data/build-dir/REFAPP-UI-FRAMEWORK/ui-tests/target/surefire-reports for the individual test results.
17-Sep-2021 14:07:41 [ERROR] -> [Help 1]
17-Sep-2021 14:07:41 org.apache.maven.lifecycle.LifecycleExecutionException: Failed to execute goal org.apache.maven.plugins:maven-surefire-plugin:2.12:test (default-test) on project referenceapplication-ui-tests: There are test failures.
17-Sep-2021 14:07:41
17-Sep-2021 14:07:41 Please refer to /home/bamboo-agent/bamboo-agent/xml-data/build-dir/REFAPP-UI-FRAMEWORK/ui-tests/target/surefire-reports for the individual test results.
17-Sep-2021 14:07:41         at org.apache.maven.lifecycle.internal.MojoExecutor.execute(MojoExecutor.java:212)
17-Sep-2021 14:07:41         at org.apache.maven.lifecycle.internal.MojoExecutor.execute(MojoExecutor.java:153)
17-Sep-2021 14:07:41         at org.apache.maven.lifecycle.internal.MojoExecutor.execute(MojoExecutor.java:145)
17-Sep-2021 14:07:41         at org.apache.maven.lifecycle.internal.LifecycleModuleBuilder.buildProject(LifecycleModuleBuilder.java:116)
17-Sep-2021 14:07:41         at org.apache.maven.lifecycle.internal.LifecycleModuleBuilder.buildProject(LifecycleModuleBuilder.java:80)
17-Sep-2021 14:07:41         at org.apache.maven.lifecycle.internal.builder.singlethreaded.SingleThreadedBuilder.build(SingleThreadedBuilder.java:51)
17-Sep-2021 14:07:41         at org.apache.maven.lifecycle.internal.LifecycleStarter.execute(LifecycleStarter.java:128)
17-Sep-2021 14:07:41         at org.apache.maven.DefaultMaven.doExecute(DefaultMaven.java:307)
17-Sep-2021 14:07:41         at org.apache.maven.DefaultMaven.doExecute(DefaultMaven.java:193)
17-Sep-2021 14:07:41         at org.apache.maven.DefaultMaven.execute(DefaultMaven.java:106)
17-Sep-2021 14:07:41         at org.apache.maven.cli.MavenCli.execute(MavenCli.java:863)
17-Sep-2021 14:07:41         at org.apache.maven.cli.MavenCli.doMain(MavenCli.java:288)
17-Sep-2021 14:07:41         at org.apache.maven.cli.MavenCli.main(MavenCli.java:199)
17-Sep-2021 14:07:41         at sun.reflect.NativeMethodAccessorImpl.invoke0(Native Method)
17-Sep-2021 14:07:41         at sun.reflect.NativeMethodAccessorImpl.invoke(NativeMethodAccessorImpl.java:62)
17-Sep-2021 14:07:41         at sun.reflect.DelegatingMethodAccessorImpl.invoke(DelegatingMethodAccessorImpl.java:43)
17-Sep-2021 14:07:41         at java.lang.reflect.Method.invoke(Method.java:498)
17-Sep-2021 14:07:41         at org.codehaus.plexus.classworlds.launcher.Launcher.launchEnhanced(Launcher.java:289)
17-Sep-2021 14:07:41         at org.codehaus.plexus.classworlds.launcher.Launcher.launch(Launcher.java:229)
17-Sep-2021 14:07:41         at org.codehaus.plexus.classworlds.launcher.Launcher.mainWithExitCode(Launcher.java:415)
17-Sep-2021 14:07:41         at org.codehaus.plexus.classworlds.launcher.Launcher.main(Launcher.java:356)
17-Sep-2021 14:07:41 Caused by: org.apache.maven.plugin.MojoFailureException: There are test failures.
17-Sep-2021 14:07:41
17-Sep-2021 14:07:41 Please refer to /home/bamboo-agent/bamboo-agent/xml-data/build-dir/REFAPP-UI-FRAMEWORK/ui-tests/target/surefire-reports for the individual test results.
17-Sep-2021 14:07:41         at org.apache.maven.plugin.surefire.SurefireHelper.reportExecution(SurefireHelper.java:83)
17-Sep-2021 14:07:41         at org.apache.maven.plugin.surefire.SurefirePlugin.writeSummary(SurefirePlugin.java:673)
17-Sep-2021 14:07:41         at org.apache.maven.plugin.surefire.SurefirePlugin.handleSummary(SurefirePlugin.java:647)
17-Sep-2021 14:07:41         at org.apache.maven.plugin.surefire.AbstractSurefireMojo.executeAfterPreconditionsChecked(AbstractSurefireMojo.java:137)
17-Sep-2021 14:07:41         at org.apache.maven.plugin.surefire.AbstractSurefireMojo.execute(AbstractSurefireMojo.java:98)
17-Sep-2021 14:07:41         at org.apache.maven.plugin.DefaultBuildPluginManager.executeMojo(DefaultBuildPluginManager.java:134)
17-Sep-2021 14:07:41         at org.apache.maven.lifecycle.internal.MojoExecutor.execute(MojoExecutor.java:207)
17-Sep-2021 14:07:41         ... 20 more
17-Sep-2021 14:07:41 [ERROR]
17-Sep-2021 14:07:41 [ERROR] Re-run Maven using the -X switch to enable full debug logging.
17-Sep-2021 14:07:41 [ERROR]
17-Sep-2021 14:07:41 [ERROR] For more information about the errors and possible solutions, please read the following articles:
17-Sep-2021 14:07:41 [ERROR] [Help 1] http://cwiki.apache.org/confluence/display/MAVEN/MojoFailureException
17-Sep-2021 14:07:41 [ERROR]
17-Sep-2021 14:07:41 [ERROR] After correcting the problems, you can resume the build with the command
17-Sep-2021 14:07:41 [ERROR]   mvn <goals> -rf :referenceapplication-ui-tests
17-Sep-2021 14:07:41 Failing task since return code of [/usr/share/apache-maven-3.3.9/bin/mvn --batch-mode -Djava.io.tmpdir=/home/bamboo-agent/bamboo-agent/.agent_tmp/REFAPP-UI-FRAMEWORK clean install -DskipTests=false -e] was 1 while expected 0
17-Sep-2021 14:07:41 Parsing test results under /home/bamboo-agent/bamboo-agent/xml-data/build-dir/REFAPP-UI-FRAMEWORK...
17-Sep-2021 14:07:42 Finished task 'Build distribution' with result: Failed
17-Sep-2021 14:07:42 Running post build plugin 'Docker Container Cleanup'
17-Sep-2021 14:07:42 Running post build plugin 'NCover Results Collector'
17-Sep-2021 14:07:42 Running post build plugin 'Clover Results Collector'
17-Sep-2021 14:07:42 Running post build plugin 'Sauce OnDemand Post Runner'
17-Sep-2021 14:07:42 Running post build plugin 'npm Cache Cleanup'
17-Sep-2021 14:07:42 Running post build plugin 'Artifact Copier'
17-Sep-2021 14:07:42 Finalising the build...
17-Sep-2021 14:07:42 Stopping timer.
17-Sep-2021 14:07:42 Build REFAPP-UI-FRAMEWORK-567 completed.
17-Sep-2021 14:07:42 Running on server: post build plugin 'NCover Results Collector'
17-Sep-2021 14:07:42 Running on server: post build plugin 'Build Hanging Detection Configuration'
17-Sep-2021 14:07:42 Running on server: post build plugin 'Clover Delta Calculator'
17-Sep-2021 14:07:42 Running on server: post build plugin 'Maven Dependencies Postprocessor'
17-Sep-2021 14:07:42 All post build plugins have finished
17-Sep-2021 14:07:42 Generating build results summary...
17-Sep-2021 14:07:42 Saving build results to disk...
17-Sep-2021 14:07:42 Logging substituted variables...
17-Sep-2021 14:07:42 Indexing build results...
17-Sep-2021 14:07:42 Finished building REFAPP-UI-FRAMEWORK-567.