UI tests for the reference application

Build: #568 failed

Job: Run QA UI Tests failed

Stages & jobs

  1. Ref App UI Testing

Job result summary

Completed
Duration
4 minutes
Agent
yokobue.openmrs.org
Revisions
Distribution
b272c84fc6683c447eb871c0cc23de60f4e3547b b272c84fc6683c447eb871c0cc23de60f4e3547b
UI Test Framework
8838c8eeee749c044f9846bcb0a31a7065db1260 8838c8eeee749c044f9846bcb0a31a7065db1260
Total tests
58
Failing since
#567 (Code changes detected – )
Fixed in
#570 (Manual run by Kakumirizi Daud)

Tests

  • 58 tests in total
  • 34 tests failed
  • 33 failures are new
  • 3 minutes taken in total.
New test failures 33
Status Test Duration
Collapse Failed AddDeleteLocationTest addLocationTest History
< 1 sec
java.lang.AssertionError: Test killed due to server failure
	at org.junit.Assert.fail(Assert.java:89)
	at org.openmrs.uitestframework.test.TestBase.startWebDriver(TestBase.java:127)
	at sun.reflect.GeneratedMethodAccessor6.invoke(Unknown Source)
	at sun.reflect.DelegatingMethodAccessorImpl.invoke(DelegatingMethodAccessorImpl.java:43)
	at java.lang.reflect.Method.invoke(Method.java:498)
	at org.junit.runners.model.FrameworkMethod$1.runReflectiveCall(FrameworkMethod.java:59)
	at org.junit.internal.runners.model.ReflectiveCallable.run(ReflectiveCallable.java:12)
(30 more lines...)
Collapse Failed AddDeleteServiceTest addDeleteServiceTest History
< 1 sec
java.lang.AssertionError: Test killed due to server failure
	at org.junit.Assert.fail(Assert.java:89)
	at org.openmrs.uitestframework.test.TestBase.startWebDriver(TestBase.java:127)
	at sun.reflect.GeneratedMethodAccessor6.invoke(Unknown Source)
	at sun.reflect.DelegatingMethodAccessorImpl.invoke(DelegatingMethodAccessorImpl.java:43)
	at java.lang.reflect.Method.invoke(Method.java:498)
	at org.junit.runners.model.FrameworkMethod$1.runReflectiveCall(FrameworkMethod.java:59)
	at org.junit.internal.runners.model.ReflectiveCallable.run(ReflectiveCallable.java:12)
(30 more lines...)
Collapse Failed AddDiagnosisToVisitNoteTest addDiagnosisToVisitNoteTest History
< 1 sec
java.lang.AssertionError: Test killed due to server failure
	at org.junit.Assert.fail(Assert.java:89)
	at org.openmrs.uitestframework.test.TestBase.startWebDriver(TestBase.java:127)
	at sun.reflect.GeneratedMethodAccessor6.invoke(Unknown Source)
	at sun.reflect.DelegatingMethodAccessorImpl.invoke(DelegatingMethodAccessorImpl.java:43)
	at java.lang.reflect.Method.invoke(Method.java:498)
	at org.junit.runners.model.FrameworkMethod$1.runReflectiveCall(FrameworkMethod.java:59)
	at org.junit.internal.runners.model.ReflectiveCallable.run(ReflectiveCallable.java:12)
(30 more lines...)
Collapse Failed AddEditAppointmentBlockTest addEditAppointmentBlockTest History
< 1 sec
java.lang.AssertionError: Test killed due to server failure
	at org.junit.Assert.fail(Assert.java:89)
	at org.openmrs.uitestframework.test.TestBase.startWebDriver(TestBase.java:127)
	at sun.reflect.GeneratedMethodAccessor6.invoke(Unknown Source)
	at sun.reflect.DelegatingMethodAccessorImpl.invoke(DelegatingMethodAccessorImpl.java:43)
	at java.lang.reflect.Method.invoke(Method.java:498)
	at org.junit.runners.model.FrameworkMethod$1.runReflectiveCall(FrameworkMethod.java:59)
	at org.junit.internal.runners.model.ReflectiveCallable.run(ReflectiveCallable.java:12)
(30 more lines...)
Collapse Failed AddNewAllergyTest addNewAllergyTest History
< 1 sec
java.lang.AssertionError: Test killed due to server failure
	at org.junit.Assert.fail(Assert.java:89)
	at org.openmrs.uitestframework.test.TestBase.startWebDriver(TestBase.java:127)
	at sun.reflect.GeneratedMethodAccessor6.invoke(Unknown Source)
	at sun.reflect.DelegatingMethodAccessorImpl.invoke(DelegatingMethodAccessorImpl.java:43)
	at java.lang.reflect.Method.invoke(Method.java:498)
	at org.junit.runners.model.FrameworkMethod$1.runReflectiveCall(FrameworkMethod.java:59)
	at org.junit.internal.runners.model.ReflectiveCallable.run(ReflectiveCallable.java:12)
(30 more lines...)
Collapse Failed AddPastVisitTest addPastVisitTest History
< 1 sec
java.lang.AssertionError: Test killed due to server failure
	at org.junit.Assert.fail(Assert.java:89)
	at org.openmrs.uitestframework.test.TestBase.startWebDriver(TestBase.java:127)
	at sun.reflect.GeneratedMethodAccessor6.invoke(Unknown Source)
	at sun.reflect.DelegatingMethodAccessorImpl.invoke(DelegatingMethodAccessorImpl.java:43)
	at java.lang.reflect.Method.invoke(Method.java:498)
	at org.junit.runners.model.FrameworkMethod$1.runReflectiveCall(FrameworkMethod.java:59)
	at org.junit.internal.runners.model.ReflectiveCallable.run(ReflectiveCallable.java:12)
(30 more lines...)
Collapse Failed AddProviderTest addProviderTest History
< 1 sec
java.lang.AssertionError: Test killed due to server failure
	at org.junit.Assert.fail(Assert.java:89)
	at org.openmrs.uitestframework.test.TestBase.startWebDriver(TestBase.java:127)
	at sun.reflect.GeneratedMethodAccessor6.invoke(Unknown Source)
	at sun.reflect.DelegatingMethodAccessorImpl.invoke(DelegatingMethodAccessorImpl.java:43)
	at java.lang.reflect.Method.invoke(Method.java:498)
	at org.junit.runners.model.FrameworkMethod$1.runReflectiveCall(FrameworkMethod.java:59)
	at org.junit.internal.runners.model.ReflectiveCallable.run(ReflectiveCallable.java:12)
(30 more lines...)
Collapse Failed BookRequestAppointmentTest bookRequestAppointmentTest History
< 1 sec
java.lang.AssertionError: Test killed due to server failure
	at org.junit.Assert.fail(Assert.java:89)
	at org.openmrs.uitestframework.test.TestBase.startWebDriver(TestBase.java:127)
	at sun.reflect.GeneratedMethodAccessor6.invoke(Unknown Source)
	at sun.reflect.DelegatingMethodAccessorImpl.invoke(DelegatingMethodAccessorImpl.java:43)
	at java.lang.reflect.Method.invoke(Method.java:498)
	at org.junit.runners.model.FrameworkMethod$1.runReflectiveCall(FrameworkMethod.java:59)
	at org.junit.internal.runners.model.ReflectiveCallable.run(ReflectiveCallable.java:12)
(30 more lines...)
Collapse Failed CaptureVitalsTest captureVitalsTest History
< 1 sec
java.lang.AssertionError: Test killed due to server failure
	at org.junit.Assert.fail(Assert.java:89)
	at org.openmrs.uitestframework.test.TestBase.startWebDriver(TestBase.java:127)
	at sun.reflect.GeneratedMethodAccessor6.invoke(Unknown Source)
	at sun.reflect.DelegatingMethodAccessorImpl.invoke(DelegatingMethodAccessorImpl.java:43)
	at java.lang.reflect.Method.invoke(Method.java:498)
	at org.junit.runners.model.FrameworkMethod$1.runReflectiveCall(FrameworkMethod.java:59)
	at org.junit.internal.runners.model.ReflectiveCallable.run(ReflectiveCallable.java:12)
(30 more lines...)
Collapse Failed ContactInfoTest contactInfoTest History
< 1 sec
java.lang.AssertionError: Test killed due to server failure
	at org.junit.Assert.fail(Assert.java:89)
	at org.openmrs.uitestframework.test.TestBase.startWebDriver(TestBase.java:127)
	at sun.reflect.GeneratedMethodAccessor6.invoke(Unknown Source)
	at sun.reflect.DelegatingMethodAccessorImpl.invoke(DelegatingMethodAccessorImpl.java:43)
	at java.lang.reflect.Method.invoke(Method.java:498)
	at org.junit.runners.model.FrameworkMethod$1.runReflectiveCall(FrameworkMethod.java:59)
	at org.junit.internal.runners.model.ReflectiveCallable.run(ReflectiveCallable.java:12)
(30 more lines...)
Collapse Failed DeleteAppointmentBlockTest deleteAppointmentBlockTest History
< 1 sec
java.lang.AssertionError: Test killed due to server failure
	at org.junit.Assert.fail(Assert.java:89)
	at org.openmrs.uitestframework.test.TestBase.startWebDriver(TestBase.java:127)
	at sun.reflect.GeneratedMethodAccessor6.invoke(Unknown Source)
	at sun.reflect.DelegatingMethodAccessorImpl.invoke(DelegatingMethodAccessorImpl.java:43)
	at java.lang.reflect.Method.invoke(Method.java:498)
	at org.junit.runners.model.FrameworkMethod$1.runReflectiveCall(FrameworkMethod.java:59)
	at org.junit.internal.runners.model.ReflectiveCallable.run(ReflectiveCallable.java:12)
(30 more lines...)
Collapse Failed DeletePersonTest deletePersonTest History
< 1 sec
java.lang.AssertionError: Test killed due to server failure
	at org.junit.Assert.fail(Assert.java:89)
	at org.openmrs.uitestframework.test.TestBase.startWebDriver(TestBase.java:127)
	at sun.reflect.GeneratedMethodAccessor6.invoke(Unknown Source)
	at sun.reflect.DelegatingMethodAccessorImpl.invoke(DelegatingMethodAccessorImpl.java:43)
	at java.lang.reflect.Method.invoke(Method.java:498)
	at org.junit.runners.model.FrameworkMethod$1.runReflectiveCall(FrameworkMethod.java:59)
	at org.junit.internal.runners.model.ReflectiveCallable.run(ReflectiveCallable.java:12)
(30 more lines...)
Collapse Failed DeleteProviderTest deleteProviderTest History
< 1 sec
java.lang.AssertionError: Test killed due to server failure
	at org.junit.Assert.fail(Assert.java:89)
	at org.openmrs.uitestframework.test.TestBase.startWebDriver(TestBase.java:127)
	at sun.reflect.GeneratedMethodAccessor6.invoke(Unknown Source)
	at sun.reflect.DelegatingMethodAccessorImpl.invoke(DelegatingMethodAccessorImpl.java:43)
	at java.lang.reflect.Method.invoke(Method.java:498)
	at org.junit.runners.model.FrameworkMethod$1.runReflectiveCall(FrameworkMethod.java:59)
	at org.junit.internal.runners.model.ReflectiveCallable.run(ReflectiveCallable.java:12)
(30 more lines...)
Collapse Failed DuplicatePatientRegisterTest duplicatePatientRegisterTest History
< 1 sec
java.lang.AssertionError: Test killed due to server failure
	at org.junit.Assert.fail(Assert.java:89)
	at org.openmrs.uitestframework.test.TestBase.startWebDriver(TestBase.java:127)
	at sun.reflect.GeneratedMethodAccessor6.invoke(Unknown Source)
	at sun.reflect.DelegatingMethodAccessorImpl.invoke(DelegatingMethodAccessorImpl.java:43)
	at java.lang.reflect.Method.invoke(Method.java:498)
	at org.junit.runners.model.FrameworkMethod$1.runReflectiveCall(FrameworkMethod.java:59)
	at org.junit.internal.runners.model.ReflectiveCallable.run(ReflectiveCallable.java:12)
(30 more lines...)
Collapse Failed EditProviderTest editProviderTest History
< 1 sec
java.lang.AssertionError: Test killed due to server failure
	at org.junit.Assert.fail(Assert.java:89)
	at org.openmrs.uitestframework.test.TestBase.startWebDriver(TestBase.java:127)
	at sun.reflect.GeneratedMethodAccessor6.invoke(Unknown Source)
	at sun.reflect.DelegatingMethodAccessorImpl.invoke(DelegatingMethodAccessorImpl.java:43)
	at java.lang.reflect.Method.invoke(Method.java:498)
	at org.junit.runners.model.FrameworkMethod$1.runReflectiveCall(FrameworkMethod.java:59)
	at org.junit.internal.runners.model.ReflectiveCallable.run(ReflectiveCallable.java:12)
(30 more lines...)
Collapse Failed EditServiceTest editServiceTest History
< 1 sec
java.lang.AssertionError: Test killed due to server failure
	at org.junit.Assert.fail(Assert.java:89)
	at org.openmrs.uitestframework.test.TestBase.startWebDriver(TestBase.java:127)
	at sun.reflect.GeneratedMethodAccessor6.invoke(Unknown Source)
	at sun.reflect.DelegatingMethodAccessorImpl.invoke(DelegatingMethodAccessorImpl.java:43)
	at java.lang.reflect.Method.invoke(Method.java:498)
	at org.junit.runners.model.FrameworkMethod$1.runReflectiveCall(FrameworkMethod.java:59)
	at org.junit.internal.runners.model.ReflectiveCallable.run(ReflectiveCallable.java:12)
(30 more lines...)
Collapse Failed EndVisitTest endVisitTest History
< 1 sec
java.lang.AssertionError: Test killed due to server failure
	at org.junit.Assert.fail(Assert.java:89)
	at org.openmrs.uitestframework.test.TestBase.startWebDriver(TestBase.java:127)
	at sun.reflect.GeneratedMethodAccessor6.invoke(Unknown Source)
	at sun.reflect.DelegatingMethodAccessorImpl.invoke(DelegatingMethodAccessorImpl.java:43)
	at java.lang.reflect.Method.invoke(Method.java:498)
	at org.junit.runners.model.FrameworkMethod$1.runReflectiveCall(FrameworkMethod.java:59)
	at org.junit.internal.runners.model.ReflectiveCallable.run(ReflectiveCallable.java:12)
(30 more lines...)
Collapse Failed FindPatientByNameTest findPatientByNameTest History
< 1 sec
java.lang.AssertionError: Test killed due to server failure
	at org.junit.Assert.fail(Assert.java:89)
	at org.openmrs.uitestframework.test.TestBase.failTest(TestBase.java:216)
	at org.openmrs.uitestframework.test.TestBase.launchBrowser(TestBase.java:196)
	at org.openmrs.uitestframework.test.TestBase.startWebDriver(TestBase.java:130)
	at sun.reflect.GeneratedMethodAccessor6.invoke(Unknown Source)
	at sun.reflect.DelegatingMethodAccessorImpl.invoke(DelegatingMethodAccessorImpl.java:43)
	at java.lang.reflect.Method.invoke(Method.java:498)
(32 more lines...)
Collapse Failed LoginTest verifyClerkModulesAvailableOnHomePage History
< 1 sec
java.lang.AssertionError: Test killed due to server failure
	at org.junit.Assert.fail(Assert.java:89)
	at org.openmrs.uitestframework.test.TestBase.startWebDriver(TestBase.java:127)
	at sun.reflect.GeneratedMethodAccessor6.invoke(Unknown Source)
	at sun.reflect.DelegatingMethodAccessorImpl.invoke(DelegatingMethodAccessorImpl.java:43)
	at java.lang.reflect.Method.invoke(Method.java:498)
	at org.junit.runners.model.FrameworkMethod$1.runReflectiveCall(FrameworkMethod.java:59)
	at org.junit.internal.runners.model.ReflectiveCallable.run(ReflectiveCallable.java:12)
(30 more lines...)
Collapse Failed LoginTest verifyDoctorModulesAvailableOnHomePage History
< 1 sec
java.lang.AssertionError: Test killed due to server failure
	at org.junit.Assert.fail(Assert.java:89)
	at org.openmrs.uitestframework.test.TestBase.startWebDriver(TestBase.java:127)
	at sun.reflect.GeneratedMethodAccessor6.invoke(Unknown Source)
	at sun.reflect.DelegatingMethodAccessorImpl.invoke(DelegatingMethodAccessorImpl.java:43)
	at java.lang.reflect.Method.invoke(Method.java:498)
	at org.junit.runners.model.FrameworkMethod$1.runReflectiveCall(FrameworkMethod.java:59)
	at org.junit.internal.runners.model.ReflectiveCallable.run(ReflectiveCallable.java:12)
(30 more lines...)
Collapse Failed LoginTest verifyModulesAvailableOnHomePage History
< 1 sec
java.lang.AssertionError: Test killed due to server failure
	at org.junit.Assert.fail(Assert.java:89)
	at org.openmrs.uitestframework.test.TestBase.startWebDriver(TestBase.java:127)
	at sun.reflect.GeneratedMethodAccessor6.invoke(Unknown Source)
	at sun.reflect.DelegatingMethodAccessorImpl.invoke(DelegatingMethodAccessorImpl.java:43)
	at java.lang.reflect.Method.invoke(Method.java:498)
	at org.junit.runners.model.FrameworkMethod$1.runReflectiveCall(FrameworkMethod.java:59)
	at org.junit.internal.runners.model.ReflectiveCallable.run(ReflectiveCallable.java:12)
(30 more lines...)
Collapse Failed LoginTest verifyNurseModulesAvailableOnHomePage History
< 1 sec
java.lang.AssertionError: Test killed due to server failure
	at org.junit.Assert.fail(Assert.java:89)
	at org.openmrs.uitestframework.test.TestBase.startWebDriver(TestBase.java:127)
	at sun.reflect.GeneratedMethodAccessor6.invoke(Unknown Source)
	at sun.reflect.DelegatingMethodAccessorImpl.invoke(DelegatingMethodAccessorImpl.java:43)
	at java.lang.reflect.Method.invoke(Method.java:498)
	at org.junit.runners.model.FrameworkMethod$1.runReflectiveCall(FrameworkMethod.java:59)
	at org.junit.internal.runners.model.ReflectiveCallable.run(ReflectiveCallable.java:12)
(30 more lines...)
Collapse Failed LoginTest verifySysadminModulesAvailableOnHomePage History
< 1 sec
java.lang.AssertionError: Test killed due to server failure
	at org.junit.Assert.fail(Assert.java:89)
	at org.openmrs.uitestframework.test.TestBase.startWebDriver(TestBase.java:127)
	at sun.reflect.GeneratedMethodAccessor6.invoke(Unknown Source)
	at sun.reflect.DelegatingMethodAccessorImpl.invoke(DelegatingMethodAccessorImpl.java:43)
	at java.lang.reflect.Method.invoke(Method.java:498)
	at org.junit.runners.model.FrameworkMethod$1.runReflectiveCall(FrameworkMethod.java:59)
	at org.junit.internal.runners.model.ReflectiveCallable.run(ReflectiveCallable.java:12)
(30 more lines...)
Collapse Failed MergePatientTest mergePatientTest History
< 1 sec
java.lang.AssertionError: Test killed due to server failure
	at org.junit.Assert.fail(Assert.java:89)
	at org.openmrs.uitestframework.test.TestBase.startWebDriver(TestBase.java:127)
	at sun.reflect.GeneratedMethodAccessor6.invoke(Unknown Source)
	at sun.reflect.DelegatingMethodAccessorImpl.invoke(DelegatingMethodAccessorImpl.java:43)
	at java.lang.reflect.Method.invoke(Method.java:498)
	at org.junit.runners.model.FrameworkMethod$1.runReflectiveCall(FrameworkMethod.java:59)
	at org.junit.internal.runners.model.ReflectiveCallable.run(ReflectiveCallable.java:12)
(30 more lines...)
Collapse Failed MergeVisitsTest mergeVisitsTest History
< 1 sec
java.lang.AssertionError: Test killed due to server failure
	at org.junit.Assert.fail(Assert.java:89)
	at org.openmrs.uitestframework.test.TestBase.startWebDriver(TestBase.java:127)
	at sun.reflect.GeneratedMethodAccessor6.invoke(Unknown Source)
	at sun.reflect.DelegatingMethodAccessorImpl.invoke(DelegatingMethodAccessorImpl.java:43)
	at java.lang.reflect.Method.invoke(Method.java:498)
	at org.junit.runners.model.FrameworkMethod$1.runReflectiveCall(FrameworkMethod.java:59)
	at org.junit.internal.runners.model.ReflectiveCallable.run(ReflectiveCallable.java:12)
(30 more lines...)
Collapse Failed NamePatientAccentedLetterTest namePatientAccentedLetterTest History
< 1 sec
java.lang.AssertionError: Test killed due to server failure
	at org.junit.Assert.fail(Assert.java:89)
	at org.openmrs.uitestframework.test.TestBase.startWebDriver(TestBase.java:127)
	at sun.reflect.GeneratedMethodAccessor6.invoke(Unknown Source)
	at sun.reflect.DelegatingMethodAccessorImpl.invoke(DelegatingMethodAccessorImpl.java:43)
	at java.lang.reflect.Method.invoke(Method.java:498)
	at org.junit.runners.model.FrameworkMethod$1.runReflectiveCall(FrameworkMethod.java:59)
	at org.junit.internal.runners.model.ReflectiveCallable.run(ReflectiveCallable.java:12)
(30 more lines...)
Collapse Failed RecordMergeIssueTest recordMergeIssueTest History
< 1 sec
java.lang.AssertionError: Test killed due to server failure
	at org.junit.Assert.fail(Assert.java:89)
	at org.openmrs.uitestframework.test.TestBase.startWebDriver(TestBase.java:127)
	at sun.reflect.GeneratedMethodAccessor6.invoke(Unknown Source)
	at sun.reflect.DelegatingMethodAccessorImpl.invoke(DelegatingMethodAccessorImpl.java:43)
	at java.lang.reflect.Method.invoke(Method.java:498)
	at org.junit.runners.model.FrameworkMethod$1.runReflectiveCall(FrameworkMethod.java:59)
	at org.junit.internal.runners.model.ReflectiveCallable.run(ReflectiveCallable.java:12)
(30 more lines...)
Collapse Failed RegisterPatientTest registerPatientTest History
< 1 sec
java.lang.AssertionError: Test killed due to server failure
	at org.junit.Assert.fail(Assert.java:89)
	at org.openmrs.uitestframework.test.TestBase.startWebDriver(TestBase.java:127)
	at sun.reflect.GeneratedMethodAccessor6.invoke(Unknown Source)
	at sun.reflect.DelegatingMethodAccessorImpl.invoke(DelegatingMethodAccessorImpl.java:43)
	at java.lang.reflect.Method.invoke(Method.java:498)
	at org.junit.runners.model.FrameworkMethod$1.runReflectiveCall(FrameworkMethod.java:59)
	at org.junit.internal.runners.model.ReflectiveCallable.run(ReflectiveCallable.java:12)
(30 more lines...)
Collapse Failed RetirePersonTest retirePersonTest History
< 1 sec
java.lang.AssertionError: Test killed due to server failure
	at org.junit.Assert.fail(Assert.java:89)
	at org.openmrs.uitestframework.test.TestBase.startWebDriver(TestBase.java:127)
	at sun.reflect.GeneratedMethodAccessor6.invoke(Unknown Source)
	at sun.reflect.DelegatingMethodAccessorImpl.invoke(DelegatingMethodAccessorImpl.java:43)
	at java.lang.reflect.Method.invoke(Method.java:498)
	at org.junit.runners.model.FrameworkMethod$1.runReflectiveCall(FrameworkMethod.java:59)
	at org.junit.internal.runners.model.ReflectiveCallable.run(ReflectiveCallable.java:12)
(30 more lines...)
Collapse Failed RetireProviderTest retireProviderTest History
< 1 sec
java.lang.AssertionError: Test killed due to server failure
	at org.junit.Assert.fail(Assert.java:89)
	at org.openmrs.uitestframework.test.TestBase.startWebDriver(TestBase.java:127)
	at sun.reflect.GeneratedMethodAccessor6.invoke(Unknown Source)
	at sun.reflect.DelegatingMethodAccessorImpl.invoke(DelegatingMethodAccessorImpl.java:43)
	at java.lang.reflect.Method.invoke(Method.java:498)
	at org.junit.runners.model.FrameworkMethod$1.runReflectiveCall(FrameworkMethod.java:59)
	at org.junit.internal.runners.model.ReflectiveCallable.run(ReflectiveCallable.java:12)
(30 more lines...)
Collapse Failed RetireVisitTypeTest retireVisitTypeTest History
< 1 sec
java.lang.AssertionError: Test killed due to server failure
	at org.junit.Assert.fail(Assert.java:89)
	at org.openmrs.uitestframework.test.TestBase.startWebDriver(TestBase.java:127)
	at sun.reflect.GeneratedMethodAccessor6.invoke(Unknown Source)
	at sun.reflect.DelegatingMethodAccessorImpl.invoke(DelegatingMethodAccessorImpl.java:43)
	at java.lang.reflect.Method.invoke(Method.java:498)
	at org.junit.runners.model.FrameworkMethod$1.runReflectiveCall(FrameworkMethod.java:59)
	at org.junit.internal.runners.model.ReflectiveCallable.run(ReflectiveCallable.java:12)
(30 more lines...)
Collapse Failed StartVisitTest startVisitTest History
< 1 sec
java.lang.AssertionError: Test killed due to server failure
	at org.junit.Assert.fail(Assert.java:89)
	at org.openmrs.uitestframework.test.TestBase.startWebDriver(TestBase.java:127)
	at sun.reflect.GeneratedMethodAccessor6.invoke(Unknown Source)
	at sun.reflect.DelegatingMethodAccessorImpl.invoke(DelegatingMethodAccessorImpl.java:43)
	at java.lang.reflect.Method.invoke(Method.java:498)
	at org.junit.runners.model.FrameworkMethod$1.runReflectiveCall(FrameworkMethod.java:59)
	at org.junit.internal.runners.model.ReflectiveCallable.run(ReflectiveCallable.java:12)
(30 more lines...)
Collapse Failed UsingBackButtonInMergePatientTest usingBackButtonInMergePatientTest History
< 1 sec
java.lang.AssertionError: Test killed due to server failure
	at org.junit.Assert.fail(Assert.java:89)
	at org.openmrs.uitestframework.test.TestBase.startWebDriver(TestBase.java:127)
	at sun.reflect.GeneratedMethodAccessor6.invoke(Unknown Source)
	at sun.reflect.DelegatingMethodAccessorImpl.invoke(DelegatingMethodAccessorImpl.java:43)
	at java.lang.reflect.Method.invoke(Method.java:498)
	at org.junit.runners.model.FrameworkMethod$1.runReflectiveCall(FrameworkMethod.java:59)
	at org.junit.internal.runners.model.ReflectiveCallable.run(ReflectiveCallable.java:12)
(30 more lines...)
Existing test failures 1
Status Test Failing since Duration
java.lang.AssertionError: Test killed due to server failure
	at org.junit.Assert.fail(Assert.java:89)
	at org.openmrs.uitestframework.test.TestBase.startWebDriver(TestBase.java:127)
	at sun.reflect.GeneratedMethodAccessor6.invoke(Unknown Source)
	at sun.reflect.DelegatingMethodAccessorImpl.invoke(DelegatingMethodAccessorImpl.java:43)
	at java.lang.reflect.Method.invoke(Method.java:498)
	at org.junit.runners.model.FrameworkMethod$1.runReflectiveCall(FrameworkMethod.java:59)
	at org.junit.internal.runners.model.ReflectiveCallable.run(ReflectiveCallable.java:12)
(30 more lines...)