UI tests for the reference application

Build: #568 failed

Job: Run QA UI Tests failed

Stages & jobs

  1. Ref App UI Testing

Build log

The build generated 1,090 lines of output.The output is too long and has been truncated to the last 1,000 lines. Download or view full build log

17-Sep-2021 14:59:38 [WARNING] /home/bamboo-agent/bamboo-agent/xml-data/build-dir/REFAPP-UI-FRAMEWORK/src/main/java/org/openmrs/uitestframework/page/Page.java: Some input files use or override a deprecated API.
17-Sep-2021 14:59:38 [WARNING] /home/bamboo-agent/bamboo-agent/xml-data/build-dir/REFAPP-UI-FRAMEWORK/src/main/java/org/openmrs/uitestframework/page/Page.java: Recompile with -Xlint:deprecation for details.
17-Sep-2021 14:59:38 [INFO]
17-Sep-2021 14:59:38 [INFO] --- maven-resources-plugin:2.6:testResources (default-testResources) @ uitestframework ---
17-Sep-2021 14:59:38 [WARNING] Using platform encoding (UTF-8 actually) to copy filtered resources, i.e. build is platform dependent!
17-Sep-2021 14:59:38 [INFO] skip non existing resourceDirectory /home/bamboo-agent/bamboo-agent/xml-data/build-dir/REFAPP-UI-FRAMEWORK/src/test/resources
17-Sep-2021 14:59:38 [INFO]
17-Sep-2021 14:59:38 [INFO] --- maven-compiler-plugin:3.1:testCompile (default-testCompile) @ uitestframework ---
17-Sep-2021 14:59:38 [INFO] No sources to compile
17-Sep-2021 14:59:38 [INFO]
17-Sep-2021 14:59:38 [INFO] --- maven-surefire-plugin:2.12.4:test (default-test) @ uitestframework ---
17-Sep-2021 14:59:39 [INFO] No tests to run.
17-Sep-2021 14:59:39 [INFO]
17-Sep-2021 14:59:39 [INFO] --- maven-jar-plugin:2.4:jar (default-jar) @ uitestframework ---
17-Sep-2021 14:59:39 [INFO] Building jar: /home/bamboo-agent/bamboo-agent/xml-data/build-dir/REFAPP-UI-FRAMEWORK/target/uitestframework-2.5.0-SNAPSHOT.jar
17-Sep-2021 14:59:41 [INFO]
17-Sep-2021 14:59:41 [INFO] --- maven-install-plugin:2.4:install (default-install) @ uitestframework ---
17-Sep-2021 14:59:42 [INFO] Installing /home/bamboo-agent/bamboo-agent/xml-data/build-dir/REFAPP-UI-FRAMEWORK/target/uitestframework-2.5.0-SNAPSHOT.jar to /home/bamboo-agent/.m2/repository/org/openmrs/contrib/uitestframework/2.5.0-SNAPSHOT/uitestframework-2.5.0-SNAPSHOT.jar
17-Sep-2021 14:59:42 [INFO] Installing /home/bamboo-agent/bamboo-agent/xml-data/build-dir/REFAPP-UI-FRAMEWORK/pom.xml to /home/bamboo-agent/.m2/repository/org/openmrs/contrib/uitestframework/2.5.0-SNAPSHOT/uitestframework-2.5.0-SNAPSHOT.pom
17-Sep-2021 14:59:42 [INFO] ------------------------------------------------------------------------
17-Sep-2021 14:59:42 [INFO] BUILD SUCCESS
17-Sep-2021 14:59:42 [INFO] ------------------------------------------------------------------------
17-Sep-2021 14:59:42 [INFO] Total time: 11.233 s
17-Sep-2021 14:59:42 [INFO] Finished at: 2021-09-17T14:59:42+00:00
17-Sep-2021 14:59:42 [INFO] Final Memory: 25M/252M
17-Sep-2021 14:59:42 [INFO] ------------------------------------------------------------------------
17-Sep-2021 14:59:42 Finished task 'Build uitestframework' with result: Success
17-Sep-2021 14:59:42 Starting task 'Checkout distribution' of type 'com.atlassian.bamboo.plugins.vcs:task.vcs.checkout'
17-Sep-2021 14:59:42 Build always requires a clean checkout
17-Sep-2021 14:59:42 Cleaning build directory '/home/bamboo-agent/bamboo-agent/xml-data/build-dir/REFAPP-UI-FRAMEWORK'
17-Sep-2021 14:59:42 Checking out into /home/bamboo-agent/bamboo-agent/xml-data/build-dir/REFAPP-UI-FRAMEWORK
17-Sep-2021 14:59:42 Updating source code to revision: b272c84fc6683c447eb871c0cc23de60f4e3547b
17-Sep-2021 14:59:42 Enforcing full fetch as requested revision has not been found on the configured branch
17-Sep-2021 14:59:42 Creating local git repository in '/home/bamboo-agent/bamboo-agent/xml-data/build-dir/REFAPP-UI-FRAMEWORK/.git'.
17-Sep-2021 14:59:42 Initialized empty Git repository in /home/bamboo-agent/bamboo-agent/xml-data/build-dir/REFAPP-UI-FRAMEWORK/.git/
17-Sep-2021 14:59:42 Fetching 'refs/heads/*' from 'git://github.com/openmrs/openmrs-distro-referenceapplication.git'.
17-Sep-2021 14:59:44 From git://github.com/openmrs/openmrs-distro-referenceapplication
17-Sep-2021 14:59:44 * [new branch]      2.3.x      -> 2.3.x
17-Sep-2021 14:59:44 * [new branch]      2.6.x      -> 2.6.x
17-Sep-2021 14:59:44 * [new branch]      3.x        -> 3.x
17-Sep-2021 14:59:44 * [new branch]      3.x-npx-no-install -> 3.x-npx-no-install
17-Sep-2021 14:59:44 * [new branch]      master     -> master
17-Sep-2021 14:59:44 * [new branch]      msf        -> msf
17-Sep-2021 14:59:44 * [new branch]      platform-2.1.x -> platform-2.1.x
17-Sep-2021 14:59:44 * [new branch]      release    -> release
17-Sep-2021 14:59:44 * [new branch]      revert-204-OCLM-50 -> revert-204-OCLM-50
17-Sep-2021 14:59:44 * [new branch]      revert-214-RA-1320 -> revert-214-RA-1320
17-Sep-2021 14:59:44 * [new branch]      revert-272-RA-1818 -> revert-272-RA-1818
17-Sep-2021 14:59:44 * [new branch]      revert-273-sherrif10 -> revert-273-sherrif10
17-Sep-2021 14:59:44 * [new branch]      revert-294-fhir -> revert-294-fhir
17-Sep-2021 14:59:44 * [new branch]      revert-334-RATEST-97 -> revert-334-RATEST-97
17-Sep-2021 14:59:44 * [new branch]      revert-344-RATEST-110 -> revert-344-RATEST-110
17-Sep-2021 14:59:44 * [new branch]      revert-345-RATEST-96 -> revert-345-RATEST-96
17-Sep-2021 14:59:44 * [new branch]      revert-385-RATEST-135 -> revert-385-RATEST-135
17-Sep-2021 14:59:44 * [new branch]      revert-399-RATEST-145 -> revert-399-RATEST-145
17-Sep-2021 14:59:44 * [new branch]      revert-410-RATEST-145 -> revert-410-RATEST-145
17-Sep-2021 14:59:44 * [new branch]      revert-423-RATEST-93 -> revert-423-RATEST-93
17-Sep-2021 14:59:44 * [new branch]      revert-429-RATEST-112 -> revert-429-RATEST-112
17-Sep-2021 14:59:44 * [new branch]      revert-442-RATEST-85 -> revert-442-RATEST-85
17-Sep-2021 14:59:44 * [new branch]      revert-448-RATEST-143 -> revert-448-RATEST-143
17-Sep-2021 14:59:44 * [new branch]      revert-449-RATEST-145 -> revert-449-RATEST-145
17-Sep-2021 14:59:44 * [new branch]      revert-454-RATEST-135 -> revert-454-RATEST-135
17-Sep-2021 14:59:44 * [new branch]      revert-479-RATEST-93 -> revert-479-RATEST-93
17-Sep-2021 14:59:44 * [new branch]      revert-523-FormTest -> revert-523-FormTest
17-Sep-2021 14:59:44 * [new branch]      samuelmale-patch-1 -> samuelmale-patch-1
17-Sep-2021 14:59:44 * [new branch]      samuelmale-patch-2 -> samuelmale-patch-2
17-Sep-2021 14:59:44 * [new branch]      samuelmale-patch-3 -> samuelmale-patch-3
17-Sep-2021 14:59:44 * [new branch]      uat        -> uat
17-Sep-2021 14:59:44 * [new tag]         2.0.1769   -> 2.0.1769
17-Sep-2021 14:59:44 * [new tag]         2.1        -> 2.1
17-Sep-2021 14:59:44 * [new tag]         2.10.0     -> 2.10.0
17-Sep-2021 14:59:44 * [new tag]         2.11.0     -> 2.11.0
17-Sep-2021 14:59:44 * [new tag]         2.2        -> 2.2
17-Sep-2021 14:59:44 * [new tag]         2.3        -> 2.3
17-Sep-2021 14:59:44 * [new tag]         2.3.1      -> 2.3.1
17-Sep-2021 14:59:44 * [new tag]         2.4        -> 2.4
17-Sep-2021 14:59:44 * [new tag]         2.5        -> 2.5
17-Sep-2021 14:59:44 * [new tag]         2.6.0      -> 2.6.0
17-Sep-2021 14:59:44 * [new tag]         2.6.1      -> 2.6.1
17-Sep-2021 14:59:44 * [new tag]         2.7.0      -> 2.7.0
17-Sep-2021 14:59:44 * [new tag]         2.8.0      -> 2.8.0
17-Sep-2021 14:59:44 * [new tag]         2.8.1      -> 2.8.1
17-Sep-2021 14:59:44 * [new tag]         2.9.0      -> 2.9.0
17-Sep-2021 14:59:44 * [new tag]         latest     -> latest
17-Sep-2021 14:59:44 Checking out revision b272c84fc6683c447eb871c0cc23de60f4e3547b.
17-Sep-2021 14:59:44 Already on 'master'
17-Sep-2021 14:59:44 Updated source code to revision: b272c84fc6683c447eb871c0cc23de60f4e3547b
17-Sep-2021 14:59:44 Finished task 'Checkout distribution' with result: Success
17-Sep-2021 14:59:44 Skipping execution of task 'deploy docker db and web containers' as it is disabled
17-Sep-2021 14:59:44 Starting task 'ensure refapp instance is app and prepare for testing' of type 'com.atlassian.bamboo.plugins.scripttask:task.builder.script'
17-Sep-2021 14:59:44
Beginning to execute external process for build 'Reference Application - UI - Run QA UI Tests #568 (REFAPP-UI-FRAMEWORK-568)'
... running command line:
/home/bamboo-agent/bamboo-agent/temp/REFAPP-UI-FRAMEWORK-568-ScriptBuildTask-4416625476222302929.sh
... in: /home/bamboo-agent/bamboo-agent/xml-data/build-dir/REFAPP-UI-FRAMEWORK
... using extra environment variables:
bamboo_planRepository_1_branch=master
bamboo_capability_system_builder_grailsBuilder_Grails_2_3_7=/opt/grails
bamboo_planRepository_2_branch=master
bamboo_planRepository_1_branchDisplayName=master
bamboo_repository_revision_number=b272c84fc6683c447eb871c0cc23de60f4e3547b
bamboo_saucelabs_username=rkorytkowski
bamboo_repository_207388681_previous_revision_number=d35912f34c5e984a30d06b20d50ab69117cf29e6
bamboo_buildKey=REFAPP-UI-FRAMEWORK
bamboo_DISPLAY=10
bamboo_maven_release_version=2.8.0
bamboo_planRepository_2_branchDisplayName=master
bamboo_repository_207388681_name=Distribution
bamboo_shortJobName=Run QA UI Tests
bamboo_buildResultsUrl=https://ci.openmrs.org/browse/REFAPP-UI-FRAMEWORK-568
bamboo_planRepository_repositoryUrl=git://github.com/openmrs/openmrs-distro-referenceapplication.git
bamboo_agentId=189792259
bamboo_maven_development_version=
bamboo_capability_system_jdk_JDK_8=/usr/lib/jvm/java-8-openjdk-amd64
bamboo_planRepository_revision=b272c84fc6683c447eb871c0cc23de60f4e3547b
bamboo_planRepository_previousRevision=d35912f34c5e984a30d06b20d50ab69117cf29e6
bamboo_capability_system_jdk_JDK_1_8_0_265=/usr/lib/jvm/java-1.8.0-openjdk-amd64/
bamboo_repository_branch_name=master
bamboo_dockerhub_username=openmrsci
bamboo_refapp_distro_scm=git@github.com:openmrs/openmrs-distro-referenceapplication.git
bamboo_repository_207388681_branch_name=master
bamboo_repository_207388680_branch_name=master
bamboo_repository_207388681_git_username=
bamboo_planRepository_branch=master
bamboo_repository_207388681_revision_number=b272c84fc6683c447eb871c0cc23de60f4e3547b
bamboo_capability_system_jdk_JDK_1_8_0_275=/usr/lib/jvm/java-1.8.0-openjdk-amd64/
bamboo_capability_system_jdk_JDK_1_8_0_272=/usr/lib/jvm/java-1.8.0-openjdk-amd64/
bamboo_capability_system_jdk_JDK_11=/usr/lib/jvm/java-11-openjdk-amd64
bamboo_planRepository_1_type=gitv2
bamboo_planRepository_branchName=master
bamboo_saucelabs_password=********
bamboo_capability_system_jdk_JDK=/usr/lib/jvm/java-1.8.0-openjdk-amd64/
bamboo_mavenBuildGoals=clean install
bamboo_hg_cache_directory=/home/bamboo-agent/bamboo-agent/xml-data/build-dir/_hg-repositories-cache
bamboo_planRepository_1_username=
bamboo_planRepository_type=gitv2
bamboo_git_cache_directory=/home/bamboo-agent/bamboo-agent/xml-data/build-dir/_git-repositories-cache
bamboo_planRepository_2_branchName=master
bamboo_capability_system_builder_node_Node_js=/usr/bin/node
bamboo_build_commandline_com_atlassian_bamboo_plugins_maven_task_builder_mvn3_2=/usr/share/apache-maven-3.3.9/bin/mvn --batch-mode -Djava.io.tmpdir=/home/bamboo-agent/bamboo-agent/.agent_tmp/REFAPP-UI-FRAMEWORK clean install
bamboo_travis_password=********
bamboo_capability_system_builder_mvn3_Maven_3=/usr/share/apache-maven-3.3.9
bamboo_tmp_directory=/home/bamboo-agent/bamboo-agent/temp
bamboo_planKey=REFAPP-UI
bamboo_capability_system_builder_command_nvm=nvm
bamboo_planRepository_username=
bamboo_capability_system_jdk_JDK_1_8_0_282=/usr/lib/jvm/java-1.8.0-openjdk-amd64/
bamboo_planRepository_1_branchName=master
bamboo_dockerhub_password=********
bamboo_resultsUrl=https://ci.openmrs.org/browse/REFAPP-UI-FRAMEWORK-568
bamboo_capability_system_builder_command_transifex=/usr/bin/tx
bamboo_jdbc_password=********
bamboo_build_working_directory=/home/bamboo-agent/bamboo-agent/xml-data/build-dir/REFAPP-UI-FRAMEWORK
bamboo_planRepository_1_name=Distribution
bamboo_capability_system_jdk_JDK_1_8_0_292=/usr/lib/jvm/java-1.8.0-openjdk-amd64/
bamboo_preparing_refapp_distro_release=false
bamboo_shortPlanName=UI
bamboo_planRepository_2_username=
bamboo_planRepository_name=Distribution
bamboo_docs_aws_secret_key=********
bamboo_buildNumber=568
bamboo_repository_207388680_git_username=
bamboo_repository_207388681_git_repositoryUrl=git://github.com/openmrs/openmrs-distro-referenceapplication.git
bamboo_planName=Reference Application - UI
bamboo_shortPlanKey=UI
bamboo_shortJobKey=FRAMEWORK
bamboo_planRepository_2_name=UI Test Framework
bamboo_buildTimeStamp=2021-09-17T14:59:03.497Z
bamboo_repository_previous_revision_number=d35912f34c5e984a30d06b20d50ab69117cf29e6
bamboo_refapp_bamboo_build_number=
bamboo_repository_git_branch=master
bamboo_buildResultKey=REFAPP-UI-FRAMEWORK-568
bamboo_docs_aws_access_key=AKIAI7KMDL5KP2673G7A
bamboo_buildPlanName=Reference Application - UI - Run QA UI Tests
bamboo_openMRSVersion=2.1.3
bamboo_planRepository_1_revision=b272c84fc6683c447eb871c0cc23de60f4e3547b
bamboo_repository_207388680_git_repositoryUrl=git://github.com/openmrs/openmrs-contrib-uitestframework.git
bamboo_repository_name=UI Test Framework
bamboo_capability_system_jdk_openjdk_8_jdk=/usr/lib/jvm/java-8-openjdk-amd64
bamboo_capability_system_builder_mvn3_Maven_3_6_3=/usr/share/apache-maven-3.6.3
bamboo_planRepository_2_previousRevision=8838c8eeee749c044f9846bcb0a31a7065db1260
bamboo_transifex_password=********
bamboo_repository_207388680_name=UI Test Framework
bamboo_capability_system_jdk_openjdk_11_jdk=/usr/lib/jvm/java-11-openjdk-amd64
bamboo_repository_207388680_previous_revision_number=8838c8eeee749c044f9846bcb0a31a7065db1260
bamboo_buildFailed=false
bamboo_capability_system_builder_grailsBuilder_Grails_2=/opt/grails
bamboo_capability_system_docker_executable=/usr/bin/docker
bamboo_capability_system_builder_command_Bash=/bin/bash
bamboo_agentWorkingDirectory=/home/bamboo-agent/bamboo-agent/xml-data/build-dir
bamboo_planRepository_2_revision=8838c8eeee749c044f9846bcb0a31a7065db1260
bamboo_capability_system_git_executable=/usr/bin/git
bamboo_repository_git_username=
bamboo_planRepository_1_previousRevision=d35912f34c5e984a30d06b20d50ab69117cf29e6
bamboo_planRepository_branchDisplayName=master
bamboo_planRepository_2_type=gitv2
bamboo_plan_storageTag=plan-207093778
bamboo_repository_207388680_git_branch=master
bamboo_planRepository_2_repositoryUrl=git://github.com/openmrs/openmrs-contrib-uitestframework.git
bamboo_repository_git_repositoryUrl=git://github.com/openmrs/openmrs-distro-referenceapplication.git
bamboo_transifex_username=api
bamboo_refapp_distro_dev_branch=master
bamboo_working_directory=/home/bamboo-agent/bamboo-agent/xml-data/build-dir/REFAPP-UI-FRAMEWORK
bamboo_planRepository_1_repositoryUrl=git://github.com/openmrs/openmrs-distro-referenceapplication.git
bamboo_capability_system_jdk_JDK_1_8=/usr/lib/jvm/java-1.8.0-openjdk-amd64/
bamboo_repository_207388681_git_branch=master
bamboo_repository_207388680_revision_number=8838c8eeee749c044f9846bcb0a31a7065db1260
17-Sep-2021 14:59:44 Finished task 'ensure refapp instance is app and prepare for testing' with result: Success
17-Sep-2021 14:59:44 Starting task 'Build distribution' of type 'com.atlassian.bamboo.plugins.maven:task.builder.mvn3'
17-Sep-2021 14:59:44
Beginning to execute external process for build 'Reference Application - UI - Run QA UI Tests #568 (REFAPP-UI-FRAMEWORK-568)'
... running command line:
/usr/share/apache-maven-3.3.9/bin/mvn --batch-mode -Djava.io.tmpdir=/home/bamboo-agent/bamboo-agent/.agent_tmp/REFAPP-UI-FRAMEWORK clean install -DskipTests=false -e
... in: /home/bamboo-agent/bamboo-agent/xml-data/build-dir/REFAPP-UI-FRAMEWORK
... using extra environment variables:
bamboo_planRepository_1_branch=master
bamboo_capability_system_builder_grailsBuilder_Grails_2_3_7=/opt/grails
bamboo_planRepository_2_branch=master
bamboo_planRepository_1_branchDisplayName=master
bamboo_repository_revision_number=b272c84fc6683c447eb871c0cc23de60f4e3547b
MAVEN2_HOME=/usr/share/apache-maven-3.3.9
bamboo_saucelabs_username=rkorytkowski
bamboo_repository_207388681_previous_revision_number=d35912f34c5e984a30d06b20d50ab69117cf29e6
bamboo_buildKey=REFAPP-UI-FRAMEWORK
bamboo_DISPLAY=10
bamboo_maven_release_version=2.8.0
bamboo_planRepository_2_branchDisplayName=master
bamboo_repository_207388681_name=Distribution
bamboo_shortJobName=Run QA UI Tests
bamboo_buildResultsUrl=https://ci.openmrs.org/browse/REFAPP-UI-FRAMEWORK-568
bamboo_planRepository_repositoryUrl=git://github.com/openmrs/openmrs-distro-referenceapplication.git
bamboo_agentId=189792259
bamboo_maven_development_version=
bamboo_capability_system_jdk_JDK_8=/usr/lib/jvm/java-8-openjdk-amd64
bamboo_planRepository_revision=b272c84fc6683c447eb871c0cc23de60f4e3547b
bamboo_planRepository_previousRevision=d35912f34c5e984a30d06b20d50ab69117cf29e6
bamboo_capability_system_jdk_JDK_1_8_0_265=/usr/lib/jvm/java-1.8.0-openjdk-amd64/
bamboo_repository_branch_name=master
bamboo_dockerhub_username=openmrsci
bamboo_refapp_distro_scm=git@github.com:openmrs/openmrs-distro-referenceapplication.git
bamboo_repository_207388681_branch_name=master
JAVA_HOME=/usr/lib/jvm/java-1.8.0-openjdk-amd64/
bamboo_repository_207388680_branch_name=master
bamboo_repository_207388681_git_username=
bamboo_planRepository_branch=master
bamboo_repository_207388681_revision_number=b272c84fc6683c447eb871c0cc23de60f4e3547b
bamboo_capability_system_jdk_JDK_1_8_0_275=/usr/lib/jvm/java-1.8.0-openjdk-amd64/
bamboo_capability_system_jdk_JDK_1_8_0_272=/usr/lib/jvm/java-1.8.0-openjdk-amd64/
bamboo_capability_system_jdk_JDK_11=/usr/lib/jvm/java-11-openjdk-amd64
bamboo_planRepository_1_type=gitv2
bamboo_planRepository_branchName=master
bamboo_saucelabs_password=********
bamboo_capability_system_jdk_JDK=/usr/lib/jvm/java-1.8.0-openjdk-amd64/
bamboo_mavenBuildGoals=clean install
bamboo_hg_cache_directory=/home/bamboo-agent/bamboo-agent/xml-data/build-dir/_hg-repositories-cache
bamboo_planRepository_1_username=
bamboo_planRepository_type=gitv2
bamboo_git_cache_directory=/home/bamboo-agent/bamboo-agent/xml-data/build-dir/_git-repositories-cache
bamboo_planRepository_2_branchName=master
useMavenReturnCode=false
bamboo_capability_system_builder_node_Node_js=/usr/bin/node
bamboo_build_commandline_com_atlassian_bamboo_plugins_maven_task_builder_mvn3_2=/usr/share/apache-maven-3.3.9/bin/mvn --batch-mode -Djava.io.tmpdir=/home/bamboo-agent/bamboo-agent/.agent_tmp/REFAPP-UI-FRAMEWORK clean install
bamboo_travis_password=********
bamboo_capability_system_builder_mvn3_Maven_3=/usr/share/apache-maven-3.3.9
bamboo_tmp_directory=/home/bamboo-agent/bamboo-agent/temp
bamboo_planKey=REFAPP-UI
bamboo_capability_system_builder_command_nvm=nvm
bamboo_planRepository_username=
bamboo_capability_system_jdk_JDK_1_8_0_282=/usr/lib/jvm/java-1.8.0-openjdk-amd64/
bamboo_planRepository_1_branchName=master
bamboo_dockerhub_password=********
bamboo_resultsUrl=https://ci.openmrs.org/browse/REFAPP-UI-FRAMEWORK-568
bamboo_capability_system_builder_command_transifex=/usr/bin/tx
bamboo_jdbc_password=********
bamboo_build_working_directory=/home/bamboo-agent/bamboo-agent/xml-data/build-dir/REFAPP-UI-FRAMEWORK
bamboo_planRepository_1_name=Distribution
bamboo_capability_system_jdk_JDK_1_8_0_292=/usr/lib/jvm/java-1.8.0-openjdk-amd64/
bamboo_preparing_refapp_distro_release=false
bamboo_shortPlanName=UI
bamboo_planRepository_2_username=
bamboo_planRepository_name=Distribution
bamboo_docs_aws_secret_key=********
bamboo_buildNumber=568
bamboo_repository_207388680_git_username=
bamboo_repository_207388681_git_repositoryUrl=git://github.com/openmrs/openmrs-distro-referenceapplication.git
bamboo_planName=Reference Application - UI
bamboo_build_commandline_com_atlassian_bamboo_plugins_scripttask_task_builder_script_6=/home/bamboo-agent/bamboo-agent/temp/REFAPP-UI-FRAMEWORK-568-ScriptBuildTask-4416625476222302929.sh
bamboo_shortPlanKey=UI
bamboo_shortJobKey=FRAMEWORK
bamboo_planRepository_2_name=UI Test Framework
bamboo_buildTimeStamp=2021-09-17T14:59:03.497Z
bamboo_repository_previous_revision_number=d35912f34c5e984a30d06b20d50ab69117cf29e6
M2_HOME=/usr/share/apache-maven-3.3.9
bamboo_refapp_bamboo_build_number=
bamboo_repository_git_branch=master
bamboo_buildResultKey=REFAPP-UI-FRAMEWORK-568
bamboo_docs_aws_access_key=AKIAI7KMDL5KP2673G7A
bamboo_buildPlanName=Reference Application - UI - Run QA UI Tests
bamboo_openMRSVersion=2.1.3
bamboo_planRepository_1_revision=b272c84fc6683c447eb871c0cc23de60f4e3547b
bamboo_repository_207388680_git_repositoryUrl=git://github.com/openmrs/openmrs-contrib-uitestframework.git
bamboo_repository_name=UI Test Framework
bamboo_capability_system_jdk_openjdk_8_jdk=/usr/lib/jvm/java-8-openjdk-amd64
bamboo_capability_system_builder_mvn3_Maven_3_6_3=/usr/share/apache-maven-3.6.3
bamboo_planRepository_2_previousRevision=8838c8eeee749c044f9846bcb0a31a7065db1260
bamboo_transifex_password=********
bamboo_repository_207388680_name=UI Test Framework
bamboo_capability_system_jdk_openjdk_11_jdk=/usr/lib/jvm/java-11-openjdk-amd64
bamboo_repository_207388680_previous_revision_number=8838c8eeee749c044f9846bcb0a31a7065db1260
bamboo_buildFailed=false
bamboo_capability_system_builder_grailsBuilder_Grails_2=/opt/grails
bamboo_capability_system_docker_executable=/usr/bin/docker
bamboo_capability_system_builder_command_Bash=/bin/bash
bamboo_agentWorkingDirectory=/home/bamboo-agent/bamboo-agent/xml-data/build-dir
bamboo_planRepository_2_revision=8838c8eeee749c044f9846bcb0a31a7065db1260
bamboo_capability_system_git_executable=/usr/bin/git
bamboo_repository_git_username=
bamboo_planRepository_1_previousRevision=d35912f34c5e984a30d06b20d50ab69117cf29e6
bamboo_planRepository_branchDisplayName=master
bamboo_planRepository_2_type=gitv2
bamboo_plan_storageTag=plan-207093778
bamboo_repository_207388680_git_branch=master
bamboo_planRepository_2_repositoryUrl=git://github.com/openmrs/openmrs-contrib-uitestframework.git
bamboo_repository_git_repositoryUrl=git://github.com/openmrs/openmrs-distro-referenceapplication.git
bamboo_transifex_username=api
bamboo_refapp_distro_dev_branch=master
bamboo_working_directory=/home/bamboo-agent/bamboo-agent/xml-data/build-dir/REFAPP-UI-FRAMEWORK
bamboo_planRepository_1_repositoryUrl=git://github.com/openmrs/openmrs-distro-referenceapplication.git
bamboo_capability_system_jdk_JDK_1_8=/usr/lib/jvm/java-1.8.0-openjdk-amd64/
bamboo_repository_207388681_git_branch=master
bamboo_repository_207388680_revision_number=8838c8eeee749c044f9846bcb0a31a7065db1260
PATH=/usr/lib/jvm/java-1.8.0-openjdk-amd64//bin:/home/bamboo-agent/.nvm/versions/node/v10.22.1/bin:/home/bamboo-agent/bin:/home/bamboo-agent/.local/bin:/usr/local/sbin:/usr/local/bin:/usr/sbin:/usr/bin:/sbin:/bin:/usr/games:/usr/local/games:/snap/bin:/opt/puppetlabs/bin
17-Sep-2021 14:59:46 [INFO] Error stacktraces are turned on.
17-Sep-2021 14:59:46 [INFO] Scanning for projects...
17-Sep-2021 14:59:46 [WARNING]
17-Sep-2021 14:59:46 [WARNING] Some problems were encountered while building the effective model for org.openmrs.distro:referenceapplication-ui-tests:jar:2.12.0-SNAPSHOT
17-Sep-2021 14:59:46 [WARNING] 'version' contains an expression but should be a constant. @ org.openmrs.distro:referenceapplication-ui-tests:${parent.version}, /home/bamboo-agent/bamboo-agent/xml-data/build-dir/REFAPP-UI-FRAMEWORK/ui-tests/pom.xml, line 6, column 14
17-Sep-2021 14:59:46 [WARNING] 'build.plugins.plugin.version' for org.apache.maven.plugins:maven-deploy-plugin is missing. @ org.openmrs.distro:referenceapplication-ui-tests:${parent.version}, /home/bamboo-agent/bamboo-agent/xml-data/build-dir/REFAPP-UI-FRAMEWORK/ui-tests/pom.xml, line 88, column 21
17-Sep-2021 14:59:46 [WARNING] The expression ${parent.version} is deprecated. Please use ${project.parent.version} instead. @ org.openmrs.distro:referenceapplication-ui-tests:${parent.version}, /home/bamboo-agent/bamboo-agent/xml-data/build-dir/REFAPP-UI-FRAMEWORK/ui-tests/pom.xml
17-Sep-2021 14:59:46 [WARNING]
17-Sep-2021 14:59:46 [WARNING] It is highly recommended to fix these problems because they threaten the stability of your build.
17-Sep-2021 14:59:46 [WARNING]
17-Sep-2021 14:59:46 [WARNING] For this reason, future Maven versions might no longer support building such malformed projects.
17-Sep-2021 14:59:46 [WARNING]
17-Sep-2021 14:59:46 [INFO] ------------------------------------------------------------------------
17-Sep-2021 14:59:46 [INFO] Reactor Build Order:
17-Sep-2021 14:59:46 [INFO]
17-Sep-2021 14:59:46 [INFO] Reference Application Distribution
17-Sep-2021 14:59:46 [INFO] Reference Application Distribution Package
17-Sep-2021 14:59:46 [INFO] Reference Application Distribution UI Tests
17-Sep-2021 14:59:46 [INFO]                                                                         
17-Sep-2021 14:59:46 [INFO] ------------------------------------------------------------------------
17-Sep-2021 14:59:46 [INFO] Building Reference Application Distribution 2.12.0-SNAPSHOT
17-Sep-2021 14:59:46 [INFO] ------------------------------------------------------------------------
17-Sep-2021 14:59:46 [INFO]
17-Sep-2021 14:59:46 [INFO] --- maven-clean-plugin:2.5:clean (default-clean) @ referenceapplication ---
17-Sep-2021 14:59:46 [INFO]
17-Sep-2021 14:59:46 [INFO] --- maven-install-plugin:2.4:install (default-install) @ referenceapplication ---
17-Sep-2021 14:59:46 [INFO] Installing /home/bamboo-agent/bamboo-agent/xml-data/build-dir/REFAPP-UI-FRAMEWORK/pom.xml to /home/bamboo-agent/.m2/repository/org/openmrs/distro/referenceapplication/2.12.0-SNAPSHOT/referenceapplication-2.12.0-SNAPSHOT.pom
17-Sep-2021 14:59:46 [INFO]                                                                         
17-Sep-2021 14:59:46 [INFO] ------------------------------------------------------------------------
17-Sep-2021 14:59:46 [INFO] Building Reference Application Distribution Package 2.12.0-SNAPSHOT
17-Sep-2021 14:59:46 [INFO] ------------------------------------------------------------------------
17-Sep-2021 14:59:49 [INFO]
17-Sep-2021 14:59:49 [INFO] --- maven-clean-plugin:2.5:clean (default-clean) @ referenceapplication-package ---
17-Sep-2021 14:59:49 [INFO]
17-Sep-2021 14:59:49 [INFO] --- maven-resources-plugin:2.6:resources (default-resources) @ referenceapplication-package ---
17-Sep-2021 14:59:49 [INFO] Using 'UTF-8' encoding to copy filtered resources.
17-Sep-2021 14:59:49 [INFO] Copying 1 resource
17-Sep-2021 14:59:49 [INFO] Copying 2 resources
17-Sep-2021 14:59:49 [INFO] skip non existing resourceDirectory /home/bamboo-agent/bamboo-agent/xml-data/build-dir/REFAPP-UI-FRAMEWORK/package/src/main/webapp
17-Sep-2021 14:59:49 [INFO]
17-Sep-2021 14:59:49 [INFO] --- openmrs-sdk-maven-plugin:4.0.0:build-distro (build-distro) @ referenceapplication-package ---
17-Sep-2021 14:59:52
17-Sep-2021 14:59:52 Downloading modules...
17-Sep-2021 14:59:52
17-Sep-2021 14:59:54 [INFO] Configured Artifact: org.openmrs.web:openmrs-webapp:2.4.0:war
17-Sep-2021 14:59:54 [INFO] Copying openmrs-webapp-2.4.0.war to /home/bamboo-agent/bamboo-agent/xml-data/build-dir/REFAPP-UI-FRAMEWORK/package/target/distro/web/openmrs-2.4.0.war
17-Sep-2021 14:59:54 file:/home/bamboo-agent/bamboo-agent/xml-data/build-dir/REFAPP-UI-FRAMEWORK/package/target/distro/web/openmrs-2.4.0.war
17-Sep-2021 14:59:54 target:/home/bamboo-agent/bamboo-agent/xml-data/build-dir/REFAPP-UI-FRAMEWORK/package/target/distro/web
17-Sep-2021 14:59:54 [INFO] Configured Artifact: org.openmrs.module:addresshierarchy-omod:2.14.2:jar
17-Sep-2021 14:59:54 [INFO] Configured Artifact: org.openmrs.module:legacyui-omod:1.8.3:jar
17-Sep-2021 14:59:54 [INFO] Configured Artifact: org.openmrs.module:openconceptlab-omod:1.2.6:jar
17-Sep-2021 14:59:54 [INFO] Configured Artifact: org.openmrs.module:metadatadeploy-omod:1.13.0:jar
17-Sep-2021 14:59:54 [INFO] Configured Artifact: org.openmrs.module:reportingrest-omod:1.12.0:jar
17-Sep-2021 14:59:54 [INFO] Configured Artifact: org.openmrs.module:owa-omod:1.13.0:jar
17-Sep-2021 14:59:54 [INFO] Configured Artifact: org.openmrs.module:fhir2-omod:1.2.2:jar
17-Sep-2021 14:59:54 [INFO] Configured Artifact: org.openmrs.module:serialization.xstream-omod:0.2.15:omod
17-Sep-2021 14:59:54 [INFO] Configured Artifact: org.openmrs.module:registrationapp-omod:1.24.0:jar
17-Sep-2021 14:59:54 [INFO] Configured Artifact: org.openmrs:event-omod:2.10.0-SNAPSHOT:jar
17-Sep-2021 14:59:55 [INFO] Downloading: http://mavenrepo.openmrs.org/nexus/content/repositories/public/org/openmrs/event-omod/2.10.0-SNAPSHOT/maven-metadata.xml
17-Sep-2021 14:59:57 [INFO] Downloaded: http://mavenrepo.openmrs.org/nexus/content/repositories/public/org/openmrs/event-omod/2.10.0-SNAPSHOT/maven-metadata.xml (987 B at 0.4 KB/sec)
17-Sep-2021 14:59:57 [INFO] Downloading: http://mavenrepo.openmrs.org/nexus/content/repositories/public/org/openmrs/event-omod/2.10.0-SNAPSHOT/event-omod-2.10.0-20210702.124301-3.jar
17-Sep-2021 14:59:59 [INFO] Downloaded: http://mavenrepo.openmrs.org/nexus/content/repositories/public/org/openmrs/event-omod/2.10.0-SNAPSHOT/event-omod-2.10.0-20210702.124301-3.jar (4666 KB at 2441.5 KB/sec)
17-Sep-2021 14:59:59 [INFO] Configured Artifact: org.openmrs.module:uilibrary-omod:2.0.7:jar
17-Sep-2021 14:59:59 [INFO] Configured Artifact: org.openmrs.module:htmlwidgets-omod:1.10.0:jar
17-Sep-2021 14:59:59 [INFO] Configured Artifact: org.openmrs.module:dataexchange-omod:1.3.7:jar
17-Sep-2021 14:59:59 [INFO] Configured Artifact: org.openmrs.module:appui-omod:1.14.0:jar
17-Sep-2021 14:59:59 [INFO] Configured Artifact: org.openmrs.module:allergyui-omod:1.8.4:jar
17-Sep-2021 14:59:59 [INFO] Configured Artifact: org.openmrs.module:providermanagement-omod:2.13.0:jar
17-Sep-2021 14:59:59 [INFO] Configured Artifact: org.openmrs.module:appointmentschedulingui-omod:1.12.0:jar
17-Sep-2021 14:59:59 [INFO] Configured Artifact: org.openmrs.module:attachments-omod:2.5.0:jar
17-Sep-2021 14:59:59 [INFO] Configured Artifact: org.openmrs.module:formentryapp-omod:1.4.2:jar
17-Sep-2021 14:59:59 [INFO] Configured Artifact: org.openmrs.module:idgen-omod:4.7.0:jar
17-Sep-2021 14:59:59 [INFO] Configured Artifact: org.openmrs.module:metadatamapping-omod:1.4.0:jar
17-Sep-2021 14:59:59 [INFO] Configured Artifact: org.openmrs.module:htmlformentryui-omod:2.0.0:jar
17-Sep-2021 14:59:59 [INFO] Configured Artifact: org.openmrs.module:referencedemodata-omod:1.4.7:jar
17-Sep-2021 14:59:59 [INFO] Configured Artifact: org.openmrs.module:emrapi-omod:1.32.0:jar
17-Sep-2021 14:59:59 [INFO] Configured Artifact: org.openmrs.module:referenceapplication-omod:2.12.0-SNAPSHOT:jar
17-Sep-2021 14:59:59 [INFO] Downloading: http://mavenrepo.openmrs.org/nexus/content/repositories/public/org/openmrs/module/referenceapplication-omod/2.12.0-SNAPSHOT/maven-metadata.xml
17-Sep-2021 15:00:01 [INFO] Downloaded: http://mavenrepo.openmrs.org/nexus/content/repositories/public/org/openmrs/module/referenceapplication-omod/2.12.0-SNAPSHOT/maven-metadata.xml (802 B at 0.5 KB/sec)
17-Sep-2021 15:00:01 [INFO] Downloading: http://mavenrepo.openmrs.org/nexus/content/repositories/public/org/openmrs/module/referenceapplication-omod/2.12.0-SNAPSHOT/referenceapplication-omod-2.12.0-20210916.160538-271.jar
17-Sep-2021 15:00:02 [INFO] Downloaded: http://mavenrepo.openmrs.org/nexus/content/repositories/public/org/openmrs/module/referenceapplication-omod/2.12.0-SNAPSHOT/referenceapplication-omod-2.12.0-20210916.160538-271.jar (1902 KB at 1994.9 KB/sec)
17-Sep-2021 15:00:02 [INFO] Configured Artifact: org.openmrs.module:htmlformentry-omod:4.1.0:jar
17-Sep-2021 15:00:02 [INFO] Configured Artifact: org.openmrs.module:appframework-omod:2.16.0:jar
17-Sep-2021 15:00:02 [INFO] Configured Artifact: org.openmrs.module:referencemetadata-omod:2.12.0:jar
17-Sep-2021 15:00:02 [INFO] Configured Artifact: org.openmrs.module:reportingui-omod:1.8.0:jar
17-Sep-2021 15:00:02 [INFO] Configured Artifact: org.openmrs.module:coreapps-omod:1.34.0-SNAPSHOT:jar
17-Sep-2021 15:00:02 [INFO] Downloading: http://mavenrepo.openmrs.org/nexus/content/repositories/public/org/openmrs/module/coreapps-omod/1.34.0-SNAPSHOT/maven-metadata.xml
17-Sep-2021 15:00:02 [INFO] Downloaded: http://mavenrepo.openmrs.org/nexus/content/repositories/public/org/openmrs/module/coreapps-omod/1.34.0-SNAPSHOT/maven-metadata.xml (787 B at 1.2 KB/sec)
17-Sep-2021 15:00:02 [INFO] Downloading: http://mavenrepo.openmrs.org/nexus/content/repositories/public/org/openmrs/module/coreapps-omod/1.34.0-SNAPSHOT/coreapps-omod-1.34.0-20210916.134244-36.jar
17-Sep-2021 15:00:03 [INFO] Downloaded: http://mavenrepo.openmrs.org/nexus/content/repositories/public/org/openmrs/module/coreapps-omod/1.34.0-SNAPSHOT/coreapps-omod-1.34.0-20210916.134244-36.jar (3859 KB at 4643.3 KB/sec)
17-Sep-2021 15:00:03 [INFO] Configured Artifact: org.openmrs.module:reportingcompatibility-omod:2.0.8:jar
17-Sep-2021 15:00:03 [INFO] Configured Artifact: org.openmrs.module:reporting-omod:1.23.0:jar
17-Sep-2021 15:00:03 [INFO] Configured Artifact: org.openmrs.module:adminui-omod:1.5.0:jar
17-Sep-2021 15:00:03 [INFO] Configured Artifact: org.openmrs.module:registrationcore-omod:1.11.0:jar
17-Sep-2021 15:00:03 [INFO] Configured Artifact: org.openmrs.module:appointmentscheduling-omod:1.16.0:jar
17-Sep-2021 15:00:03 [INFO] Configured Artifact: org.openmrs.module:atlas-omod:2.2.5:omod
17-Sep-2021 15:00:03 [INFO] Configured Artifact: org.openmrs.module:calculation-omod:1.3.0:jar
17-Sep-2021 15:00:03 [INFO] Configured Artifact: org.openmrs.module:webservices.rest-omod:2.32.0-SNAPSHOT:jar
17-Sep-2021 15:00:03 [INFO] Downloading: http://mavenrepo.openmrs.org/nexus/content/repositories/public/org/openmrs/module/webservices.rest-omod/2.32.0-SNAPSHOT/maven-metadata.xml
17-Sep-2021 15:00:04 [INFO] Downloaded: http://mavenrepo.openmrs.org/nexus/content/repositories/public/org/openmrs/module/webservices.rest-omod/2.32.0-SNAPSHOT/maven-metadata.xml (1009 B at 1.5 KB/sec)
17-Sep-2021 15:00:04 [INFO] Downloading: http://mavenrepo.openmrs.org/nexus/content/repositories/public/org/openmrs/module/webservices.rest-omod/2.32.0-SNAPSHOT/webservices.rest-omod-2.32.0-20210916.132343-69.jar
17-Sep-2021 15:00:05 [INFO] Downloaded: http://mavenrepo.openmrs.org/nexus/content/repositories/public/org/openmrs/module/webservices.rest-omod/2.32.0-SNAPSHOT/webservices.rest-omod-2.32.0-20210916.132343-69.jar (6750 KB at 5514.7 KB/sec)
17-Sep-2021 15:00:05 [INFO] Configured Artifact: org.openmrs.module:spa-omod:1.0.8:jar
17-Sep-2021 15:00:05 [INFO] Configured Artifact: org.openmrs.module:uicommons-omod:2.18.0:jar
17-Sep-2021 15:00:05 [INFO] Configured Artifact: org.openmrs.module:uiframework-omod:3.21.0:jar
17-Sep-2021 15:00:05 [INFO] Configured Artifact: org.openmrs.module:metadatasharing-omod:1.8.0:jar
17-Sep-2021 15:00:05 [INFO] Copying addresshierarchy-omod-2.14.2.jar to /home/bamboo-agent/bamboo-agent/xml-data/build-dir/REFAPP-UI-FRAMEWORK/package/target/distro/web/modules/addresshierarchy-2.14.2.omod
17-Sep-2021 15:00:05 [INFO] Copying legacyui-omod-1.8.3.jar to /home/bamboo-agent/bamboo-agent/xml-data/build-dir/REFAPP-UI-FRAMEWORK/package/target/distro/web/modules/legacyui-1.8.3.omod
17-Sep-2021 15:00:05 [INFO] Copying openconceptlab-omod-1.2.6.jar to /home/bamboo-agent/bamboo-agent/xml-data/build-dir/REFAPP-UI-FRAMEWORK/package/target/distro/web/modules/openconceptlab-1.2.6.omod
17-Sep-2021 15:00:05 [INFO] Copying metadatadeploy-omod-1.13.0.jar to /home/bamboo-agent/bamboo-agent/xml-data/build-dir/REFAPP-UI-FRAMEWORK/package/target/distro/web/modules/metadatadeploy-1.13.0.omod
17-Sep-2021 15:00:05 [INFO] Copying reportingrest-omod-1.12.0.jar to /home/bamboo-agent/bamboo-agent/xml-data/build-dir/REFAPP-UI-FRAMEWORK/package/target/distro/web/modules/reportingrest-1.12.0.omod
17-Sep-2021 15:00:05 [INFO] Copying owa-omod-1.13.0.jar to /home/bamboo-agent/bamboo-agent/xml-data/build-dir/REFAPP-UI-FRAMEWORK/package/target/distro/web/modules/owa-1.13.0.omod
17-Sep-2021 15:00:05 [INFO] Copying fhir2-omod-1.2.2.jar to /home/bamboo-agent/bamboo-agent/xml-data/build-dir/REFAPP-UI-FRAMEWORK/package/target/distro/web/modules/fhir2-1.2.2.omod
17-Sep-2021 15:00:05 [INFO] Copying serialization.xstream-omod-0.2.15.omod to /home/bamboo-agent/bamboo-agent/xml-data/build-dir/REFAPP-UI-FRAMEWORK/package/target/distro/web/modules/serialization.xstream-0.2.15.omod
17-Sep-2021 15:00:05 [INFO] Copying registrationapp-omod-1.24.0.jar to /home/bamboo-agent/bamboo-agent/xml-data/build-dir/REFAPP-UI-FRAMEWORK/package/target/distro/web/modules/registrationapp-1.24.0.omod
17-Sep-2021 15:00:05 [INFO] Copying event-omod-2.10.0-SNAPSHOT.jar to /home/bamboo-agent/bamboo-agent/xml-data/build-dir/REFAPP-UI-FRAMEWORK/package/target/distro/web/modules/event-2.10.0-SNAPSHOT.omod
17-Sep-2021 15:00:05 [INFO] Copying uilibrary-omod-2.0.7.jar to /home/bamboo-agent/bamboo-agent/xml-data/build-dir/REFAPP-UI-FRAMEWORK/package/target/distro/web/modules/uilibrary-2.0.7.omod
17-Sep-2021 15:00:05 [INFO] Copying htmlwidgets-omod-1.10.0.jar to /home/bamboo-agent/bamboo-agent/xml-data/build-dir/REFAPP-UI-FRAMEWORK/package/target/distro/web/modules/htmlwidgets-1.10.0.omod
17-Sep-2021 15:00:05 [INFO] Copying dataexchange-omod-1.3.7.jar to /home/bamboo-agent/bamboo-agent/xml-data/build-dir/REFAPP-UI-FRAMEWORK/package/target/distro/web/modules/dataexchange-1.3.7.omod
17-Sep-2021 15:00:05 [INFO] Copying appui-omod-1.14.0.jar to /home/bamboo-agent/bamboo-agent/xml-data/build-dir/REFAPP-UI-FRAMEWORK/package/target/distro/web/modules/appui-1.14.0.omod
17-Sep-2021 15:00:05 [INFO] Copying allergyui-omod-1.8.4.jar to /home/bamboo-agent/bamboo-agent/xml-data/build-dir/REFAPP-UI-FRAMEWORK/package/target/distro/web/modules/allergyui-1.8.4.omod
17-Sep-2021 15:00:05 [INFO] Copying providermanagement-omod-2.13.0.jar to /home/bamboo-agent/bamboo-agent/xml-data/build-dir/REFAPP-UI-FRAMEWORK/package/target/distro/web/modules/providermanagement-2.13.0.omod
17-Sep-2021 15:00:05 [INFO] Copying appointmentschedulingui-omod-1.12.0.jar to /home/bamboo-agent/bamboo-agent/xml-data/build-dir/REFAPP-UI-FRAMEWORK/package/target/distro/web/modules/appointmentschedulingui-1.12.0.omod
17-Sep-2021 15:00:05 [INFO] Copying attachments-omod-2.5.0.jar to /home/bamboo-agent/bamboo-agent/xml-data/build-dir/REFAPP-UI-FRAMEWORK/package/target/distro/web/modules/attachments-2.5.0.omod
17-Sep-2021 15:00:05 [INFO] Copying formentryapp-omod-1.4.2.jar to /home/bamboo-agent/bamboo-agent/xml-data/build-dir/REFAPP-UI-FRAMEWORK/package/target/distro/web/modules/formentryapp-1.4.2.omod
17-Sep-2021 15:00:05 [INFO] Copying idgen-omod-4.7.0.jar to /home/bamboo-agent/bamboo-agent/xml-data/build-dir/REFAPP-UI-FRAMEWORK/package/target/distro/web/modules/idgen-4.7.0.omod
17-Sep-2021 15:00:05 [INFO] Copying metadatamapping-omod-1.4.0.jar to /home/bamboo-agent/bamboo-agent/xml-data/build-dir/REFAPP-UI-FRAMEWORK/package/target/distro/web/modules/metadatamapping-1.4.0.omod
17-Sep-2021 15:00:05 [INFO] Copying htmlformentryui-omod-2.0.0.jar to /home/bamboo-agent/bamboo-agent/xml-data/build-dir/REFAPP-UI-FRAMEWORK/package/target/distro/web/modules/htmlformentryui-2.0.0.omod
17-Sep-2021 15:00:05 [INFO] Copying referencedemodata-omod-1.4.7.jar to /home/bamboo-agent/bamboo-agent/xml-data/build-dir/REFAPP-UI-FRAMEWORK/package/target/distro/web/modules/referencedemodata-1.4.7.omod
17-Sep-2021 15:00:05 [INFO] Copying emrapi-omod-1.32.0.jar to /home/bamboo-agent/bamboo-agent/xml-data/build-dir/REFAPP-UI-FRAMEWORK/package/target/distro/web/modules/emrapi-1.32.0.omod
17-Sep-2021 15:00:05 [INFO] Copying referenceapplication-omod-2.12.0-SNAPSHOT.jar to /home/bamboo-agent/bamboo-agent/xml-data/build-dir/REFAPP-UI-FRAMEWORK/package/target/distro/web/modules/referenceapplication-2.12.0-SNAPSHOT.omod
17-Sep-2021 15:00:05 [INFO] Copying htmlformentry-omod-4.1.0.jar to /home/bamboo-agent/bamboo-agent/xml-data/build-dir/REFAPP-UI-FRAMEWORK/package/target/distro/web/modules/htmlformentry-4.1.0.omod
17-Sep-2021 15:00:05 [INFO] Copying appframework-omod-2.16.0.jar to /home/bamboo-agent/bamboo-agent/xml-data/build-dir/REFAPP-UI-FRAMEWORK/package/target/distro/web/modules/appframework-2.16.0.omod
17-Sep-2021 15:00:05 [INFO] Copying referencemetadata-omod-2.12.0.jar to /home/bamboo-agent/bamboo-agent/xml-data/build-dir/REFAPP-UI-FRAMEWORK/package/target/distro/web/modules/referencemetadata-2.12.0.omod
17-Sep-2021 15:00:05 [INFO] Copying reportingui-omod-1.8.0.jar to /home/bamboo-agent/bamboo-agent/xml-data/build-dir/REFAPP-UI-FRAMEWORK/package/target/distro/web/modules/reportingui-1.8.0.omod
17-Sep-2021 15:00:05 [INFO] Copying coreapps-omod-1.34.0-SNAPSHOT.jar to /home/bamboo-agent/bamboo-agent/xml-data/build-dir/REFAPP-UI-FRAMEWORK/package/target/distro/web/modules/coreapps-1.34.0-SNAPSHOT.omod
17-Sep-2021 15:00:05 [INFO] Copying reportingcompatibility-omod-2.0.8.jar to /home/bamboo-agent/bamboo-agent/xml-data/build-dir/REFAPP-UI-FRAMEWORK/package/target/distro/web/modules/reportingcompatibility-2.0.8.omod
17-Sep-2021 15:00:05 [INFO] Copying reporting-omod-1.23.0.jar to /home/bamboo-agent/bamboo-agent/xml-data/build-dir/REFAPP-UI-FRAMEWORK/package/target/distro/web/modules/reporting-1.23.0.omod
17-Sep-2021 15:00:05 [INFO] Copying adminui-omod-1.5.0.jar to /home/bamboo-agent/bamboo-agent/xml-data/build-dir/REFAPP-UI-FRAMEWORK/package/target/distro/web/modules/adminui-1.5.0.omod
17-Sep-2021 15:00:05 [INFO] Copying registrationcore-omod-1.11.0.jar to /home/bamboo-agent/bamboo-agent/xml-data/build-dir/REFAPP-UI-FRAMEWORK/package/target/distro/web/modules/registrationcore-1.11.0.omod
17-Sep-2021 15:00:05 [INFO] Copying appointmentscheduling-omod-1.16.0.jar to /home/bamboo-agent/bamboo-agent/xml-data/build-dir/REFAPP-UI-FRAMEWORK/package/target/distro/web/modules/appointmentscheduling-1.16.0.omod
17-Sep-2021 15:00:05 [INFO] Copying atlas-omod-2.2.5.omod to /home/bamboo-agent/bamboo-agent/xml-data/build-dir/REFAPP-UI-FRAMEWORK/package/target/distro/web/modules/atlas-2.2.5.omod
17-Sep-2021 15:00:05 [INFO] Copying calculation-omod-1.3.0.jar to /home/bamboo-agent/bamboo-agent/xml-data/build-dir/REFAPP-UI-FRAMEWORK/package/target/distro/web/modules/calculation-1.3.0.omod
17-Sep-2021 15:00:05 [INFO] Copying webservices.rest-omod-2.32.0-SNAPSHOT.jar to /home/bamboo-agent/bamboo-agent/xml-data/build-dir/REFAPP-UI-FRAMEWORK/package/target/distro/web/modules/webservices.rest-2.32.0-SNAPSHOT.omod
17-Sep-2021 15:00:05 [INFO] Copying spa-omod-1.0.8.jar to /home/bamboo-agent/bamboo-agent/xml-data/build-dir/REFAPP-UI-FRAMEWORK/package/target/distro/web/modules/spa-1.0.8.omod
17-Sep-2021 15:00:05 [INFO] Copying uicommons-omod-2.18.0.jar to /home/bamboo-agent/bamboo-agent/xml-data/build-dir/REFAPP-UI-FRAMEWORK/package/target/distro/web/modules/uicommons-2.18.0.omod
17-Sep-2021 15:00:05 [INFO] Copying uiframework-omod-3.21.0.jar to /home/bamboo-agent/bamboo-agent/xml-data/build-dir/REFAPP-UI-FRAMEWORK/package/target/distro/web/modules/uiframework-3.21.0.omod
17-Sep-2021 15:00:05 [INFO] Copying metadatasharing-omod-1.8.0.jar to /home/bamboo-agent/bamboo-agent/xml-data/build-dir/REFAPP-UI-FRAMEWORK/package/target/distro/web/modules/metadatasharing-1.8.0.omod
17-Sep-2021 15:00:05
17-Sep-2021 15:00:05 Downloading OWAs...
17-Sep-2021 15:00:05
17-Sep-2021 15:00:05
17-Sep-2021 15:00:05 Downloading OWA: org.openmrs.owa:openmrs-owa-sysadmin:1.2
17-Sep-2021 15:00:05 [INFO] Configured Artifact: org.openmrs.owa:sysadmin:1.2:zip
17-Sep-2021 15:00:05 [INFO] Copying sysadmin-1.2.zip to /home/bamboo-agent/bamboo-agent/xml-data/build-dir/REFAPP-UI-FRAMEWORK/package/target/distro/web/owa/sysadmin-1.2.zip
17-Sep-2021 15:00:06
17-Sep-2021 15:00:06 Creating Docker Compose configuration...
17-Sep-2021 15:00:06
17-Sep-2021 15:00:07
17-Sep-2021 15:00:07 The 'referenceapplication' distribution created! To start up the server run 'docker-compose up' from /home/bamboo-agent/bamboo-agent/xml-data/build-dir/REFAPP-UI-FRAMEWORK/package/target/distro
17-Sep-2021 15:00:07
17-Sep-2021 15:00:07 [INFO]
17-Sep-2021 15:00:07 [INFO] --- openmrs-sdk-maven-plugin:4.0.0:build-distro (build-bundled-distro) @ referenceapplication-package ---
17-Sep-2021 15:00:07
17-Sep-2021 15:00:07 Downloading modules...
17-Sep-2021 15:00:07
17-Sep-2021 15:00:07 [INFO] Configured Artifact: org.openmrs.web:openmrs-webapp:2.4.0:war
17-Sep-2021 15:00:07 [INFO] Copying openmrs-webapp-2.4.0.war to /home/bamboo-agent/bamboo-agent/xml-data/build-dir/REFAPP-UI-FRAMEWORK/package/target/bundled-distro/web/openmrs-2.4.0.war
17-Sep-2021 15:00:07 file:/home/bamboo-agent/bamboo-agent/xml-data/build-dir/REFAPP-UI-FRAMEWORK/package/target/bundled-distro/web/openmrs-2.4.0.war
17-Sep-2021 15:00:07 target:/home/bamboo-agent/bamboo-agent/xml-data/build-dir/REFAPP-UI-FRAMEWORK/package/target/bundled-distro/web
17-Sep-2021 15:00:07 [INFO] Configured Artifact: org.openmrs.module:addresshierarchy-omod:2.14.2:jar
17-Sep-2021 15:00:07 [INFO] Configured Artifact: org.openmrs.module:legacyui-omod:1.8.3:jar
17-Sep-2021 15:00:07 [INFO] Configured Artifact: org.openmrs.module:openconceptlab-omod:1.2.6:jar
17-Sep-2021 15:00:07 [INFO] Configured Artifact: org.openmrs.module:metadatadeploy-omod:1.13.0:jar
17-Sep-2021 15:00:07 [INFO] Configured Artifact: org.openmrs.module:reportingrest-omod:1.12.0:jar
17-Sep-2021 15:00:07 [INFO] Configured Artifact: org.openmrs.module:owa-omod:1.13.0:jar
17-Sep-2021 15:00:07 [INFO] Configured Artifact: org.openmrs.module:fhir2-omod:1.2.2:jar
17-Sep-2021 15:00:07 [INFO] Configured Artifact: org.openmrs.module:serialization.xstream-omod:0.2.15:omod
17-Sep-2021 15:00:07 [INFO] Configured Artifact: org.openmrs.module:registrationapp-omod:1.24.0:jar
17-Sep-2021 15:00:07 [INFO] Configured Artifact: org.openmrs:event-omod:2.10.0-SNAPSHOT:jar
17-Sep-2021 15:00:07 [INFO] Configured Artifact: org.openmrs.module:uilibrary-omod:2.0.7:jar
17-Sep-2021 15:00:07 [INFO] Configured Artifact: org.openmrs.module:htmlwidgets-omod:1.10.0:jar
17-Sep-2021 15:00:07 [INFO] Configured Artifact: org.openmrs.module:dataexchange-omod:1.3.7:jar
17-Sep-2021 15:00:07 [INFO] Configured Artifact: org.openmrs.module:appui-omod:1.14.0:jar
17-Sep-2021 15:00:07 [INFO] Configured Artifact: org.openmrs.module:allergyui-omod:1.8.4:jar
17-Sep-2021 15:00:07 [INFO] Configured Artifact: org.openmrs.module:providermanagement-omod:2.13.0:jar
17-Sep-2021 15:00:07 [INFO] Configured Artifact: org.openmrs.module:appointmentschedulingui-omod:1.12.0:jar
17-Sep-2021 15:00:07 [INFO] Configured Artifact: org.openmrs.module:attachments-omod:2.5.0:jar
17-Sep-2021 15:00:07 [INFO] Configured Artifact: org.openmrs.module:formentryapp-omod:1.4.2:jar
17-Sep-2021 15:00:07 [INFO] Configured Artifact: org.openmrs.module:idgen-omod:4.7.0:jar
17-Sep-2021 15:00:07 [INFO] Configured Artifact: org.openmrs.module:metadatamapping-omod:1.4.0:jar
17-Sep-2021 15:00:07 [INFO] Configured Artifact: org.openmrs.module:htmlformentryui-omod:2.0.0:jar
17-Sep-2021 15:00:07 [INFO] Configured Artifact: org.openmrs.module:referencedemodata-omod:1.4.7:jar
17-Sep-2021 15:00:07 [INFO] Configured Artifact: org.openmrs.module:emrapi-omod:1.32.0:jar
17-Sep-2021 15:00:07 [INFO] Configured Artifact: org.openmrs.module:referenceapplication-omod:2.12.0-SNAPSHOT:jar
17-Sep-2021 15:00:07 [INFO] Configured Artifact: org.openmrs.module:htmlformentry-omod:4.1.0:jar
17-Sep-2021 15:00:07 [INFO] Configured Artifact: org.openmrs.module:appframework-omod:2.16.0:jar
17-Sep-2021 15:00:07 [INFO] Configured Artifact: org.openmrs.module:referencemetadata-omod:2.12.0:jar
17-Sep-2021 15:00:07 [INFO] Configured Artifact: org.openmrs.module:reportingui-omod:1.8.0:jar
17-Sep-2021 15:00:07 [INFO] Configured Artifact: org.openmrs.module:coreapps-omod:1.34.0-SNAPSHOT:jar
17-Sep-2021 15:00:07 [INFO] Configured Artifact: org.openmrs.module:reportingcompatibility-omod:2.0.8:jar
17-Sep-2021 15:00:07 [INFO] Configured Artifact: org.openmrs.module:reporting-omod:1.23.0:jar
17-Sep-2021 15:00:07 [INFO] Configured Artifact: org.openmrs.module:adminui-omod:1.5.0:jar
17-Sep-2021 15:00:07 [INFO] Configured Artifact: org.openmrs.module:registrationcore-omod:1.11.0:jar
17-Sep-2021 15:00:07 [INFO] Configured Artifact: org.openmrs.module:appointmentscheduling-omod:1.16.0:jar
17-Sep-2021 15:00:07 [INFO] Configured Artifact: org.openmrs.module:atlas-omod:2.2.5:omod
17-Sep-2021 15:00:07 [INFO] Configured Artifact: org.openmrs.module:calculation-omod:1.3.0:jar
17-Sep-2021 15:00:07 [INFO] Configured Artifact: org.openmrs.module:webservices.rest-omod:2.32.0-SNAPSHOT:jar
17-Sep-2021 15:00:07 [INFO] Configured Artifact: org.openmrs.module:spa-omod:1.0.8:jar
17-Sep-2021 15:00:07 [INFO] Configured Artifact: org.openmrs.module:uicommons-omod:2.18.0:jar
17-Sep-2021 15:00:07 [INFO] Configured Artifact: org.openmrs.module:uiframework-omod:3.21.0:jar
17-Sep-2021 15:00:07 [INFO] Configured Artifact: org.openmrs.module:metadatasharing-omod:1.8.0:jar
17-Sep-2021 15:00:07 [INFO] Copying addresshierarchy-omod-2.14.2.jar to /home/bamboo-agent/bamboo-agent/xml-data/build-dir/REFAPP-UI-FRAMEWORK/package/target/bundled-distro/web/WEB-INF/bundledModules/addresshierarchy-2.14.2.omod
17-Sep-2021 15:00:07 [INFO] Copying legacyui-omod-1.8.3.jar to /home/bamboo-agent/bamboo-agent/xml-data/build-dir/REFAPP-UI-FRAMEWORK/package/target/bundled-distro/web/WEB-INF/bundledModules/legacyui-1.8.3.omod
17-Sep-2021 15:00:07 [INFO] Copying openconceptlab-omod-1.2.6.jar to /home/bamboo-agent/bamboo-agent/xml-data/build-dir/REFAPP-UI-FRAMEWORK/package/target/bundled-distro/web/WEB-INF/bundledModules/openconceptlab-1.2.6.omod
17-Sep-2021 15:00:07 [INFO] Copying metadatadeploy-omod-1.13.0.jar to /home/bamboo-agent/bamboo-agent/xml-data/build-dir/REFAPP-UI-FRAMEWORK/package/target/bundled-distro/web/WEB-INF/bundledModules/metadatadeploy-1.13.0.omod
17-Sep-2021 15:00:07 [INFO] Copying reportingrest-omod-1.12.0.jar to /home/bamboo-agent/bamboo-agent/xml-data/build-dir/REFAPP-UI-FRAMEWORK/package/target/bundled-distro/web/WEB-INF/bundledModules/reportingrest-1.12.0.omod
17-Sep-2021 15:00:07 [INFO] Copying owa-omod-1.13.0.jar to /home/bamboo-agent/bamboo-agent/xml-data/build-dir/REFAPP-UI-FRAMEWORK/package/target/bundled-distro/web/WEB-INF/bundledModules/owa-1.13.0.omod
17-Sep-2021 15:00:07 [INFO] Copying fhir2-omod-1.2.2.jar to /home/bamboo-agent/bamboo-agent/xml-data/build-dir/REFAPP-UI-FRAMEWORK/package/target/bundled-distro/web/WEB-INF/bundledModules/fhir2-1.2.2.omod
17-Sep-2021 15:00:08 [INFO] Copying serialization.xstream-omod-0.2.15.omod to /home/bamboo-agent/bamboo-agent/xml-data/build-dir/REFAPP-UI-FRAMEWORK/package/target/bundled-distro/web/WEB-INF/bundledModules/serialization.xstream-0.2.15.omod
17-Sep-2021 15:00:08 [INFO] Copying registrationapp-omod-1.24.0.jar to /home/bamboo-agent/bamboo-agent/xml-data/build-dir/REFAPP-UI-FRAMEWORK/package/target/bundled-distro/web/WEB-INF/bundledModules/registrationapp-1.24.0.omod
17-Sep-2021 15:00:08 [INFO] Copying event-omod-2.10.0-SNAPSHOT.jar to /home/bamboo-agent/bamboo-agent/xml-data/build-dir/REFAPP-UI-FRAMEWORK/package/target/bundled-distro/web/WEB-INF/bundledModules/event-2.10.0-SNAPSHOT.omod
17-Sep-2021 15:00:08 [INFO] Copying uilibrary-omod-2.0.7.jar to /home/bamboo-agent/bamboo-agent/xml-data/build-dir/REFAPP-UI-FRAMEWORK/package/target/bundled-distro/web/WEB-INF/bundledModules/uilibrary-2.0.7.omod
17-Sep-2021 15:00:08 [INFO] Copying htmlwidgets-omod-1.10.0.jar to /home/bamboo-agent/bamboo-agent/xml-data/build-dir/REFAPP-UI-FRAMEWORK/package/target/bundled-distro/web/WEB-INF/bundledModules/htmlwidgets-1.10.0.omod
17-Sep-2021 15:00:08 [INFO] Copying dataexchange-omod-1.3.7.jar to /home/bamboo-agent/bamboo-agent/xml-data/build-dir/REFAPP-UI-FRAMEWORK/package/target/bundled-distro/web/WEB-INF/bundledModules/dataexchange-1.3.7.omod
17-Sep-2021 15:00:08 [INFO] Copying appui-omod-1.14.0.jar to /home/bamboo-agent/bamboo-agent/xml-data/build-dir/REFAPP-UI-FRAMEWORK/package/target/bundled-distro/web/WEB-INF/bundledModules/appui-1.14.0.omod
17-Sep-2021 15:00:08 [INFO] Copying allergyui-omod-1.8.4.jar to /home/bamboo-agent/bamboo-agent/xml-data/build-dir/REFAPP-UI-FRAMEWORK/package/target/bundled-distro/web/WEB-INF/bundledModules/allergyui-1.8.4.omod
17-Sep-2021 15:00:08 [INFO] Copying providermanagement-omod-2.13.0.jar to /home/bamboo-agent/bamboo-agent/xml-data/build-dir/REFAPP-UI-FRAMEWORK/package/target/bundled-distro/web/WEB-INF/bundledModules/providermanagement-2.13.0.omod
17-Sep-2021 15:00:08 [INFO] Copying appointmentschedulingui-omod-1.12.0.jar to /home/bamboo-agent/bamboo-agent/xml-data/build-dir/REFAPP-UI-FRAMEWORK/package/target/bundled-distro/web/WEB-INF/bundledModules/appointmentschedulingui-1.12.0.omod
17-Sep-2021 15:00:08 [INFO] Copying attachments-omod-2.5.0.jar to /home/bamboo-agent/bamboo-agent/xml-data/build-dir/REFAPP-UI-FRAMEWORK/package/target/bundled-distro/web/WEB-INF/bundledModules/attachments-2.5.0.omod
17-Sep-2021 15:00:08 [INFO] Copying formentryapp-omod-1.4.2.jar to /home/bamboo-agent/bamboo-agent/xml-data/build-dir/REFAPP-UI-FRAMEWORK/package/target/bundled-distro/web/WEB-INF/bundledModules/formentryapp-1.4.2.omod
17-Sep-2021 15:00:08 [INFO] Copying idgen-omod-4.7.0.jar to /home/bamboo-agent/bamboo-agent/xml-data/build-dir/REFAPP-UI-FRAMEWORK/package/target/bundled-distro/web/WEB-INF/bundledModules/idgen-4.7.0.omod
17-Sep-2021 15:00:08 [INFO] Copying metadatamapping-omod-1.4.0.jar to /home/bamboo-agent/bamboo-agent/xml-data/build-dir/REFAPP-UI-FRAMEWORK/package/target/bundled-distro/web/WEB-INF/bundledModules/metadatamapping-1.4.0.omod
17-Sep-2021 15:00:08 [INFO] Copying htmlformentryui-omod-2.0.0.jar to /home/bamboo-agent/bamboo-agent/xml-data/build-dir/REFAPP-UI-FRAMEWORK/package/target/bundled-distro/web/WEB-INF/bundledModules/htmlformentryui-2.0.0.omod
17-Sep-2021 15:00:08 [INFO] Copying referencedemodata-omod-1.4.7.jar to /home/bamboo-agent/bamboo-agent/xml-data/build-dir/REFAPP-UI-FRAMEWORK/package/target/bundled-distro/web/WEB-INF/bundledModules/referencedemodata-1.4.7.omod
17-Sep-2021 15:00:08 [INFO] Copying emrapi-omod-1.32.0.jar to /home/bamboo-agent/bamboo-agent/xml-data/build-dir/REFAPP-UI-FRAMEWORK/package/target/bundled-distro/web/WEB-INF/bundledModules/emrapi-1.32.0.omod
17-Sep-2021 15:00:08 [INFO] Copying referenceapplication-omod-2.12.0-SNAPSHOT.jar to /home/bamboo-agent/bamboo-agent/xml-data/build-dir/REFAPP-UI-FRAMEWORK/package/target/bundled-distro/web/WEB-INF/bundledModules/referenceapplication-2.12.0-SNAPSHOT.omod
17-Sep-2021 15:00:08 [INFO] Copying htmlformentry-omod-4.1.0.jar to /home/bamboo-agent/bamboo-agent/xml-data/build-dir/REFAPP-UI-FRAMEWORK/package/target/bundled-distro/web/WEB-INF/bundledModules/htmlformentry-4.1.0.omod
17-Sep-2021 15:00:08 [INFO] Copying appframework-omod-2.16.0.jar to /home/bamboo-agent/bamboo-agent/xml-data/build-dir/REFAPP-UI-FRAMEWORK/package/target/bundled-distro/web/WEB-INF/bundledModules/appframework-2.16.0.omod
17-Sep-2021 15:00:08 [INFO] Copying referencemetadata-omod-2.12.0.jar to /home/bamboo-agent/bamboo-agent/xml-data/build-dir/REFAPP-UI-FRAMEWORK/package/target/bundled-distro/web/WEB-INF/bundledModules/referencemetadata-2.12.0.omod
17-Sep-2021 15:00:08 [INFO] Copying reportingui-omod-1.8.0.jar to /home/bamboo-agent/bamboo-agent/xml-data/build-dir/REFAPP-UI-FRAMEWORK/package/target/bundled-distro/web/WEB-INF/bundledModules/reportingui-1.8.0.omod
17-Sep-2021 15:00:08 [INFO] Copying coreapps-omod-1.34.0-SNAPSHOT.jar to /home/bamboo-agent/bamboo-agent/xml-data/build-dir/REFAPP-UI-FRAMEWORK/package/target/bundled-distro/web/WEB-INF/bundledModules/coreapps-1.34.0-SNAPSHOT.omod
17-Sep-2021 15:00:08 [INFO] Copying reportingcompatibility-omod-2.0.8.jar to /home/bamboo-agent/bamboo-agent/xml-data/build-dir/REFAPP-UI-FRAMEWORK/package/target/bundled-distro/web/WEB-INF/bundledModules/reportingcompatibility-2.0.8.omod
17-Sep-2021 15:00:08 [INFO] Copying reporting-omod-1.23.0.jar to /home/bamboo-agent/bamboo-agent/xml-data/build-dir/REFAPP-UI-FRAMEWORK/package/target/bundled-distro/web/WEB-INF/bundledModules/reporting-1.23.0.omod
17-Sep-2021 15:00:08 [INFO] Copying adminui-omod-1.5.0.jar to /home/bamboo-agent/bamboo-agent/xml-data/build-dir/REFAPP-UI-FRAMEWORK/package/target/bundled-distro/web/WEB-INF/bundledModules/adminui-1.5.0.omod
17-Sep-2021 15:00:08 [INFO] Copying registrationcore-omod-1.11.0.jar to /home/bamboo-agent/bamboo-agent/xml-data/build-dir/REFAPP-UI-FRAMEWORK/package/target/bundled-distro/web/WEB-INF/bundledModules/registrationcore-1.11.0.omod
17-Sep-2021 15:00:08 [INFO] Copying appointmentscheduling-omod-1.16.0.jar to /home/bamboo-agent/bamboo-agent/xml-data/build-dir/REFAPP-UI-FRAMEWORK/package/target/bundled-distro/web/WEB-INF/bundledModules/appointmentscheduling-1.16.0.omod
17-Sep-2021 15:00:08 [INFO] Copying atlas-omod-2.2.5.omod to /home/bamboo-agent/bamboo-agent/xml-data/build-dir/REFAPP-UI-FRAMEWORK/package/target/bundled-distro/web/WEB-INF/bundledModules/atlas-2.2.5.omod
17-Sep-2021 15:00:08 [INFO] Copying calculation-omod-1.3.0.jar to /home/bamboo-agent/bamboo-agent/xml-data/build-dir/REFAPP-UI-FRAMEWORK/package/target/bundled-distro/web/WEB-INF/bundledModules/calculation-1.3.0.omod
17-Sep-2021 15:00:08 [INFO] Copying webservices.rest-omod-2.32.0-SNAPSHOT.jar to /home/bamboo-agent/bamboo-agent/xml-data/build-dir/REFAPP-UI-FRAMEWORK/package/target/bundled-distro/web/WEB-INF/bundledModules/webservices.rest-2.32.0-SNAPSHOT.omod
17-Sep-2021 15:00:08 [INFO] Copying spa-omod-1.0.8.jar to /home/bamboo-agent/bamboo-agent/xml-data/build-dir/REFAPP-UI-FRAMEWORK/package/target/bundled-distro/web/WEB-INF/bundledModules/spa-1.0.8.omod
17-Sep-2021 15:00:08 [INFO] Copying uicommons-omod-2.18.0.jar to /home/bamboo-agent/bamboo-agent/xml-data/build-dir/REFAPP-UI-FRAMEWORK/package/target/bundled-distro/web/WEB-INF/bundledModules/uicommons-2.18.0.omod
17-Sep-2021 15:00:08 [INFO] Copying uiframework-omod-3.21.0.jar to /home/bamboo-agent/bamboo-agent/xml-data/build-dir/REFAPP-UI-FRAMEWORK/package/target/bundled-distro/web/WEB-INF/bundledModules/uiframework-3.21.0.omod
17-Sep-2021 15:00:08 [INFO] Copying metadatasharing-omod-1.8.0.jar to /home/bamboo-agent/bamboo-agent/xml-data/build-dir/REFAPP-UI-FRAMEWORK/package/target/bundled-distro/web/WEB-INF/bundledModules/metadatasharing-1.8.0.omod
17-Sep-2021 15:00:08
17-Sep-2021 15:00:08 Downloading OWAs...
17-Sep-2021 15:00:08
17-Sep-2021 15:00:08
17-Sep-2021 15:00:08 Downloading OWA: org.openmrs.owa:openmrs-owa-sysadmin:1.2
17-Sep-2021 15:00:08 [INFO] Configured Artifact: org.openmrs.owa:sysadmin:1.2:zip
17-Sep-2021 15:00:08 [INFO] Copying sysadmin-1.2.zip to /home/bamboo-agent/bamboo-agent/xml-data/build-dir/REFAPP-UI-FRAMEWORK/package/target/bundled-distro/web/WEB-INF/bundledOwas/sysadmin-1.2.zip
17-Sep-2021 15:00:09
17-Sep-2021 15:00:09 Creating Docker Compose configuration...
17-Sep-2021 15:00:09
17-Sep-2021 15:00:11
17-Sep-2021 15:00:11 The 'referenceapplication' distribution created! To start up the server run 'docker-compose up' from /home/bamboo-agent/bamboo-agent/xml-data/build-dir/REFAPP-UI-FRAMEWORK/package/target/bundled-distro
17-Sep-2021 15:00:11
17-Sep-2021 15:00:11 [INFO]
17-Sep-2021 15:00:11 [INFO] --- maven-compiler-plugin:3.1:compile (default-compile) @ referenceapplication-package ---
17-Sep-2021 15:00:11 [INFO] No sources to compile
17-Sep-2021 15:00:11 [INFO]
17-Sep-2021 15:00:11 [INFO] --- maven-resources-plugin:2.6:testResources (default-testResources) @ referenceapplication-package ---
17-Sep-2021 15:00:11 [INFO] Using 'UTF-8' encoding to copy filtered resources.
17-Sep-2021 15:00:11 [INFO] skip non existing resourceDirectory /home/bamboo-agent/bamboo-agent/xml-data/build-dir/REFAPP-UI-FRAMEWORK/package/src/test/resources
17-Sep-2021 15:00:11 [INFO] skip non existing resourceDirectory /home/bamboo-agent/bamboo-agent/xml-data/build-dir/REFAPP-UI-FRAMEWORK/package/src/test/resources
17-Sep-2021 15:00:11 [INFO]
17-Sep-2021 15:00:11 [INFO] --- maven-compiler-plugin:3.1:testCompile (default-testCompile) @ referenceapplication-package ---
17-Sep-2021 15:00:11 [INFO] No sources to compile
17-Sep-2021 15:00:11 [INFO]
17-Sep-2021 15:00:11 [INFO] --- maven-surefire-plugin:2.12:test (default-test) @ referenceapplication-package ---
17-Sep-2021 15:00:11 [INFO] No tests to run.
17-Sep-2021 15:00:11 [INFO] Surefire report directory: /home/bamboo-agent/bamboo-agent/xml-data/build-dir/REFAPP-UI-FRAMEWORK/package/target/surefire-reports
17-Sep-2021 15:00:11
17-Sep-2021 15:00:11 -------------------------------------------------------
17-Sep-2021 15:00:11 T E S T S
17-Sep-2021 15:00:11 -------------------------------------------------------
17-Sep-2021 15:00:13
17-Sep-2021 15:00:13 Results :
17-Sep-2021 15:00:13
17-Sep-2021 15:00:13 Tests run: 0, Failures: 0, Errors: 0, Skipped: 0
17-Sep-2021 15:00:13
17-Sep-2021 15:00:13 [INFO]
17-Sep-2021 15:00:13 [INFO] --- maven-jar-plugin:2.4:jar (default-jar) @ referenceapplication-package ---
17-Sep-2021 15:00:13 [INFO] Building jar: /home/bamboo-agent/bamboo-agent/xml-data/build-dir/REFAPP-UI-FRAMEWORK/package/target/referenceapplication-package-2.12.0-SNAPSHOT.jar
17-Sep-2021 15:00:13 [INFO]
17-Sep-2021 15:00:13 [INFO] --- maven-assembly-plugin:2.3:single (make-assembly) @ referenceapplication-package ---
17-Sep-2021 15:00:14 [INFO] Reading assembly descriptor: /home/bamboo-agent/bamboo-agent/xml-data/build-dir/REFAPP-UI-FRAMEWORK/package/src/main/assembly/assembly.xml
17-Sep-2021 15:00:14 [INFO] Building zip: /home/bamboo-agent/bamboo-agent/xml-data/build-dir/REFAPP-UI-FRAMEWORK/package/target/referenceapplication-package-2.12.0-SNAPSHOT-addons.zip
17-Sep-2021 15:00:18 [INFO]
17-Sep-2021 15:00:18 [INFO] --- build-helper-maven-plugin:3.0.0:attach-artifact (attach-artifacts) @ referenceapplication-package ---
17-Sep-2021 15:00:19 [INFO]
17-Sep-2021 15:00:19 [INFO] --- maven-jar-plugin:2.4:test-jar (default) @ referenceapplication-package ---
17-Sep-2021 15:00:19 [WARNING] JAR will be empty - no content was marked for inclusion!
17-Sep-2021 15:00:19 [INFO] Building jar: /home/bamboo-agent/bamboo-agent/xml-data/build-dir/REFAPP-UI-FRAMEWORK/package/target/referenceapplication-package-2.12.0-SNAPSHOT-tests.jar
17-Sep-2021 15:00:19 [INFO]
17-Sep-2021 15:00:19 [INFO] --- maven-install-plugin:2.4:install (default-install) @ referenceapplication-package ---
17-Sep-2021 15:00:19 [INFO] Installing /home/bamboo-agent/bamboo-agent/xml-data/build-dir/REFAPP-UI-FRAMEWORK/package/target/referenceapplication-package-2.12.0-SNAPSHOT.jar to /home/bamboo-agent/.m2/repository/org/openmrs/distro/referenceapplication-package/2.12.0-SNAPSHOT/referenceapplication-package-2.12.0-SNAPSHOT.jar
17-Sep-2021 15:00:19 [INFO] Installing /home/bamboo-agent/bamboo-agent/xml-data/build-dir/REFAPP-UI-FRAMEWORK/package/pom.xml to /home/bamboo-agent/.m2/repository/org/openmrs/distro/referenceapplication-package/2.12.0-SNAPSHOT/referenceapplication-package-2.12.0-SNAPSHOT.pom
17-Sep-2021 15:00:19 [INFO] Installing /home/bamboo-agent/bamboo-agent/xml-data/build-dir/REFAPP-UI-FRAMEWORK/package/target/referenceapplication-package-2.12.0-SNAPSHOT-addons.zip to /home/bamboo-agent/.m2/repository/org/openmrs/distro/referenceapplication-package/2.12.0-SNAPSHOT/referenceapplication-package-2.12.0-SNAPSHOT-addons.zip
17-Sep-2021 15:00:19 [INFO] Installing /home/bamboo-agent/bamboo-agent/xml-data/build-dir/REFAPP-UI-FRAMEWORK/package/target/bundled-distro/web/openmrs.war to /home/bamboo-agent/.m2/repository/org/openmrs/distro/referenceapplication-package/2.12.0-SNAPSHOT/referenceapplication-package-2.12.0-SNAPSHOT.war
17-Sep-2021 15:00:21 [INFO] Installing /home/bamboo-agent/bamboo-agent/xml-data/build-dir/REFAPP-UI-FRAMEWORK/package/target/referenceapplication-package-2.12.0-SNAPSHOT-tests.jar to /home/bamboo-agent/.m2/repository/org/openmrs/distro/referenceapplication-package/2.12.0-SNAPSHOT/referenceapplication-package-2.12.0-SNAPSHOT-tests.jar
17-Sep-2021 15:00:21 [INFO]                                                                         
17-Sep-2021 15:00:21 [INFO] ------------------------------------------------------------------------
17-Sep-2021 15:00:21 [INFO] Building Reference Application Distribution UI Tests 2.12.0-SNAPSHOT
17-Sep-2021 15:00:21 [INFO] ------------------------------------------------------------------------
17-Sep-2021 15:00:21 [INFO]
17-Sep-2021 15:00:21 [INFO] --- maven-clean-plugin:2.5:clean (default-clean) @ referenceapplication-ui-tests ---
17-Sep-2021 15:00:21 [INFO]
17-Sep-2021 15:00:21 [INFO] --- maven-resources-plugin:2.6:resources (default-resources) @ referenceapplication-ui-tests ---
17-Sep-2021 15:00:21 [INFO] Using 'UTF-8' encoding to copy filtered resources.
17-Sep-2021 15:00:21 [INFO] skip non existing resourceDirectory /home/bamboo-agent/bamboo-agent/xml-data/build-dir/REFAPP-UI-FRAMEWORK/ui-tests/src/main/resources
17-Sep-2021 15:00:21 [INFO]
17-Sep-2021 15:00:21 [INFO] --- maven-compiler-plugin:3.1:compile (default-compile) @ referenceapplication-ui-tests ---
17-Sep-2021 15:00:21 [INFO] No sources to compile
17-Sep-2021 15:00:21 [INFO]
17-Sep-2021 15:00:21 [INFO] --- maven-resources-plugin:2.6:testResources (default-testResources) @ referenceapplication-ui-tests ---
17-Sep-2021 15:00:21 [INFO] Using 'UTF-8' encoding to copy filtered resources.
17-Sep-2021 15:00:21 [INFO] Copying 2 resources
17-Sep-2021 15:00:21 [INFO] Copying 2 resources
17-Sep-2021 15:00:21 [INFO]
17-Sep-2021 15:00:21 [INFO] --- maven-compiler-plugin:3.1:testCompile (default-testCompile) @ referenceapplication-ui-tests ---
17-Sep-2021 15:00:21 [INFO] Changes detected - recompiling the module!
17-Sep-2021 15:00:21 [INFO] Compiling 121 source files to /home/bamboo-agent/bamboo-agent/xml-data/build-dir/REFAPP-UI-FRAMEWORK/ui-tests/target/test-classes
17-Sep-2021 15:00:26 [WARNING] /home/bamboo-agent/bamboo-agent/xml-data/build-dir/REFAPP-UI-FRAMEWORK/ui-tests/src/test/java/org/openmrs/reference/AddDeleteLocationTest.java: Some input files use or override a deprecated API.
17-Sep-2021 15:00:26 [WARNING] /home/bamboo-agent/bamboo-agent/xml-data/build-dir/REFAPP-UI-FRAMEWORK/ui-tests/src/test/java/org/openmrs/reference/AddDeleteLocationTest.java: Recompile with -Xlint:deprecation for details.
17-Sep-2021 15:00:26 [WARNING] /home/bamboo-agent/bamboo-agent/xml-data/build-dir/REFAPP-UI-FRAMEWORK/ui-tests/src/test/java/org/openmrs/reference/AddRolesToUserTest.java: /home/bamboo-agent/bamboo-agent/xml-data/build-dir/REFAPP-UI-FRAMEWORK/ui-tests/src/test/java/org/openmrs/reference/AddRolesToUserTest.java uses unchecked or unsafe operations.
17-Sep-2021 15:00:26 [WARNING] /home/bamboo-agent/bamboo-agent/xml-data/build-dir/REFAPP-UI-FRAMEWORK/ui-tests/src/test/java/org/openmrs/reference/AddRolesToUserTest.java: Recompile with -Xlint:unchecked for details.
17-Sep-2021 15:00:26 [INFO]
17-Sep-2021 15:00:26 [INFO] --- maven-antrun-plugin:1.8:run (make-mac-chromedriver-executable) @ referenceapplication-ui-tests ---
17-Sep-2021 15:00:26 [INFO] Executing tasks
17-Sep-2021 15:00:26
17-Sep-2021 15:00:26 main:
17-Sep-2021 15:00:27 [INFO] An Ant BuildException has occured: /home/bamboo-agent/bamboo-agent/xml-data/build-dir/REFAPP-UI-FRAMEWORK/ui-tests/target/test-classes/chromedriver/mac does not exist.
17-Sep-2021 15:00:27 around Ant part ...<chmod file="target/test-classes/chromedriver/mac/chromedriver" perm="755"/>... @ 4:79 in /home/bamboo-agent/bamboo-agent/xml-data/build-dir/REFAPP-UI-FRAMEWORK/ui-tests/target/antrun/build-main.xml
17-Sep-2021 15:00:27 /home/bamboo-agent/bamboo-agent/xml-data/build-dir/REFAPP-UI-FRAMEWORK/ui-tests/target/antrun/build-main.xml:4: /home/bamboo-agent/bamboo-agent/xml-data/build-dir/REFAPP-UI-FRAMEWORK/ui-tests/target/test-classes/chromedriver/mac does not exist.
17-Sep-2021 15:00:27         at org.apache.tools.ant.types.AbstractFileSet.getDirectoryScanner(AbstractFileSet.java:484)
17-Sep-2021 15:00:27         at org.apache.tools.ant.taskdefs.ExecuteOn.runExec(ExecuteOn.java:369)
17-Sep-2021 15:00:27         at org.apache.tools.ant.taskdefs.ExecTask.execute(ExecTask.java:495)
17-Sep-2021 15:00:27         at org.apache.tools.ant.taskdefs.Chmod.execute(Chmod.java:181)
17-Sep-2021 15:00:27         at org.apache.tools.ant.UnknownElement.execute(UnknownElement.java:292)
17-Sep-2021 15:00:27         at sun.reflect.NativeMethodAccessorImpl.invoke0(Native Method)
17-Sep-2021 15:00:27         at sun.reflect.NativeMethodAccessorImpl.invoke(NativeMethodAccessorImpl.java:62)
17-Sep-2021 15:00:27         at sun.reflect.DelegatingMethodAccessorImpl.invoke(DelegatingMethodAccessorImpl.java:43)
17-Sep-2021 15:00:27         at java.lang.reflect.Method.invoke(Method.java:498)
17-Sep-2021 15:00:27         at org.apache.tools.ant.dispatch.DispatchUtils.execute(DispatchUtils.java:106)
17-Sep-2021 15:00:27         at org.apache.tools.ant.Task.perform(Task.java:348)
17-Sep-2021 15:00:27         at org.apache.tools.ant.Target.execute(Target.java:435)
17-Sep-2021 15:00:27         at org.apache.tools.ant.Target.performTasks(Target.java:456)
17-Sep-2021 15:00:27         at org.apache.tools.ant.Project.executeSortedTargets(Project.java:1393)
17-Sep-2021 15:00:27         at org.apache.tools.ant.Project.executeTarget(Project.java:1364)
17-Sep-2021 15:00:27         at org.apache.maven.plugin.antrun.AntRunMojo.execute(AntRunMojo.java:313)
17-Sep-2021 15:00:27         at org.apache.maven.plugin.DefaultBuildPluginManager.executeMojo(DefaultBuildPluginManager.java:134)
17-Sep-2021 15:00:27         at org.apache.maven.lifecycle.internal.MojoExecutor.execute(MojoExecutor.java:207)
17-Sep-2021 15:00:27         at org.apache.maven.lifecycle.internal.MojoExecutor.execute(MojoExecutor.java:153)
17-Sep-2021 15:00:27         at org.apache.maven.lifecycle.internal.MojoExecutor.execute(MojoExecutor.java:145)
17-Sep-2021 15:00:27         at org.apache.maven.lifecycle.internal.LifecycleModuleBuilder.buildProject(LifecycleModuleBuilder.java:116)
17-Sep-2021 15:00:27         at org.apache.maven.lifecycle.internal.LifecycleModuleBuilder.buildProject(LifecycleModuleBuilder.java:80)
17-Sep-2021 15:00:27         at org.apache.maven.lifecycle.internal.builder.singlethreaded.SingleThreadedBuilder.build(SingleThreadedBuilder.java:51)
17-Sep-2021 15:00:27         at org.apache.maven.lifecycle.internal.LifecycleStarter.execute(LifecycleStarter.java:128)
17-Sep-2021 15:00:27         at org.apache.maven.DefaultMaven.doExecute(DefaultMaven.java:307)
17-Sep-2021 15:00:27         at org.apache.maven.DefaultMaven.doExecute(DefaultMaven.java:193)
17-Sep-2021 15:00:27         at org.apache.maven.DefaultMaven.execute(DefaultMaven.java:106)
17-Sep-2021 15:00:27         at org.apache.maven.cli.MavenCli.execute(MavenCli.java:863)
17-Sep-2021 15:00:27         at org.apache.maven.cli.MavenCli.doMain(MavenCli.java:288)
17-Sep-2021 15:00:27         at org.apache.maven.cli.MavenCli.main(MavenCli.java:199)
17-Sep-2021 15:00:27         at sun.reflect.NativeMethodAccessorImpl.invoke0(Native Method)
17-Sep-2021 15:00:27         at sun.reflect.NativeMethodAccessorImpl.invoke(NativeMethodAccessorImpl.java:62)
17-Sep-2021 15:00:27         at sun.reflect.DelegatingMethodAccessorImpl.invoke(DelegatingMethodAccessorImpl.java:43)
17-Sep-2021 15:00:27         at java.lang.reflect.Method.invoke(Method.java:498)
17-Sep-2021 15:00:27         at org.codehaus.plexus.classworlds.launcher.Launcher.launchEnhanced(Launcher.java:289)
17-Sep-2021 15:00:27         at org.codehaus.plexus.classworlds.launcher.Launcher.launch(Launcher.java:229)
17-Sep-2021 15:00:27         at org.codehaus.plexus.classworlds.launcher.Launcher.mainWithExitCode(Launcher.java:415)
17-Sep-2021 15:00:27         at org.codehaus.plexus.classworlds.launcher.Launcher.main(Launcher.java:356)
17-Sep-2021 15:00:27 [INFO]
17-Sep-2021 15:00:27 [INFO] --- maven-antrun-plugin:1.8:run (make-linux-chromedriver-executable) @ referenceapplication-ui-tests ---
17-Sep-2021 15:00:27 [INFO] Executing tasks
17-Sep-2021 15:00:27
17-Sep-2021 15:00:27 main:
17-Sep-2021 15:00:27 [INFO] Executed tasks
17-Sep-2021 15:00:27 [INFO]
17-Sep-2021 15:00:27 [INFO] --- maven-antrun-plugin:1.8:run (make-mac-firefoxdriver-executable) @ referenceapplication-ui-tests ---
17-Sep-2021 15:00:27 [INFO] Executing tasks
17-Sep-2021 15:00:27
17-Sep-2021 15:00:27 main:
17-Sep-2021 15:00:27 [INFO] An Ant BuildException has occured: /home/bamboo-agent/bamboo-agent/xml-data/build-dir/REFAPP-UI-FRAMEWORK/ui-tests/target/test-classes/firefoxdriver/mac does not exist.
17-Sep-2021 15:00:27 around Ant part ...<chmod file="target/test-classes/firefoxdriver/mac/geckodriver" perm="755"/>... @ 4:79 in /home/bamboo-agent/bamboo-agent/xml-data/build-dir/REFAPP-UI-FRAMEWORK/ui-tests/target/antrun/build-main.xml
17-Sep-2021 15:00:27 /home/bamboo-agent/bamboo-agent/xml-data/build-dir/REFAPP-UI-FRAMEWORK/ui-tests/target/antrun/build-main.xml:4: /home/bamboo-agent/bamboo-agent/xml-data/build-dir/REFAPP-UI-FRAMEWORK/ui-tests/target/test-classes/firefoxdriver/mac does not exist.
17-Sep-2021 15:00:27         at org.apache.tools.ant.types.AbstractFileSet.getDirectoryScanner(AbstractFileSet.java:484)
17-Sep-2021 15:00:27         at org.apache.tools.ant.taskdefs.ExecuteOn.runExec(ExecuteOn.java:369)
17-Sep-2021 15:00:27         at org.apache.tools.ant.taskdefs.ExecTask.execute(ExecTask.java:495)
17-Sep-2021 15:00:27         at org.apache.tools.ant.taskdefs.Chmod.execute(Chmod.java:181)
17-Sep-2021 15:00:27         at org.apache.tools.ant.UnknownElement.execute(UnknownElement.java:292)
17-Sep-2021 15:00:27         at sun.reflect.NativeMethodAccessorImpl.invoke0(Native Method)
17-Sep-2021 15:00:27         at sun.reflect.NativeMethodAccessorImpl.invoke(NativeMethodAccessorImpl.java:62)
17-Sep-2021 15:00:27         at sun.reflect.DelegatingMethodAccessorImpl.invoke(DelegatingMethodAccessorImpl.java:43)
17-Sep-2021 15:00:27         at java.lang.reflect.Method.invoke(Method.java:498)
17-Sep-2021 15:00:27         at org.apache.tools.ant.dispatch.DispatchUtils.execute(DispatchUtils.java:106)
17-Sep-2021 15:00:27         at org.apache.tools.ant.Task.perform(Task.java:348)
17-Sep-2021 15:00:27         at org.apache.tools.ant.Target.execute(Target.java:435)
17-Sep-2021 15:00:27         at org.apache.tools.ant.Target.performTasks(Target.java:456)
17-Sep-2021 15:00:27         at org.apache.tools.ant.Project.executeSortedTargets(Project.java:1393)
17-Sep-2021 15:00:27         at org.apache.tools.ant.Project.executeTarget(Project.java:1364)
17-Sep-2021 15:00:27         at org.apache.maven.plugin.antrun.AntRunMojo.execute(AntRunMojo.java:313)
17-Sep-2021 15:00:27         at org.apache.maven.plugin.DefaultBuildPluginManager.executeMojo(DefaultBuildPluginManager.java:134)
17-Sep-2021 15:00:27         at org.apache.maven.lifecycle.internal.MojoExecutor.execute(MojoExecutor.java:207)
17-Sep-2021 15:00:27         at org.apache.maven.lifecycle.internal.MojoExecutor.execute(MojoExecutor.java:153)
17-Sep-2021 15:00:27         at org.apache.maven.lifecycle.internal.MojoExecutor.execute(MojoExecutor.java:145)
17-Sep-2021 15:00:27         at org.apache.maven.lifecycle.internal.LifecycleModuleBuilder.buildProject(LifecycleModuleBuilder.java:116)
17-Sep-2021 15:00:27         at org.apache.maven.lifecycle.internal.LifecycleModuleBuilder.buildProject(LifecycleModuleBuilder.java:80)
17-Sep-2021 15:00:27         at org.apache.maven.lifecycle.internal.builder.singlethreaded.SingleThreadedBuilder.build(SingleThreadedBuilder.java:51)
17-Sep-2021 15:00:27         at org.apache.maven.lifecycle.internal.LifecycleStarter.execute(LifecycleStarter.java:128)
17-Sep-2021 15:00:27         at org.apache.maven.DefaultMaven.doExecute(DefaultMaven.java:307)
17-Sep-2021 15:00:27         at org.apache.maven.DefaultMaven.doExecute(DefaultMaven.java:193)
17-Sep-2021 15:00:27         at org.apache.maven.DefaultMaven.execute(DefaultMaven.java:106)
17-Sep-2021 15:00:27         at org.apache.maven.cli.MavenCli.execute(MavenCli.java:863)
17-Sep-2021 15:00:27         at org.apache.maven.cli.MavenCli.doMain(MavenCli.java:288)
17-Sep-2021 15:00:27         at org.apache.maven.cli.MavenCli.main(MavenCli.java:199)
17-Sep-2021 15:00:27         at sun.reflect.NativeMethodAccessorImpl.invoke0(Native Method)
17-Sep-2021 15:00:27         at sun.reflect.NativeMethodAccessorImpl.invoke(NativeMethodAccessorImpl.java:62)
17-Sep-2021 15:00:27         at sun.reflect.DelegatingMethodAccessorImpl.invoke(DelegatingMethodAccessorImpl.java:43)
17-Sep-2021 15:00:27         at java.lang.reflect.Method.invoke(Method.java:498)
17-Sep-2021 15:00:27         at org.codehaus.plexus.classworlds.launcher.Launcher.launchEnhanced(Launcher.java:289)
17-Sep-2021 15:00:27         at org.codehaus.plexus.classworlds.launcher.Launcher.launch(Launcher.java:229)
17-Sep-2021 15:00:27         at org.codehaus.plexus.classworlds.launcher.Launcher.mainWithExitCode(Launcher.java:415)
17-Sep-2021 15:00:27         at org.codehaus.plexus.classworlds.launcher.Launcher.main(Launcher.java:356)
17-Sep-2021 15:00:27 [INFO]
17-Sep-2021 15:00:27 [INFO] --- maven-antrun-plugin:1.8:run (make-linux-firefoxdriver-executable) @ referenceapplication-ui-tests ---
17-Sep-2021 15:00:27 [INFO] Executing tasks
17-Sep-2021 15:00:27
17-Sep-2021 15:00:27 main:
17-Sep-2021 15:00:27 [INFO] Executed tasks
17-Sep-2021 15:00:27 [INFO]
17-Sep-2021 15:00:27 [INFO] --- maven-surefire-plugin:2.12:test (default-test) @ referenceapplication-ui-tests ---
17-Sep-2021 15:00:27 [INFO] Surefire report directory: /home/bamboo-agent/bamboo-agent/xml-data/build-dir/REFAPP-UI-FRAMEWORK/ui-tests/target/surefire-reports
17-Sep-2021 15:00:27
17-Sep-2021 15:00:27 -------------------------------------------------------
17-Sep-2021 15:00:27 T E S T S
17-Sep-2021 15:00:27 -------------------------------------------------------
17-Sep-2021 15:00:28 Running org.openmrs.reference.UnidentifiedPatientKeyboardTest
17-Sep-2021 15:00:28 Running locally...
17-Sep-2021 15:00:35 Starting ChromeDriver 90.0.4430.24 (4c6d850f087da467d926e8eddb76550aed655991-refs/branch-heads/4430@{#429}) on port 24055
17-Sep-2021 15:00:35 Only local connections are allowed.
17-Sep-2021 15:00:35 Please see https://chromedriver.chromium.org/security-considerations for suggestions on keeping ChromeDriver safe.
17-Sep-2021 15:00:35 ChromeDriver was started successfully.
17-Sep-2021 15:00:46 Sep 17, 2021 3:00:46 PM org.openqa.selenium.remote.ProtocolHandshake createSession
17-Sep-2021 15:00:46 INFO: Detected dialect: W3C
17-Sep-2021 15:01:00 Tests run: 1, Failures: 0, Errors: 0, Skipped: 0, Time elapsed: 32.001 sec
17-Sep-2021 15:01:00 Running org.openmrs.reference.DeleteAllergyTest
17-Sep-2021 15:01:00 Running locally...
17-Sep-2021 15:01:00 Starting ChromeDriver 90.0.4430.24 (4c6d850f087da467d926e8eddb76550aed655991-refs/branch-heads/4430@{#429}) on port 14983
17-Sep-2021 15:01:00 Only local connections are allowed.
17-Sep-2021 15:01:00 Please see https://chromedriver.chromium.org/security-considerations for suggestions on keeping ChromeDriver safe.
17-Sep-2021 15:01:00 ChromeDriver was started successfully.
17-Sep-2021 15:01:01 Sep 17, 2021 3:01:01 PM org.openqa.selenium.remote.ProtocolHandshake createSession
17-Sep-2021 15:01:01 INFO: Detected dialect: W3C
17-Sep-2021 15:01:10 Tests run: 1, Failures: 0, Errors: 0, Skipped: 0, Time elapsed: 9.677 sec
17-Sep-2021 15:01:10 Running org.openmrs.reference.SearchActiveVisitsTest
17-Sep-2021 15:01:10 Running locally...
17-Sep-2021 15:01:10 Starting ChromeDriver 90.0.4430.24 (4c6d850f087da467d926e8eddb76550aed655991-refs/branch-heads/4430@{#429}) on port 16087
17-Sep-2021 15:01:10 Only local connections are allowed.
17-Sep-2021 15:01:10 Please see https://chromedriver.chromium.org/security-considerations for suggestions on keeping ChromeDriver safe.
17-Sep-2021 15:01:10 ChromeDriver was started successfully.
17-Sep-2021 15:01:10 Sep 17, 2021 3:01:10 PM org.openqa.selenium.remote.ProtocolHandshake createSession
17-Sep-2021 15:01:10 INFO: Detected dialect: W3C
17-Sep-2021 15:01:15 Tests run: 1, Failures: 0, Errors: 0, Skipped: 0, Time elapsed: 5.054 sec
17-Sep-2021 15:01:15 Running org.openmrs.reference.AddVisitTypeTest
17-Sep-2021 15:01:15 Running locally...
17-Sep-2021 15:01:15 Starting ChromeDriver 90.0.4430.24 (4c6d850f087da467d926e8eddb76550aed655991-refs/branch-heads/4430@{#429}) on port 27403
17-Sep-2021 15:01:15 Only local connections are allowed.
17-Sep-2021 15:01:15 Please see https://chromedriver.chromium.org/security-considerations for suggestions on keeping ChromeDriver safe.
17-Sep-2021 15:01:15 ChromeDriver was started successfully.
17-Sep-2021 15:01:15 Sep 17, 2021 3:01:15 PM org.openqa.selenium.remote.ProtocolHandshake createSession
17-Sep-2021 15:01:15 INFO: Detected dialect: W3C
17-Sep-2021 15:01:20 Tests run: 1, Failures: 0, Errors: 0, Skipped: 0, Time elapsed: 5.068 sec
17-Sep-2021 15:01:20 Running org.openmrs.reference.FindPatientRecordTest
17-Sep-2021 15:01:20 Running locally...
17-Sep-2021 15:01:20 Starting ChromeDriver 90.0.4430.24 (4c6d850f087da467d926e8eddb76550aed655991-refs/branch-heads/4430@{#429}) on port 26611
17-Sep-2021 15:01:20 Only local connections are allowed.
17-Sep-2021 15:01:20 Please see https://chromedriver.chromium.org/security-considerations for suggestions on keeping ChromeDriver safe.
17-Sep-2021 15:01:20 ChromeDriver was started successfully.
17-Sep-2021 15:01:20 Sep 17, 2021 3:01:20 PM org.openqa.selenium.remote.ProtocolHandshake createSession
17-Sep-2021 15:01:20 INFO: Detected dialect: W3C
17-Sep-2021 15:01:24 Tests run: 1, Failures: 0, Errors: 0, Skipped: 0, Time elapsed: 4.69 sec
17-Sep-2021 15:01:24 Running org.openmrs.reference.EditPersonTest
17-Sep-2021 15:01:24 Running locally...
17-Sep-2021 15:01:24 Starting ChromeDriver 90.0.4430.24 (4c6d850f087da467d926e8eddb76550aed655991-refs/branch-heads/4430@{#429}) on port 6619
17-Sep-2021 15:01:24 Only local connections are allowed.
17-Sep-2021 15:01:24 Please see https://chromedriver.chromium.org/security-considerations for suggestions on keeping ChromeDriver safe.
17-Sep-2021 15:01:24 ChromeDriver was started successfully.
17-Sep-2021 15:01:25 Sep 17, 2021 3:01:25 PM org.openqa.selenium.remote.ProtocolHandshake createSession
17-Sep-2021 15:01:25 INFO: Detected dialect: W3C
17-Sep-2021 15:01:29 Tests run: 1, Failures: 0, Errors: 0, Skipped: 0, Time elapsed: 4.914 sec
17-Sep-2021 15:01:29 Running org.openmrs.reference.RetireLocationTest
17-Sep-2021 15:01:29 Running locally...
17-Sep-2021 15:01:29 Starting ChromeDriver 90.0.4430.24 (4c6d850f087da467d926e8eddb76550aed655991-refs/branch-heads/4430@{#429}) on port 22873
17-Sep-2021 15:01:29 Only local connections are allowed.
17-Sep-2021 15:01:29 Please see https://chromedriver.chromium.org/security-considerations for suggestions on keeping ChromeDriver safe.
17-Sep-2021 15:01:29 ChromeDriver was started successfully.
17-Sep-2021 15:01:30 Sep 17, 2021 3:01:30 PM org.openqa.selenium.remote.ProtocolHandshake createSession
17-Sep-2021 15:01:30 INFO: Detected dialect: W3C
17-Sep-2021 15:01:33 Tests run: 1, Failures: 0, Errors: 0, Skipped: 0, Time elapsed: 3.227 sec
17-Sep-2021 15:01:33 Running org.openmrs.reference.XSSOnPhoneNumberFieldTest
17-Sep-2021 15:01:33 Running locally...
17-Sep-2021 15:01:33 Starting ChromeDriver 90.0.4430.24 (4c6d850f087da467d926e8eddb76550aed655991-refs/branch-heads/4430@{#429}) on port 28726
17-Sep-2021 15:01:33 Only local connections are allowed.
17-Sep-2021 15:01:33 Please see https://chromedriver.chromium.org/security-considerations for suggestions on keeping ChromeDriver safe.
17-Sep-2021 15:01:33 ChromeDriver was started successfully.
17-Sep-2021 15:01:33 Sep 17, 2021 3:01:33 PM org.openqa.selenium.remote.ProtocolHandshake createSession
17-Sep-2021 15:01:33 INFO: Detected dialect: W3C
17-Sep-2021 15:01:44 Tests run: 1, Failures: 0, Errors: 0, Skipped: 0, Time elapsed: 11.454 sec
17-Sep-2021 15:01:44 Running org.openmrs.reference.TransferToWardServiceTest
17-Sep-2021 15:01:44 Running locally...
17-Sep-2021 15:01:44 Starting ChromeDriver 90.0.4430.24 (4c6d850f087da467d926e8eddb76550aed655991-refs/branch-heads/4430@{#429}) on port 26927
17-Sep-2021 15:01:44 Only local connections are allowed.
17-Sep-2021 15:01:44 Please see https://chromedriver.chromium.org/security-considerations for suggestions on keeping ChromeDriver safe.
17-Sep-2021 15:01:44 ChromeDriver was started successfully.
17-Sep-2021 15:01:45 Sep 17, 2021 3:01:45 PM org.openqa.selenium.remote.ProtocolHandshake createSession
17-Sep-2021 15:01:45 INFO: Detected dialect: W3C
17-Sep-2021 15:01:59 Tests run: 1, Failures: 0, Errors: 0, Skipped: 0, Time elapsed: 15.396 sec
17-Sep-2021 15:01:59 Running org.openmrs.reference.EditVisitTypeTest
17-Sep-2021 15:01:59 Running locally...
17-Sep-2021 15:01:59 Starting ChromeDriver 90.0.4430.24 (4c6d850f087da467d926e8eddb76550aed655991-refs/branch-heads/4430@{#429}) on port 22908
17-Sep-2021 15:01:59 Only local connections are allowed.
17-Sep-2021 15:01:59 Please see https://chromedriver.chromium.org/security-considerations for suggestions on keeping ChromeDriver safe.
17-Sep-2021 15:01:59 ChromeDriver was started successfully.
17-Sep-2021 15:02:00 Sep 17, 2021 3:02:00 PM org.openqa.selenium.remote.ProtocolHandshake createSession
17-Sep-2021 15:02:00 INFO: Detected dialect: W3C
17-Sep-2021 15:02:05 Tests run: 1, Failures: 0, Errors: 0, Skipped: 0, Time elapsed: 5.29 sec
17-Sep-2021 15:02:05 Running org.openmrs.reference.ComeBackToApplicationAfterLogoutTest
17-Sep-2021 15:02:05 Running locally...
17-Sep-2021 15:02:05 Starting ChromeDriver 90.0.4430.24 (4c6d850f087da467d926e8eddb76550aed655991-refs/branch-heads/4430@{#429}) on port 7177
17-Sep-2021 15:02:05 Only local connections are allowed.
17-Sep-2021 15:02:05 Please see https://chromedriver.chromium.org/security-considerations for suggestions on keeping ChromeDriver safe.
17-Sep-2021 15:02:05 ChromeDriver was started successfully.
17-Sep-2021 15:02:05 Sep 17, 2021 3:02:05 PM org.openqa.selenium.remote.ProtocolHandshake createSession
17-Sep-2021 15:02:05 INFO: Detected dialect: W3C
17-Sep-2021 15:02:07 Tests run: 1, Failures: 0, Errors: 0, Skipped: 0, Time elapsed: 1.93 sec
17-Sep-2021 15:02:07 Running org.openmrs.reference.EditDemographicTest
17-Sep-2021 15:02:07 Running locally...
17-Sep-2021 15:02:07 Starting ChromeDriver 90.0.4430.24 (4c6d850f087da467d926e8eddb76550aed655991-refs/branch-heads/4430@{#429}) on port 29313
17-Sep-2021 15:02:07 Only local connections are allowed.
17-Sep-2021 15:02:07 Please see https://chromedriver.chromium.org/security-considerations for suggestions on keeping ChromeDriver safe.
17-Sep-2021 15:02:07 ChromeDriver was started successfully.
17-Sep-2021 15:02:07 Sep 17, 2021 3:02:07 PM org.openqa.selenium.remote.ProtocolHandshake createSession
17-Sep-2021 15:02:07 INFO: Detected dialect: W3C
17-Sep-2021 15:02:16 Tests run: 1, Failures: 0, Errors: 0, Skipped: 0, Time elapsed: 9.683 sec
17-Sep-2021 15:02:16 Running org.openmrs.reference.DeleteVisitTypeTest
17-Sep-2021 15:02:16 Running locally...
17-Sep-2021 15:02:16 Starting ChromeDriver 90.0.4430.24 (4c6d850f087da467d926e8eddb76550aed655991-refs/branch-heads/4430@{#429}) on port 8243
17-Sep-2021 15:02:16 Only local connections are allowed.
17-Sep-2021 15:02:16 Please see https://chromedriver.chromium.org/security-considerations for suggestions on keeping ChromeDriver safe.
17-Sep-2021 15:02:16 ChromeDriver was started successfully.
17-Sep-2021 15:02:17 Sep 17, 2021 3:02:17 PM org.openqa.selenium.remote.ProtocolHandshake createSession
17-Sep-2021 15:02:17 INFO: Detected dialect: W3C
17-Sep-2021 15:02:20 Tests run: 1, Failures: 0, Errors: 0, Skipped: 0, Time elapsed: 3.528 sec
17-Sep-2021 15:02:20 Running org.openmrs.reference.FormTest
17-Sep-2021 15:02:20 Running locally...
17-Sep-2021 15:02:20 Starting ChromeDriver 90.0.4430.24 (4c6d850f087da467d926e8eddb76550aed655991-refs/branch-heads/4430@{#429}) on port 8760
17-Sep-2021 15:02:20 Only local connections are allowed.
17-Sep-2021 15:02:20 Please see https://chromedriver.chromium.org/security-considerations for suggestions on keeping ChromeDriver safe.
17-Sep-2021 15:02:20 ChromeDriver was started successfully.
17-Sep-2021 15:02:20 Sep 17, 2021 3:02:20 PM org.openqa.selenium.remote.ProtocolHandshake createSession
17-Sep-2021 15:02:20 INFO: Detected dialect: W3C
17-Sep-2021 15:02:27 Running locally...
17-Sep-2021 15:02:27 Starting ChromeDriver 90.0.4430.24 (4c6d850f087da467d926e8eddb76550aed655991-refs/branch-heads/4430@{#429}) on port 22786
17-Sep-2021 15:02:27 Only local connections are allowed.
17-Sep-2021 15:02:27 Please see https://chromedriver.chromium.org/security-considerations for suggestions on keeping ChromeDriver safe.
17-Sep-2021 15:02:27 ChromeDriver was started successfully.
17-Sep-2021 15:02:27 Sep 17, 2021 3:02:27 PM org.openqa.selenium.remote.ProtocolHandshake createSession
17-Sep-2021 15:02:27 INFO: Detected dialect: W3C
17-Sep-2021 15:02:34 Running locally...
17-Sep-2021 15:02:34 Starting ChromeDriver 90.0.4430.24 (4c6d850f087da467d926e8eddb76550aed655991-refs/branch-heads/4430@{#429}) on port 27351
17-Sep-2021 15:02:34 Only local connections are allowed.
17-Sep-2021 15:02:34 Please see https://chromedriver.chromium.org/security-considerations for suggestions on keeping ChromeDriver safe.
17-Sep-2021 15:02:34 ChromeDriver was started successfully.
17-Sep-2021 15:02:34 Sep 17, 2021 3:02:34 PM org.openqa.selenium.remote.ProtocolHandshake createSession
17-Sep-2021 15:02:34 INFO: Detected dialect: W3C
17-Sep-2021 15:02:38 Running locally...
17-Sep-2021 15:02:38 Starting ChromeDriver 90.0.4430.24 (4c6d850f087da467d926e8eddb76550aed655991-refs/branch-heads/4430@{#429}) on port 5286
17-Sep-2021 15:02:38 Only local connections are allowed.
17-Sep-2021 15:02:38 Please see https://chromedriver.chromium.org/security-considerations for suggestions on keeping ChromeDriver safe.
17-Sep-2021 15:02:38 ChromeDriver was started successfully.
17-Sep-2021 15:02:38 Sep 17, 2021 3:02:38 PM org.openqa.selenium.remote.ProtocolHandshake createSession
17-Sep-2021 15:02:38 INFO: Detected dialect: W3C
17-Sep-2021 15:02:43 Tests run: 4, Failures: 0, Errors: 0, Skipped: 0, Time elapsed: 23.152 sec
17-Sep-2021 15:02:43 Running org.openmrs.reference.RegisterUnidentifiedPatientTest
17-Sep-2021 15:02:43 Running locally...
17-Sep-2021 15:02:43 Starting ChromeDriver 90.0.4430.24 (4c6d850f087da467d926e8eddb76550aed655991-refs/branch-heads/4430@{#429}) on port 17592
17-Sep-2021 15:02:43 Only local connections are allowed.
17-Sep-2021 15:02:43 Please see https://chromedriver.chromium.org/security-considerations for suggestions on keeping ChromeDriver safe.
17-Sep-2021 15:02:43 ChromeDriver was started successfully.
17-Sep-2021 15:02:43 Sep 17, 2021 3:02:43 PM org.openqa.selenium.remote.ProtocolHandshake createSession
17-Sep-2021 15:02:43 INFO: Detected dialect: W3C
17-Sep-2021 15:02:50 Tests run: 1, Failures: 0, Errors: 0, Skipped: 0, Time elapsed: 6.485 sec
17-Sep-2021 15:02:50 Running org.openmrs.reference.AddPatientAppointmentTest
17-Sep-2021 15:02:50 Running locally...
17-Sep-2021 15:02:50 Starting ChromeDriver 90.0.4430.24 (4c6d850f087da467d926e8eddb76550aed655991-refs/branch-heads/4430@{#429}) on port 19915
17-Sep-2021 15:02:50 Only local connections are allowed.
17-Sep-2021 15:02:50 Please see https://chromedriver.chromium.org/security-considerations for suggestions on keeping ChromeDriver safe.
17-Sep-2021 15:02:50 ChromeDriver was started successfully.
17-Sep-2021 15:02:50 Sep 17, 2021 3:02:50 PM org.openqa.selenium.remote.ProtocolHandshake createSession
17-Sep-2021 15:02:50 INFO: Detected dialect: W3C
17-Sep-2021 15:03:05 Tests run: 1, Failures: 0, Errors: 0, Skipped: 0, Time elapsed: 15.103 sec
17-Sep-2021 15:03:05 Running org.openmrs.reference.AdmitExitInpatientTest
17-Sep-2021 15:03:05 Running locally...
17-Sep-2021 15:03:05 Starting ChromeDriver 90.0.4430.24 (4c6d850f087da467d926e8eddb76550aed655991-refs/branch-heads/4430@{#429}) on port 16113
17-Sep-2021 15:03:05 Only local connections are allowed.
17-Sep-2021 15:03:05 Please see https://chromedriver.chromium.org/security-considerations for suggestions on keeping ChromeDriver safe.
17-Sep-2021 15:03:05 ChromeDriver was started successfully.
17-Sep-2021 15:03:05 Sep 17, 2021 3:03:05 PM org.openqa.selenium.remote.ProtocolHandshake createSession
17-Sep-2021 15:03:05 INFO: Detected dialect: W3C
17-Sep-2021 15:03:19 Tests run: 1, Failures: 0, Errors: 0, Skipped: 0, Time elapsed: 14.118 sec
17-Sep-2021 15:03:19 Running org.openmrs.reference.DeleteRequestAppointmentTest
17-Sep-2021 15:03:19 Running locally...
17-Sep-2021 15:03:19 Starting ChromeDriver 90.0.4430.24 (4c6d850f087da467d926e8eddb76550aed655991-refs/branch-heads/4430@{#429}) on port 2293
17-Sep-2021 15:03:19 Only local connections are allowed.
17-Sep-2021 15:03:19 Please see https://chromedriver.chromium.org/security-considerations for suggestions on keeping ChromeDriver safe.
17-Sep-2021 15:03:19 ChromeDriver was started successfully.
17-Sep-2021 15:03:19 Sep 17, 2021 3:03:19 PM org.openqa.selenium.remote.ProtocolHandshake createSession
17-Sep-2021 15:03:19 INFO: Detected dialect: W3C
17-Sep-2021 15:03:33 Tests run: 1, Failures: 0, Errors: 0, Skipped: 0, Time elapsed: 14.463 sec
17-Sep-2021 15:03:33 Running org.openmrs.reference.EditAllergyTest
17-Sep-2021 15:03:33 Running locally...
17-Sep-2021 15:03:33 Starting ChromeDriver 90.0.4430.24 (4c6d850f087da467d926e8eddb76550aed655991-refs/branch-heads/4430@{#429}) on port 24157
17-Sep-2021 15:03:33 Only local connections are allowed.
17-Sep-2021 15:03:33 Please see https://chromedriver.chromium.org/security-considerations for suggestions on keeping ChromeDriver safe.
17-Sep-2021 15:03:33 ChromeDriver was started successfully.
17-Sep-2021 15:03:34 Sep 17, 2021 3:03:34 PM org.openqa.selenium.remote.ProtocolHandshake createSession
17-Sep-2021 15:03:34 INFO: Detected dialect: W3C
17-Sep-2021 15:03:43 Tests run: 1, Failures: 0, Errors: 0, Skipped: 0, Time elapsed: 9.559 sec
17-Sep-2021 15:03:43 Running org.openmrs.reference.VisitNoteTest
17-Sep-2021 15:03:43 Running locally...
17-Sep-2021 15:03:43 Starting ChromeDriver 90.0.4430.24 (4c6d850f087da467d926e8eddb76550aed655991-refs/branch-heads/4430@{#429}) on port 26841
17-Sep-2021 15:03:43 Only local connections are allowed.
17-Sep-2021 15:03:43 Please see https://chromedriver.chromium.org/security-considerations for suggestions on keeping ChromeDriver safe.
17-Sep-2021 15:03:43 ChromeDriver was started successfully.
17-Sep-2021 15:03:43 Sep 17, 2021 3:03:43 PM org.openqa.selenium.remote.ProtocolHandshake createSession
17-Sep-2021 15:03:43 INFO: Detected dialect: W3C
17-Sep-2021 15:04:07 Tests run: 1, Failures: 0, Errors: 0, Skipped: 0, Time elapsed: 24.569 sec
17-Sep-2021 15:04:07 Running org.openmrs.reference.CreatePersonTest
17-Sep-2021 15:04:07 Running locally...
17-Sep-2021 15:04:07 Starting ChromeDriver 90.0.4430.24 (4c6d850f087da467d926e8eddb76550aed655991-refs/branch-heads/4430@{#429}) on port 20908
17-Sep-2021 15:04:07 Only local connections are allowed.
17-Sep-2021 15:04:07 Please see https://chromedriver.chromium.org/security-considerations for suggestions on keeping ChromeDriver safe.
17-Sep-2021 15:04:07 ChromeDriver was started successfully.
17-Sep-2021 15:04:08 Sep 17, 2021 3:04:08 PM org.openqa.selenium.remote.ProtocolHandshake createSession
17-Sep-2021 15:04:08 INFO: Detected dialect: W3C
17-Sep-2021 15:04:13 Tests run: 1, Failures: 0, Errors: 0, Skipped: 0, Time elapsed: 5.497 sec
17-Sep-2021 15:04:13 Running org.openmrs.reference.FindPatientByNameTest
17-Sep-2021 15:04:13 Running locally...
17-Sep-2021 15:04:13 Starting ChromeDriver 90.0.4430.24 (4c6d850f087da467d926e8eddb76550aed655991-refs/branch-heads/4430@{#429}) on port 27525
17-Sep-2021 15:04:13 Only local connections are allowed.
17-Sep-2021 15:04:13 Please see https://chromedriver.chromium.org/security-considerations for suggestions on keeping ChromeDriver safe.
17-Sep-2021 15:04:13 ChromeDriver was started successfully.
17-Sep-2021 15:04:13 Sep 17, 2021 3:04:13 PM org.openqa.selenium.remote.ProtocolHandshake createSession
17-Sep-2021 15:04:13 INFO: Detected dialect: W3C
17-Sep-2021 15:04:13 Test killed due to server failure in FindPatientByNameTest.findPatientByNameTest
17-Sep-2021 15:04:13 jakarta.ws.rs.ServerErrorException: Bad Gateway
17-Sep-2021 15:04:13         at org.openmrs.uitestframework.test.TestBase.goToLoginPage(TestBase.java:245)
17-Sep-2021 15:04:13         at org.openmrs.uitestframework.test.TestBase.login(TestBase.java:231)
17-Sep-2021 15:04:13         at org.openmrs.uitestframework.test.TestBase.launchBrowser(TestBase.java:191)
17-Sep-2021 15:04:13         at org.openmrs.uitestframework.test.TestBase.startWebDriver(TestBase.java:130)
17-Sep-2021 15:04:13         at sun.reflect.GeneratedMethodAccessor6.invoke(Unknown Source)
17-Sep-2021 15:04:13         at sun.reflect.DelegatingMethodAccessorImpl.invoke(DelegatingMethodAccessorImpl.java:43)
17-Sep-2021 15:04:13         at java.lang.reflect.Method.invoke(Method.java:498)
17-Sep-2021 15:04:13         at org.junit.runners.model.FrameworkMethod$1.runReflectiveCall(FrameworkMethod.java:59)
17-Sep-2021 15:04:13         at org.junit.internal.runners.model.ReflectiveCallable.run(ReflectiveCallable.java:12)
17-Sep-2021 15:04:13         at org.junit.runners.model.FrameworkMethod.invokeExplosively(FrameworkMethod.java:56)
17-Sep-2021 15:04:13         at org.junit.internal.runners.statements.RunBefores.invokeMethod(RunBefores.java:33)
17-Sep-2021 15:04:13         at org.junit.internal.runners.statements.RunBefores.evaluate(RunBefores.java:24)
17-Sep-2021 15:04:13         at org.junit.internal.runners.statements.RunAfters.evaluate(RunAfters.java:27)
17-Sep-2021 15:04:13         at org.junit.rules.TestWatcher$1.evaluate(TestWatcher.java:61)
17-Sep-2021 15:04:13         at org.junit.rules.TestWatcher$1.evaluate(TestWatcher.java:61)
17-Sep-2021 15:04:13         at org.junit.runners.ParentRunner$3.evaluate(ParentRunner.java:306)
17-Sep-2021 15:04:13         at org.junit.runners.BlockJUnit4ClassRunner$1.evaluate(BlockJUnit4ClassRunner.java:100)
17-Sep-2021 15:04:13         at org.junit.runners.ParentRunner.runLeaf(ParentRunner.java:366)
17-Sep-2021 15:04:13         at org.junit.runners.BlockJUnit4ClassRunner.runChild(BlockJUnit4ClassRunner.java:103)
17-Sep-2021 15:04:13         at org.junit.runners.BlockJUnit4ClassRunner.runChild(BlockJUnit4ClassRunner.java:63)
17-Sep-2021 15:04:13         at org.junit.runners.ParentRunner$4.run(ParentRunner.java:331)
17-Sep-2021 15:04:13         at org.junit.runners.ParentRunner$1.schedule(ParentRunner.java:79)
17-Sep-2021 15:04:13         at org.junit.runners.ParentRunner.runChildren(ParentRunner.java:329)
17-Sep-2021 15:04:13         at org.junit.runners.ParentRunner.access$100(ParentRunner.java:66)
17-Sep-2021 15:04:13         at org.junit.runners.ParentRunner$2.evaluate(ParentRunner.java:293)
17-Sep-2021 15:04:13         at org.junit.runners.ParentRunner$3.evaluate(ParentRunner.java:306)
17-Sep-2021 15:04:13         at org.junit.runners.ParentRunner.run(ParentRunner.java:413)
17-Sep-2021 15:04:13         at org.apache.maven.surefire.junit4.JUnit4Provider.execute(JUnit4Provider.java:236)
17-Sep-2021 15:04:13         at org.apache.maven.surefire.junit4.JUnit4Provider.executeTestSet(JUnit4Provider.java:134)
17-Sep-2021 15:04:13         at org.apache.maven.surefire.junit4.JUnit4Provider.invoke(JUnit4Provider.java:113)
17-Sep-2021 15:04:13         at sun.reflect.NativeMethodAccessorImpl.invoke0(Native Method)
17-Sep-2021 15:04:13         at sun.reflect.NativeMethodAccessorImpl.invoke(NativeMethodAccessorImpl.java:62)
17-Sep-2021 15:04:13         at sun.reflect.DelegatingMethodAccessorImpl.invoke(DelegatingMethodAccessorImpl.java:43)
17-Sep-2021 15:04:13         at java.lang.reflect.Method.invoke(Method.java:498)
17-Sep-2021 15:04:13         at org.apache.maven.surefire.util.ReflectionUtils.invokeMethodWithArray(ReflectionUtils.java:189)
17-Sep-2021 15:04:13         at org.apache.maven.surefire.booter.ProviderFactory$ProviderProxy.invoke(ProviderFactory.java:165)
17-Sep-2021 15:04:13         at org.apache.maven.surefire.booter.ProviderFactory.invokeProvider(ProviderFactory.java:85)
17-Sep-2021 15:04:13         at org.apache.maven.surefire.booter.ForkedBooter.runSuitesInProcess(ForkedBooter.java:103)
17-Sep-2021 15:04:13         at org.apache.maven.surefire.booter.ForkedBooter.main(ForkedBooter.java:74)
17-Sep-2021 15:04:13 Tests run: 3, Failures: 1, Errors: 2, Skipped: 0, Time elapsed: 0.596 sec <<< FAILURE!
17-Sep-2021 15:04:14 Running org.openmrs.reference.AddUserTest
17-Sep-2021 15:04:14 Tests run: 1, Failures: 1, Errors: 0, Skipped: 0, Time elapsed: 0 sec <<< FAILURE!
17-Sep-2021 15:04:14 Running org.openmrs.reference.AddProviderTest
17-Sep-2021 15:04:14 Tests run: 2, Failures: 1, Errors: 1, Skipped: 0, Time elapsed: 0.04 sec <<< FAILURE!
17-Sep-2021 15:04:14 Running org.openmrs.reference.AddPastVisitTest
17-Sep-2021 15:04:14 Tests run: 1, Failures: 1, Errors: 0, Skipped: 0, Time elapsed: 0.006 sec <<< FAILURE!
17-Sep-2021 15:04:14 Running org.openmrs.reference.RecordMergeIssueTest
17-Sep-2021 15:04:14 Tests run: 2, Failures: 1, Errors: 1, Skipped: 0, Time elapsed: 0.023 sec <<< FAILURE!
17-Sep-2021 15:04:14 Running org.openmrs.reference.CaptureVitalsTest
17-Sep-2021 15:04:14 Tests run: 1, Failures: 1, Errors: 0, Skipped: 0, Time elapsed: 0.005 sec <<< FAILURE!
17-Sep-2021 15:04:14 Running org.openmrs.reference.NamePatientAccentedLetterTest
17-Sep-2021 15:04:14 Tests run: 2, Failures: 1, Errors: 1, Skipped: 0, Time elapsed: 0.007 sec <<< FAILURE!
17-Sep-2021 15:04:14 Running org.openmrs.reference.RetirePersonTest
17-Sep-2021 15:04:14 Tests run: 2, Failures: 1, Errors: 1, Skipped: 0, Time elapsed: 0.055 sec <<< FAILURE!
17-Sep-2021 15:04:14 Running org.openmrs.reference.EndVisitTest
17-Sep-2021 15:04:14 Tests run: 1, Failures: 1, Errors: 0, Skipped: 0, Time elapsed: 0.005 sec <<< FAILURE!
17-Sep-2021 15:04:14 Running org.openmrs.reference.DeleteAppointmentBlockTest
17-Sep-2021 15:04:14 Tests run: 1, Failures: 1, Errors: 0, Skipped: 0, Time elapsed: 0.019 sec <<< FAILURE!
17-Sep-2021 15:04:14 Running org.openmrs.reference.BookRequestAppointmentTest
17-Sep-2021 15:04:14 Tests run: 1, Failures: 1, Errors: 0, Skipped: 0, Time elapsed: 0 sec <<< FAILURE!
17-Sep-2021 15:04:14 Running org.openmrs.reference.AddDeleteServiceTest
17-Sep-2021 15:04:14 Tests run: 1, Failures: 1, Errors: 0, Skipped: 0, Time elapsed: 0.204 sec <<< FAILURE!
17-Sep-2021 15:04:14 Running org.openmrs.reference.AddEditAppointmentBlockTest
17-Sep-2021 15:04:14 Tests run: 1, Failures: 1, Errors: 0, Skipped: 0, Time elapsed: 0 sec <<< FAILURE!
17-Sep-2021 15:04:14 Running org.openmrs.reference.RetireProviderTest
17-Sep-2021 15:04:14 Tests run: 2, Failures: 1, Errors: 1, Skipped: 0, Time elapsed: 0 sec <<< FAILURE!
17-Sep-2021 15:04:14 Running org.openmrs.reference.MergePatientTest
17-Sep-2021 15:04:14 Tests run: 1, Failures: 1, Errors: 0, Skipped: 0, Time elapsed: 0 sec <<< FAILURE!
17-Sep-2021 15:04:14 Running org.openmrs.reference.AddDeleteLocationTest
17-Sep-2021 15:04:14 Tests run: 2, Failures: 1, Errors: 1, Skipped: 0, Time elapsed: 0.001 sec <<< FAILURE!
17-Sep-2021 15:04:14 Running org.openmrs.reference.DuplicatePatientRegisterTest
17-Sep-2021 15:04:14 Tests run: 2, Failures: 1, Errors: 1, Skipped: 0, Time elapsed: 0.001 sec <<< FAILURE!
17-Sep-2021 15:04:14 Running org.openmrs.reference.UsingBackButtonInMergePatientTest
17-Sep-2021 15:04:14 Tests run: 2, Failures: 1, Errors: 1, Skipped: 0, Time elapsed: 0.001 sec <<< FAILURE!
17-Sep-2021 15:04:14 Running org.openmrs.reference.AddDiagnosisToVisitNoteTest
17-Sep-2021 15:04:14 Tests run: 1, Failures: 1, Errors: 0, Skipped: 0, Time elapsed: 0 sec <<< FAILURE!
17-Sep-2021 15:04:14 Running org.openmrs.reference.MergeVisitsTest
17-Sep-2021 15:04:14 Tests run: 2, Failures: 1, Errors: 1, Skipped: 0, Time elapsed: 0 sec <<< FAILURE!
17-Sep-2021 15:04:14 Running org.openmrs.reference.EditServiceTest
17-Sep-2021 15:04:14 Tests run: 1, Failures: 1, Errors: 0, Skipped: 0, Time elapsed: 0 sec <<< FAILURE!
17-Sep-2021 15:04:14 Running org.openmrs.reference.AddNewAllergyTest
17-Sep-2021 15:04:14 Tests run: 1, Failures: 1, Errors: 0, Skipped: 0, Time elapsed: 0.001 sec <<< FAILURE!
17-Sep-2021 15:04:14 Running org.openmrs.reference.LoginTest
17-Sep-2021 15:04:14 Tests run: 5, Failures: 5, Errors: 0, Skipped: 0, Time elapsed: 0.001 sec <<< FAILURE!
17-Sep-2021 15:04:14 Running org.openmrs.reference.DeleteProviderTest
17-Sep-2021 15:04:14 Tests run: 2, Failures: 1, Errors: 1, Skipped: 0, Time elapsed: 0 sec <<< FAILURE!
17-Sep-2021 15:04:14 Running org.openmrs.reference.RegisterPatientTest
17-Sep-2021 15:04:14 Tests run: 2, Failures: 1, Errors: 1, Skipped: 0, Time elapsed: 0 sec <<< FAILURE!
17-Sep-2021 15:04:14 Running org.openmrs.reference.ContactInfoTest
17-Sep-2021 15:04:14 Tests run: 1, Failures: 1, Errors: 0, Skipped: 0, Time elapsed: 0.001 sec <<< FAILURE!
17-Sep-2021 15:04:14 Running org.openmrs.reference.StartVisitTest
17-Sep-2021 15:04:14 Tests run: 1, Failures: 1, Errors: 0, Skipped: 0, Time elapsed: 0 sec <<< FAILURE!
17-Sep-2021 15:04:14 Running org.openmrs.reference.DeletePersonTest
17-Sep-2021 15:04:14 Tests run: 2, Failures: 1, Errors: 1, Skipped: 0, Time elapsed: 0 sec <<< FAILURE!
17-Sep-2021 15:04:14 Running org.openmrs.reference.EditProviderTest
17-Sep-2021 15:04:14 Tests run: 2, Failures: 1, Errors: 1, Skipped: 0, Time elapsed: 0 sec <<< FAILURE!
17-Sep-2021 15:04:14 Running org.openmrs.reference.RetireVisitTypeTest
17-Sep-2021 15:04:14 Tests run: 2, Failures: 1, Errors: 1, Skipped: 0, Time elapsed: 0 sec <<< FAILURE!
17-Sep-2021 15:04:14
17-Sep-2021 15:04:14 Results :
17-Sep-2021 15:04:14
17-Sep-2021 15:04:14 Failed tests:   findPatientByNameTest(org.openmrs.reference.FindPatientByNameTest): Test killed due to server failure
17-Sep-2021 15:04:14   addUserTest(org.openmrs.reference.AddUserTest): Test killed due to server failure
17-Sep-2021 15:04:14   addProviderTest(org.openmrs.reference.AddProviderTest): Test killed due to server failure
17-Sep-2021 15:04:14   addPastVisitTest(org.openmrs.reference.AddPastVisitTest): Test killed due to server failure
17-Sep-2021 15:04:14   recordMergeIssueTest(org.openmrs.reference.RecordMergeIssueTest): Test killed due to server failure
17-Sep-2021 15:04:14   captureVitalsTest(org.openmrs.reference.CaptureVitalsTest): Test killed due to server failure
17-Sep-2021 15:04:14   namePatientAccentedLetterTest(org.openmrs.reference.NamePatientAccentedLetterTest): Test killed due to server failure
17-Sep-2021 15:04:14   retirePersonTest(org.openmrs.reference.RetirePersonTest): Test killed due to server failure
17-Sep-2021 15:04:14   endVisitTest(org.openmrs.reference.EndVisitTest): Test killed due to server failure
17-Sep-2021 15:04:14   deleteAppointmentBlockTest(org.openmrs.reference.DeleteAppointmentBlockTest): Test killed due to server failure
17-Sep-2021 15:04:14   bookRequestAppointmentTest(org.openmrs.reference.BookRequestAppointmentTest): Test killed due to server failure
17-Sep-2021 15:04:14   addDeleteServiceTest(org.openmrs.reference.AddDeleteServiceTest): Test killed due to server failure
17-Sep-2021 15:04:14   addEditAppointmentBlockTest(org.openmrs.reference.AddEditAppointmentBlockTest): Test killed due to server failure
17-Sep-2021 15:04:14   retireProviderTest(org.openmrs.reference.RetireProviderTest): Test killed due to server failure
17-Sep-2021 15:04:14   mergePatientTest(org.openmrs.reference.MergePatientTest): Test killed due to server failure
17-Sep-2021 15:04:14   addLocationTest(org.openmrs.reference.AddDeleteLocationTest): Test killed due to server failure
17-Sep-2021 15:04:14   duplicatePatientRegisterTest(org.openmrs.reference.DuplicatePatientRegisterTest): Test killed due to server failure
17-Sep-2021 15:04:14   usingBackButtonInMergePatientTest(org.openmrs.reference.UsingBackButtonInMergePatientTest): Test killed due to server failure
17-Sep-2021 15:04:14   addDiagnosisToVisitNoteTest(org.openmrs.reference.AddDiagnosisToVisitNoteTest): Test killed due to server failure
17-Sep-2021 15:04:14   mergeVisitsTest(org.openmrs.reference.MergeVisitsTest): Test killed due to server failure
17-Sep-2021 15:04:14   editServiceTest(org.openmrs.reference.EditServiceTest): Test killed due to server failure
17-Sep-2021 15:04:14   addNewAllergyTest(org.openmrs.reference.AddNewAllergyTest): Test killed due to server failure
17-Sep-2021 15:04:14   verifyNurseModulesAvailableOnHomePage(org.openmrs.reference.LoginTest): Test killed due to server failure
17-Sep-2021 15:04:14   verifyModulesAvailableOnHomePage(org.openmrs.reference.LoginTest): Test killed due to server failure
17-Sep-2021 15:04:14   verifySysadminModulesAvailableOnHomePage(org.openmrs.reference.LoginTest): Test killed due to server failure
17-Sep-2021 15:04:14   verifyClerkModulesAvailableOnHomePage(org.openmrs.reference.LoginTest): Test killed due to server failure
17-Sep-2021 15:04:14   verifyDoctorModulesAvailableOnHomePage(org.openmrs.reference.LoginTest): Test killed due to server failure
17-Sep-2021 15:04:14   deleteProviderTest(org.openmrs.reference.DeleteProviderTest): Test killed due to server failure
17-Sep-2021 15:04:14   registerPatientTest(org.openmrs.reference.RegisterPatientTest): Test killed due to server failure
17-Sep-2021 15:04:14   contactInfoTest(org.openmrs.reference.ContactInfoTest): Test killed due to server failure
17-Sep-2021 15:04:14   startVisitTest(org.openmrs.reference.StartVisitTest): Test killed due to server failure
17-Sep-2021 15:04:14   deletePersonTest(org.openmrs.reference.DeletePersonTest): Test killed due to server failure
17-Sep-2021 15:04:14   editProviderTest(org.openmrs.reference.EditProviderTest): Test killed due to server failure
17-Sep-2021 15:04:14   retireVisitTypeTest(org.openmrs.reference.RetireVisitTypeTest): Test killed due to server failure
17-Sep-2021 15:04:14
17-Sep-2021 15:04:14 Tests in error:
17-Sep-2021 15:04:14   findPatientByNameTest(org.openmrs.reference.FindPatientByNameTest)
17-Sep-2021 15:04:14   findPatientByNameTest(org.openmrs.reference.FindPatientByNameTest): Session ID is null. Using WebDriver after calling quit()?(..)
17-Sep-2021 15:04:14   addProviderTest(org.openmrs.reference.AddProviderTest): Delete request failed: https://qa-refapp.openmrs.org/openmrs/ws/rest/v1/person/null?purge=true
17-Sep-2021 15:04:14   recordMergeIssueTest(org.openmrs.reference.RecordMergeIssueTest)
17-Sep-2021 15:04:14   namePatientAccentedLetterTest(org.openmrs.reference.NamePatientAccentedLetterTest)
17-Sep-2021 15:04:14   retirePersonTest(org.openmrs.reference.RetirePersonTest): Delete request failed: https://qa-refapp.openmrs.org/openmrs/ws/rest/v1/person/null?purge=true
17-Sep-2021 15:04:14   retireProviderTest(org.openmrs.reference.RetireProviderTest): Delete request failed: https://qa-refapp.openmrs.org/openmrs/ws/rest/v1/provider/null?purge=true
17-Sep-2021 15:04:14   addLocationTest(org.openmrs.reference.AddDeleteLocationTest): Delete request failed: https://qa-refapp.openmrs.org/openmrs/ws/rest/v1//locationtag/null?purge=true
17-Sep-2021 15:04:14   duplicatePatientRegisterTest(org.openmrs.reference.DuplicatePatientRegisterTest)
17-Sep-2021 15:04:14   usingBackButtonInMergePatientTest(org.openmrs.reference.UsingBackButtonInMergePatientTest)
17-Sep-2021 15:04:14   mergeVisitsTest(org.openmrs.reference.MergeVisitsTest)
17-Sep-2021 15:04:14   deleteProviderTest(org.openmrs.reference.DeleteProviderTest): Delete request failed: https://qa-refapp.openmrs.org/openmrs/ws/rest/v1/provider/null?purge=true
17-Sep-2021 15:04:14   registerPatientTest(org.openmrs.reference.RegisterPatientTest)
17-Sep-2021 15:04:14   deletePersonTest(org.openmrs.reference.DeletePersonTest): Delete request failed: https://qa-refapp.openmrs.org/openmrs/ws/rest/v1/person/null?purge=true
17-Sep-2021 15:04:14   editProviderTest(org.openmrs.reference.EditProviderTest): Delete request failed: https://qa-refapp.openmrs.org/openmrs/ws/rest/v1/provider/null?purge=true
17-Sep-2021 15:04:14   retireVisitTypeTest(org.openmrs.reference.RetireVisitTypeTest): Delete request failed: https://qa-refapp.openmrs.org/openmrs/ws/rest/v1/visittype/null?purge=true
17-Sep-2021 15:04:14
17-Sep-2021 15:04:14 Tests run: 74, Failures: 34, Errors: 16, Skipped: 0
17-Sep-2021 15:04:14
17-Sep-2021 15:04:14 [INFO] ------------------------------------------------------------------------
17-Sep-2021 15:04:14 [INFO] Reactor Summary:
17-Sep-2021 15:04:14 [INFO]
17-Sep-2021 15:04:14 [INFO] Reference Application Distribution ................. SUCCESS [  0.599 s]
17-Sep-2021 15:04:14 [INFO] Reference Application Distribution Package ......... SUCCESS [ 34.081 s]
17-Sep-2021 15:04:14 [INFO] Reference Application Distribution UI Tests ........ FAILURE [03:53 min]
17-Sep-2021 15:04:14 [INFO] ------------------------------------------------------------------------
17-Sep-2021 15:04:14 [INFO] BUILD FAILURE
17-Sep-2021 15:04:14 [INFO] ------------------------------------------------------------------------
17-Sep-2021 15:04:14 [INFO] Total time: 04:28 min
17-Sep-2021 15:04:14 [INFO] Finished at: 2021-09-17T15:04:14+00:00
17-Sep-2021 15:04:15 [INFO] Final Memory: 63M/361M
17-Sep-2021 15:04:15 [INFO] ------------------------------------------------------------------------
17-Sep-2021 15:04:15 [ERROR] Failed to execute goal org.apache.maven.plugins:maven-surefire-plugin:2.12:test (default-test) on project referenceapplication-ui-tests: There are test failures.
17-Sep-2021 15:04:15 [ERROR]
17-Sep-2021 15:04:15 [ERROR] Please refer to /home/bamboo-agent/bamboo-agent/xml-data/build-dir/REFAPP-UI-FRAMEWORK/ui-tests/target/surefire-reports for the individual test results.
17-Sep-2021 15:04:15 [ERROR] -> [Help 1]
17-Sep-2021 15:04:15 org.apache.maven.lifecycle.LifecycleExecutionException: Failed to execute goal org.apache.maven.plugins:maven-surefire-plugin:2.12:test (default-test) on project referenceapplication-ui-tests: There are test failures.
17-Sep-2021 15:04:15
17-Sep-2021 15:04:15 Please refer to /home/bamboo-agent/bamboo-agent/xml-data/build-dir/REFAPP-UI-FRAMEWORK/ui-tests/target/surefire-reports for the individual test results.
17-Sep-2021 15:04:15         at org.apache.maven.lifecycle.internal.MojoExecutor.execute(MojoExecutor.java:212)
17-Sep-2021 15:04:15         at org.apache.maven.lifecycle.internal.MojoExecutor.execute(MojoExecutor.java:153)
17-Sep-2021 15:04:15         at org.apache.maven.lifecycle.internal.MojoExecutor.execute(MojoExecutor.java:145)
17-Sep-2021 15:04:15         at org.apache.maven.lifecycle.internal.LifecycleModuleBuilder.buildProject(LifecycleModuleBuilder.java:116)
17-Sep-2021 15:04:15         at org.apache.maven.lifecycle.internal.LifecycleModuleBuilder.buildProject(LifecycleModuleBuilder.java:80)
17-Sep-2021 15:04:15         at org.apache.maven.lifecycle.internal.builder.singlethreaded.SingleThreadedBuilder.build(SingleThreadedBuilder.java:51)
17-Sep-2021 15:04:15         at org.apache.maven.lifecycle.internal.LifecycleStarter.execute(LifecycleStarter.java:128)
17-Sep-2021 15:04:15         at org.apache.maven.DefaultMaven.doExecute(DefaultMaven.java:307)
17-Sep-2021 15:04:15         at org.apache.maven.DefaultMaven.doExecute(DefaultMaven.java:193)
17-Sep-2021 15:04:15         at org.apache.maven.DefaultMaven.execute(DefaultMaven.java:106)
17-Sep-2021 15:04:15         at org.apache.maven.cli.MavenCli.execute(MavenCli.java:863)
17-Sep-2021 15:04:15         at org.apache.maven.cli.MavenCli.doMain(MavenCli.java:288)
17-Sep-2021 15:04:15         at org.apache.maven.cli.MavenCli.main(MavenCli.java:199)
17-Sep-2021 15:04:15         at sun.reflect.NativeMethodAccessorImpl.invoke0(Native Method)
17-Sep-2021 15:04:15         at sun.reflect.NativeMethodAccessorImpl.invoke(NativeMethodAccessorImpl.java:62)
17-Sep-2021 15:04:15         at sun.reflect.DelegatingMethodAccessorImpl.invoke(DelegatingMethodAccessorImpl.java:43)
17-Sep-2021 15:04:15         at java.lang.reflect.Method.invoke(Method.java:498)
17-Sep-2021 15:04:15         at org.codehaus.plexus.classworlds.launcher.Launcher.launchEnhanced(Launcher.java:289)
17-Sep-2021 15:04:15         at org.codehaus.plexus.classworlds.launcher.Launcher.launch(Launcher.java:229)
17-Sep-2021 15:04:15         at org.codehaus.plexus.classworlds.launcher.Launcher.mainWithExitCode(Launcher.java:415)
17-Sep-2021 15:04:15         at org.codehaus.plexus.classworlds.launcher.Launcher.main(Launcher.java:356)
17-Sep-2021 15:04:15 Caused by: org.apache.maven.plugin.MojoFailureException: There are test failures.
17-Sep-2021 15:04:15
17-Sep-2021 15:04:15 Please refer to /home/bamboo-agent/bamboo-agent/xml-data/build-dir/REFAPP-UI-FRAMEWORK/ui-tests/target/surefire-reports for the individual test results.
17-Sep-2021 15:04:15         at org.apache.maven.plugin.surefire.SurefireHelper.reportExecution(SurefireHelper.java:83)
17-Sep-2021 15:04:15         at org.apache.maven.plugin.surefire.SurefirePlugin.writeSummary(SurefirePlugin.java:673)
17-Sep-2021 15:04:15         at org.apache.maven.plugin.surefire.SurefirePlugin.handleSummary(SurefirePlugin.java:647)
17-Sep-2021 15:04:15         at org.apache.maven.plugin.surefire.AbstractSurefireMojo.executeAfterPreconditionsChecked(AbstractSurefireMojo.java:137)
17-Sep-2021 15:04:15         at org.apache.maven.plugin.surefire.AbstractSurefireMojo.execute(AbstractSurefireMojo.java:98)
17-Sep-2021 15:04:15         at org.apache.maven.plugin.DefaultBuildPluginManager.executeMojo(DefaultBuildPluginManager.java:134)
17-Sep-2021 15:04:15         at org.apache.maven.lifecycle.internal.MojoExecutor.execute(MojoExecutor.java:207)
17-Sep-2021 15:04:15         ... 20 more
17-Sep-2021 15:04:15 [ERROR]
17-Sep-2021 15:04:15 [ERROR] Re-run Maven using the -X switch to enable full debug logging.
17-Sep-2021 15:04:15 [ERROR]
17-Sep-2021 15:04:15 [ERROR] For more information about the errors and possible solutions, please read the following articles:
17-Sep-2021 15:04:15 [ERROR] [Help 1] http://cwiki.apache.org/confluence/display/MAVEN/MojoFailureException
17-Sep-2021 15:04:15 [ERROR]
17-Sep-2021 15:04:15 [ERROR] After correcting the problems, you can resume the build with the command
17-Sep-2021 15:04:15 [ERROR]   mvn <goals> -rf :referenceapplication-ui-tests
17-Sep-2021 15:04:15 Failing task since return code of [/usr/share/apache-maven-3.3.9/bin/mvn --batch-mode -Djava.io.tmpdir=/home/bamboo-agent/bamboo-agent/.agent_tmp/REFAPP-UI-FRAMEWORK clean install -DskipTests=false -e] was 1 while expected 0
17-Sep-2021 15:04:15 Parsing test results under /home/bamboo-agent/bamboo-agent/xml-data/build-dir/REFAPP-UI-FRAMEWORK...
17-Sep-2021 15:04:16 Finished task 'Build distribution' with result: Failed
17-Sep-2021 15:04:16 Running post build plugin 'Docker Container Cleanup'
17-Sep-2021 15:04:16 Running post build plugin 'NCover Results Collector'
17-Sep-2021 15:04:16 Running post build plugin 'Clover Results Collector'
17-Sep-2021 15:04:16 Running post build plugin 'Sauce OnDemand Post Runner'
17-Sep-2021 15:04:16 Running post build plugin 'npm Cache Cleanup'
17-Sep-2021 15:04:16 Running post build plugin 'Artifact Copier'
17-Sep-2021 15:04:16 Finalising the build...
17-Sep-2021 15:04:16 Stopping timer.
17-Sep-2021 15:04:16 Build REFAPP-UI-FRAMEWORK-568 completed.
17-Sep-2021 15:04:17 Running on server: post build plugin 'NCover Results Collector'
17-Sep-2021 15:04:17 Running on server: post build plugin 'Build Hanging Detection Configuration'
17-Sep-2021 15:04:17 Running on server: post build plugin 'Clover Delta Calculator'
17-Sep-2021 15:04:17 Running on server: post build plugin 'Maven Dependencies Postprocessor'
17-Sep-2021 15:04:17 All post build plugins have finished
17-Sep-2021 15:04:17 Generating build results summary...
17-Sep-2021 15:04:17 Saving build results to disk...
17-Sep-2021 15:04:17 Logging substituted variables...
17-Sep-2021 15:04:17 Indexing build results...
17-Sep-2021 15:04:17 Finished building REFAPP-UI-FRAMEWORK-568.