UI tests for the reference application

Build: #571 failed

Job: Run QA UI Tests failed

Stages & jobs

  1. Ref App UI Testing

Build log

The build generated 1,200 lines of output.The output is too long and has been truncated to the last 1,000 lines. Download or view full build log

18-Sep-2021 02:00:52 [INFO] Configured Artifact: org.openmrs.module:legacyui-omod:1.8.3:jar
18-Sep-2021 02:00:52 [INFO] Configured Artifact: org.openmrs.module:openconceptlab-omod:1.2.6:jar
18-Sep-2021 02:00:52 [INFO] Configured Artifact: org.openmrs.module:metadatadeploy-omod:1.13.0:jar
18-Sep-2021 02:00:52 [INFO] Configured Artifact: org.openmrs.module:reportingrest-omod:1.12.0:jar
18-Sep-2021 02:00:52 [INFO] Configured Artifact: org.openmrs.module:owa-omod:1.13.0:jar
18-Sep-2021 02:00:52 [INFO] Configured Artifact: org.openmrs.module:fhir2-omod:1.2.2:jar
18-Sep-2021 02:00:52 [INFO] Configured Artifact: org.openmrs.module:serialization.xstream-omod:0.2.15:omod
18-Sep-2021 02:00:52 [INFO] Configured Artifact: org.openmrs.module:registrationapp-omod:1.24.0:jar
18-Sep-2021 02:00:52 [INFO] Configured Artifact: org.openmrs:event-omod:2.10.0-SNAPSHOT:jar
18-Sep-2021 02:00:52 [INFO] Downloading: http://mavenrepo.openmrs.org/nexus/content/repositories/public/org/openmrs/event-omod/2.10.0-SNAPSHOT/maven-metadata.xml
18-Sep-2021 02:00:54 [INFO] Downloaded: http://mavenrepo.openmrs.org/nexus/content/repositories/public/org/openmrs/event-omod/2.10.0-SNAPSHOT/maven-metadata.xml (987 B at 0.5 KB/sec)
18-Sep-2021 02:00:54 [INFO] Downloading: http://mavenrepo.openmrs.org/nexus/content/repositories/public/org/openmrs/event-omod/2.10.0-SNAPSHOT/event-omod-2.10.0-20210702.124301-3.jar
18-Sep-2021 02:01:11 [INFO] Downloaded: http://mavenrepo.openmrs.org/nexus/content/repositories/public/org/openmrs/event-omod/2.10.0-SNAPSHOT/event-omod-2.10.0-20210702.124301-3.jar (4666 KB at 280.9 KB/sec)
18-Sep-2021 02:01:11 [INFO] Configured Artifact: org.openmrs.module:uilibrary-omod:2.0.7:jar
18-Sep-2021 02:01:11 [INFO] Configured Artifact: org.openmrs.module:htmlwidgets-omod:1.10.0:jar
18-Sep-2021 02:01:11 [INFO] Configured Artifact: org.openmrs.module:dataexchange-omod:1.3.7:jar
18-Sep-2021 02:01:11 [INFO] Configured Artifact: org.openmrs.module:appui-omod:1.14.0:jar
18-Sep-2021 02:01:11 [INFO] Configured Artifact: org.openmrs.module:allergyui-omod:1.8.4:jar
18-Sep-2021 02:01:11 [INFO] Configured Artifact: org.openmrs.module:providermanagement-omod:2.13.0:jar
18-Sep-2021 02:01:11 [INFO] Configured Artifact: org.openmrs.module:appointmentschedulingui-omod:1.12.0:jar
18-Sep-2021 02:01:11 [INFO] Configured Artifact: org.openmrs.module:attachments-omod:2.5.0:jar
18-Sep-2021 02:01:11 [INFO] Configured Artifact: org.openmrs.module:formentryapp-omod:1.4.2:jar
18-Sep-2021 02:01:11 [INFO] Configured Artifact: org.openmrs.module:idgen-omod:4.7.0:jar
18-Sep-2021 02:01:11 [INFO] Configured Artifact: org.openmrs.module:metadatamapping-omod:1.4.0:jar
18-Sep-2021 02:01:11 [INFO] Configured Artifact: org.openmrs.module:htmlformentryui-omod:2.0.0:jar
18-Sep-2021 02:01:11 [INFO] Configured Artifact: org.openmrs.module:referencedemodata-omod:1.4.7:jar
18-Sep-2021 02:01:12 [INFO] Configured Artifact: org.openmrs.module:emrapi-omod:1.32.0:jar
18-Sep-2021 02:01:12 [INFO] Configured Artifact: org.openmrs.module:referenceapplication-omod:2.12.0-SNAPSHOT:jar
18-Sep-2021 02:01:12 [INFO] Downloading: http://mavenrepo.openmrs.org/nexus/content/repositories/public/org/openmrs/module/referenceapplication-omod/2.12.0-SNAPSHOT/maven-metadata.xml
18-Sep-2021 02:01:12 [INFO] Downloaded: http://mavenrepo.openmrs.org/nexus/content/repositories/public/org/openmrs/module/referenceapplication-omod/2.12.0-SNAPSHOT/maven-metadata.xml (802 B at 1.2 KB/sec)
18-Sep-2021 02:01:12 [INFO] Downloading: http://mavenrepo.openmrs.org/nexus/content/repositories/public/org/openmrs/module/referenceapplication-omod/2.12.0-SNAPSHOT/referenceapplication-omod-2.12.0-20210916.160538-271.jar
18-Sep-2021 02:01:17 [INFO] Downloaded: http://mavenrepo.openmrs.org/nexus/content/repositories/public/org/openmrs/module/referenceapplication-omod/2.12.0-SNAPSHOT/referenceapplication-omod-2.12.0-20210916.160538-271.jar (1902 KB at 435.4 KB/sec)
18-Sep-2021 02:01:17 [INFO] Configured Artifact: org.openmrs.module:htmlformentry-omod:4.1.0:jar
18-Sep-2021 02:01:17 [INFO] Configured Artifact: org.openmrs.module:appframework-omod:2.16.0:jar
18-Sep-2021 02:01:17 [INFO] Configured Artifact: org.openmrs.module:referencemetadata-omod:2.12.0:jar
18-Sep-2021 02:01:17 [INFO] Configured Artifact: org.openmrs.module:reportingui-omod:1.8.0:jar
18-Sep-2021 02:01:17 [INFO] Configured Artifact: org.openmrs.module:coreapps-omod:1.34.0-SNAPSHOT:jar
18-Sep-2021 02:01:17 [INFO] Downloading: http://mavenrepo.openmrs.org/nexus/content/repositories/public/org/openmrs/module/coreapps-omod/1.34.0-SNAPSHOT/maven-metadata.xml
18-Sep-2021 02:01:17 [INFO] Downloaded: http://mavenrepo.openmrs.org/nexus/content/repositories/public/org/openmrs/module/coreapps-omod/1.34.0-SNAPSHOT/maven-metadata.xml (787 B at 1.2 KB/sec)
18-Sep-2021 02:01:17 [INFO] Downloading: http://mavenrepo.openmrs.org/nexus/content/repositories/public/org/openmrs/module/coreapps-omod/1.34.0-SNAPSHOT/coreapps-omod-1.34.0-20210916.134244-36.jar
18-Sep-2021 02:01:27 [INFO] Downloaded: http://mavenrepo.openmrs.org/nexus/content/repositories/public/org/openmrs/module/coreapps-omod/1.34.0-SNAPSHOT/coreapps-omod-1.34.0-20210916.134244-36.jar (3859 KB at 413.9 KB/sec)
18-Sep-2021 02:01:27 [INFO] Configured Artifact: org.openmrs.module:reportingcompatibility-omod:2.0.8:jar
18-Sep-2021 02:01:27 [INFO] Configured Artifact: org.openmrs.module:reporting-omod:1.23.0:jar
18-Sep-2021 02:01:27 [INFO] Configured Artifact: org.openmrs.module:adminui-omod:1.5.0:jar
18-Sep-2021 02:01:27 [INFO] Configured Artifact: org.openmrs.module:registrationcore-omod:1.11.0:jar
18-Sep-2021 02:01:27 [INFO] Configured Artifact: org.openmrs.module:appointmentscheduling-omod:1.16.0:jar
18-Sep-2021 02:01:27 [INFO] Configured Artifact: org.openmrs.module:atlas-omod:2.2.5:omod
18-Sep-2021 02:01:27 [INFO] Configured Artifact: org.openmrs.module:calculation-omod:1.3.0:jar
18-Sep-2021 02:01:27 [INFO] Configured Artifact: org.openmrs.module:webservices.rest-omod:2.32.0-SNAPSHOT:jar
18-Sep-2021 02:01:27 [INFO] Downloading: http://mavenrepo.openmrs.org/nexus/content/repositories/public/org/openmrs/module/webservices.rest-omod/2.32.0-SNAPSHOT/maven-metadata.xml
18-Sep-2021 02:01:28 [INFO] Downloaded: http://mavenrepo.openmrs.org/nexus/content/repositories/public/org/openmrs/module/webservices.rest-omod/2.32.0-SNAPSHOT/maven-metadata.xml (1009 B at 0.9 KB/sec)
18-Sep-2021 02:01:28 [INFO] Downloading: http://mavenrepo.openmrs.org/nexus/content/repositories/public/org/openmrs/module/webservices.rest-omod/2.32.0-SNAPSHOT/webservices.rest-omod-2.32.0-20210916.132343-69.jar
18-Sep-2021 02:01:40 [INFO] Downloaded: http://mavenrepo.openmrs.org/nexus/content/repositories/public/org/openmrs/module/webservices.rest-omod/2.32.0-SNAPSHOT/webservices.rest-omod-2.32.0-20210916.132343-69.jar (6750 KB at 570.4 KB/sec)
18-Sep-2021 02:01:40 [INFO] Configured Artifact: org.openmrs.module:spa-omod:1.0.8:jar
18-Sep-2021 02:01:40 [INFO] Configured Artifact: org.openmrs.module:uicommons-omod:2.18.0:jar
18-Sep-2021 02:01:40 [INFO] Configured Artifact: org.openmrs.module:uiframework-omod:3.21.0:jar
18-Sep-2021 02:01:40 [INFO] Configured Artifact: org.openmrs.module:metadatasharing-omod:1.8.0:jar
18-Sep-2021 02:01:40 [INFO] Copying addresshierarchy-omod-2.14.2.jar to /home/bamboo-agent/bamboo-agent/xml-data/build-dir/REFAPP-UI-FRAMEWORK/package/target/distro/web/modules/addresshierarchy-2.14.2.omod
18-Sep-2021 02:01:40 [INFO] Copying legacyui-omod-1.8.3.jar to /home/bamboo-agent/bamboo-agent/xml-data/build-dir/REFAPP-UI-FRAMEWORK/package/target/distro/web/modules/legacyui-1.8.3.omod
18-Sep-2021 02:01:40 [INFO] Copying openconceptlab-omod-1.2.6.jar to /home/bamboo-agent/bamboo-agent/xml-data/build-dir/REFAPP-UI-FRAMEWORK/package/target/distro/web/modules/openconceptlab-1.2.6.omod
18-Sep-2021 02:01:40 [INFO] Copying metadatadeploy-omod-1.13.0.jar to /home/bamboo-agent/bamboo-agent/xml-data/build-dir/REFAPP-UI-FRAMEWORK/package/target/distro/web/modules/metadatadeploy-1.13.0.omod
18-Sep-2021 02:01:40 [INFO] Copying reportingrest-omod-1.12.0.jar to /home/bamboo-agent/bamboo-agent/xml-data/build-dir/REFAPP-UI-FRAMEWORK/package/target/distro/web/modules/reportingrest-1.12.0.omod
18-Sep-2021 02:01:40 [INFO] Copying owa-omod-1.13.0.jar to /home/bamboo-agent/bamboo-agent/xml-data/build-dir/REFAPP-UI-FRAMEWORK/package/target/distro/web/modules/owa-1.13.0.omod
18-Sep-2021 02:01:40 [INFO] Copying fhir2-omod-1.2.2.jar to /home/bamboo-agent/bamboo-agent/xml-data/build-dir/REFAPP-UI-FRAMEWORK/package/target/distro/web/modules/fhir2-1.2.2.omod
18-Sep-2021 02:01:42 [INFO] Copying serialization.xstream-omod-0.2.15.omod to /home/bamboo-agent/bamboo-agent/xml-data/build-dir/REFAPP-UI-FRAMEWORK/package/target/distro/web/modules/serialization.xstream-0.2.15.omod
18-Sep-2021 02:01:42 [INFO] Copying registrationapp-omod-1.24.0.jar to /home/bamboo-agent/bamboo-agent/xml-data/build-dir/REFAPP-UI-FRAMEWORK/package/target/distro/web/modules/registrationapp-1.24.0.omod
18-Sep-2021 02:01:42 [INFO] Copying event-omod-2.10.0-SNAPSHOT.jar to /home/bamboo-agent/bamboo-agent/xml-data/build-dir/REFAPP-UI-FRAMEWORK/package/target/distro/web/modules/event-2.10.0-SNAPSHOT.omod
18-Sep-2021 02:01:42 [INFO] Copying uilibrary-omod-2.0.7.jar to /home/bamboo-agent/bamboo-agent/xml-data/build-dir/REFAPP-UI-FRAMEWORK/package/target/distro/web/modules/uilibrary-2.0.7.omod
18-Sep-2021 02:01:42 [INFO] Copying htmlwidgets-omod-1.10.0.jar to /home/bamboo-agent/bamboo-agent/xml-data/build-dir/REFAPP-UI-FRAMEWORK/package/target/distro/web/modules/htmlwidgets-1.10.0.omod
18-Sep-2021 02:01:42 [INFO] Copying dataexchange-omod-1.3.7.jar to /home/bamboo-agent/bamboo-agent/xml-data/build-dir/REFAPP-UI-FRAMEWORK/package/target/distro/web/modules/dataexchange-1.3.7.omod
18-Sep-2021 02:01:42 [INFO] Copying appui-omod-1.14.0.jar to /home/bamboo-agent/bamboo-agent/xml-data/build-dir/REFAPP-UI-FRAMEWORK/package/target/distro/web/modules/appui-1.14.0.omod
18-Sep-2021 02:01:42 [INFO] Copying allergyui-omod-1.8.4.jar to /home/bamboo-agent/bamboo-agent/xml-data/build-dir/REFAPP-UI-FRAMEWORK/package/target/distro/web/modules/allergyui-1.8.4.omod
18-Sep-2021 02:01:42 [INFO] Copying providermanagement-omod-2.13.0.jar to /home/bamboo-agent/bamboo-agent/xml-data/build-dir/REFAPP-UI-FRAMEWORK/package/target/distro/web/modules/providermanagement-2.13.0.omod
18-Sep-2021 02:01:42 [INFO] Copying appointmentschedulingui-omod-1.12.0.jar to /home/bamboo-agent/bamboo-agent/xml-data/build-dir/REFAPP-UI-FRAMEWORK/package/target/distro/web/modules/appointmentschedulingui-1.12.0.omod
18-Sep-2021 02:01:43 [INFO] Copying attachments-omod-2.5.0.jar to /home/bamboo-agent/bamboo-agent/xml-data/build-dir/REFAPP-UI-FRAMEWORK/package/target/distro/web/modules/attachments-2.5.0.omod
18-Sep-2021 02:01:43 [INFO] Copying formentryapp-omod-1.4.2.jar to /home/bamboo-agent/bamboo-agent/xml-data/build-dir/REFAPP-UI-FRAMEWORK/package/target/distro/web/modules/formentryapp-1.4.2.omod
18-Sep-2021 02:01:43 [INFO] Copying idgen-omod-4.7.0.jar to /home/bamboo-agent/bamboo-agent/xml-data/build-dir/REFAPP-UI-FRAMEWORK/package/target/distro/web/modules/idgen-4.7.0.omod
18-Sep-2021 02:01:43 [INFO] Copying metadatamapping-omod-1.4.0.jar to /home/bamboo-agent/bamboo-agent/xml-data/build-dir/REFAPP-UI-FRAMEWORK/package/target/distro/web/modules/metadatamapping-1.4.0.omod
18-Sep-2021 02:01:43 [INFO] Copying htmlformentryui-omod-2.0.0.jar to /home/bamboo-agent/bamboo-agent/xml-data/build-dir/REFAPP-UI-FRAMEWORK/package/target/distro/web/modules/htmlformentryui-2.0.0.omod
18-Sep-2021 02:01:43 [INFO] Copying referencedemodata-omod-1.4.7.jar to /home/bamboo-agent/bamboo-agent/xml-data/build-dir/REFAPP-UI-FRAMEWORK/package/target/distro/web/modules/referencedemodata-1.4.7.omod
18-Sep-2021 02:01:43 [INFO] Copying emrapi-omod-1.32.0.jar to /home/bamboo-agent/bamboo-agent/xml-data/build-dir/REFAPP-UI-FRAMEWORK/package/target/distro/web/modules/emrapi-1.32.0.omod
18-Sep-2021 02:01:43 [INFO] Copying referenceapplication-omod-2.12.0-SNAPSHOT.jar to /home/bamboo-agent/bamboo-agent/xml-data/build-dir/REFAPP-UI-FRAMEWORK/package/target/distro/web/modules/referenceapplication-2.12.0-SNAPSHOT.omod
18-Sep-2021 02:01:43 [INFO] Copying htmlformentry-omod-4.1.0.jar to /home/bamboo-agent/bamboo-agent/xml-data/build-dir/REFAPP-UI-FRAMEWORK/package/target/distro/web/modules/htmlformentry-4.1.0.omod
18-Sep-2021 02:01:44 [INFO] Copying appframework-omod-2.16.0.jar to /home/bamboo-agent/bamboo-agent/xml-data/build-dir/REFAPP-UI-FRAMEWORK/package/target/distro/web/modules/appframework-2.16.0.omod
18-Sep-2021 02:01:44 [INFO] Copying referencemetadata-omod-2.12.0.jar to /home/bamboo-agent/bamboo-agent/xml-data/build-dir/REFAPP-UI-FRAMEWORK/package/target/distro/web/modules/referencemetadata-2.12.0.omod
18-Sep-2021 02:01:44 [INFO] Copying reportingui-omod-1.8.0.jar to /home/bamboo-agent/bamboo-agent/xml-data/build-dir/REFAPP-UI-FRAMEWORK/package/target/distro/web/modules/reportingui-1.8.0.omod
18-Sep-2021 02:01:44 [INFO] Copying coreapps-omod-1.34.0-SNAPSHOT.jar to /home/bamboo-agent/bamboo-agent/xml-data/build-dir/REFAPP-UI-FRAMEWORK/package/target/distro/web/modules/coreapps-1.34.0-SNAPSHOT.omod
18-Sep-2021 02:01:44 [INFO] Copying reportingcompatibility-omod-2.0.8.jar to /home/bamboo-agent/bamboo-agent/xml-data/build-dir/REFAPP-UI-FRAMEWORK/package/target/distro/web/modules/reportingcompatibility-2.0.8.omod
18-Sep-2021 02:01:44 [INFO] Copying reporting-omod-1.23.0.jar to /home/bamboo-agent/bamboo-agent/xml-data/build-dir/REFAPP-UI-FRAMEWORK/package/target/distro/web/modules/reporting-1.23.0.omod
18-Sep-2021 02:01:45 [INFO] Copying adminui-omod-1.5.0.jar to /home/bamboo-agent/bamboo-agent/xml-data/build-dir/REFAPP-UI-FRAMEWORK/package/target/distro/web/modules/adminui-1.5.0.omod
18-Sep-2021 02:01:45 [INFO] Copying registrationcore-omod-1.11.0.jar to /home/bamboo-agent/bamboo-agent/xml-data/build-dir/REFAPP-UI-FRAMEWORK/package/target/distro/web/modules/registrationcore-1.11.0.omod
18-Sep-2021 02:01:45 [INFO] Copying appointmentscheduling-omod-1.16.0.jar to /home/bamboo-agent/bamboo-agent/xml-data/build-dir/REFAPP-UI-FRAMEWORK/package/target/distro/web/modules/appointmentscheduling-1.16.0.omod
18-Sep-2021 02:01:45 [INFO] Copying atlas-omod-2.2.5.omod to /home/bamboo-agent/bamboo-agent/xml-data/build-dir/REFAPP-UI-FRAMEWORK/package/target/distro/web/modules/atlas-2.2.5.omod
18-Sep-2021 02:01:45 [INFO] Copying calculation-omod-1.3.0.jar to /home/bamboo-agent/bamboo-agent/xml-data/build-dir/REFAPP-UI-FRAMEWORK/package/target/distro/web/modules/calculation-1.3.0.omod
18-Sep-2021 02:01:45 [INFO] Copying webservices.rest-omod-2.32.0-SNAPSHOT.jar to /home/bamboo-agent/bamboo-agent/xml-data/build-dir/REFAPP-UI-FRAMEWORK/package/target/distro/web/modules/webservices.rest-2.32.0-SNAPSHOT.omod
18-Sep-2021 02:01:45 [INFO] Copying spa-omod-1.0.8.jar to /home/bamboo-agent/bamboo-agent/xml-data/build-dir/REFAPP-UI-FRAMEWORK/package/target/distro/web/modules/spa-1.0.8.omod
18-Sep-2021 02:01:45 [INFO] Copying uicommons-omod-2.18.0.jar to /home/bamboo-agent/bamboo-agent/xml-data/build-dir/REFAPP-UI-FRAMEWORK/package/target/distro/web/modules/uicommons-2.18.0.omod
18-Sep-2021 02:01:45 [INFO] Copying uiframework-omod-3.21.0.jar to /home/bamboo-agent/bamboo-agent/xml-data/build-dir/REFAPP-UI-FRAMEWORK/package/target/distro/web/modules/uiframework-3.21.0.omod
18-Sep-2021 02:01:45 [INFO] Copying metadatasharing-omod-1.8.0.jar to /home/bamboo-agent/bamboo-agent/xml-data/build-dir/REFAPP-UI-FRAMEWORK/package/target/distro/web/modules/metadatasharing-1.8.0.omod
18-Sep-2021 02:01:45
18-Sep-2021 02:01:45 Downloading OWAs...
18-Sep-2021 02:01:45
18-Sep-2021 02:01:45
18-Sep-2021 02:01:45 Downloading OWA: org.openmrs.owa:openmrs-owa-sysadmin:1.2
18-Sep-2021 02:01:45 [INFO] Configured Artifact: org.openmrs.owa:sysadmin:1.2:zip
18-Sep-2021 02:01:45 [INFO] Copying sysadmin-1.2.zip to /home/bamboo-agent/bamboo-agent/xml-data/build-dir/REFAPP-UI-FRAMEWORK/package/target/distro/web/owa/sysadmin-1.2.zip
18-Sep-2021 02:01:46
18-Sep-2021 02:01:46 Creating Docker Compose configuration...
18-Sep-2021 02:01:46
18-Sep-2021 02:01:47
18-Sep-2021 02:01:47 The 'referenceapplication' distribution created! To start up the server run 'docker-compose up' from /home/bamboo-agent/bamboo-agent/xml-data/build-dir/REFAPP-UI-FRAMEWORK/package/target/distro
18-Sep-2021 02:01:47
18-Sep-2021 02:01:47 [INFO]
18-Sep-2021 02:01:47 [INFO] --- openmrs-sdk-maven-plugin:4.0.0:build-distro (build-bundled-distro) @ referenceapplication-package ---
18-Sep-2021 02:01:47
18-Sep-2021 02:01:47 Downloading modules...
18-Sep-2021 02:01:47
18-Sep-2021 02:01:47 [INFO] Configured Artifact: org.openmrs.web:openmrs-webapp:2.4.0:war
18-Sep-2021 02:01:47 [INFO] Copying openmrs-webapp-2.4.0.war to /home/bamboo-agent/bamboo-agent/xml-data/build-dir/REFAPP-UI-FRAMEWORK/package/target/bundled-distro/web/openmrs-2.4.0.war
18-Sep-2021 02:01:47 file:/home/bamboo-agent/bamboo-agent/xml-data/build-dir/REFAPP-UI-FRAMEWORK/package/target/bundled-distro/web/openmrs-2.4.0.war
18-Sep-2021 02:01:47 target:/home/bamboo-agent/bamboo-agent/xml-data/build-dir/REFAPP-UI-FRAMEWORK/package/target/bundled-distro/web
18-Sep-2021 02:01:47 [INFO] Configured Artifact: org.openmrs.module:addresshierarchy-omod:2.14.2:jar
18-Sep-2021 02:01:47 [INFO] Configured Artifact: org.openmrs.module:legacyui-omod:1.8.3:jar
18-Sep-2021 02:01:47 [INFO] Configured Artifact: org.openmrs.module:openconceptlab-omod:1.2.6:jar
18-Sep-2021 02:01:47 [INFO] Configured Artifact: org.openmrs.module:metadatadeploy-omod:1.13.0:jar
18-Sep-2021 02:01:47 [INFO] Configured Artifact: org.openmrs.module:reportingrest-omod:1.12.0:jar
18-Sep-2021 02:01:47 [INFO] Configured Artifact: org.openmrs.module:owa-omod:1.13.0:jar
18-Sep-2021 02:01:47 [INFO] Configured Artifact: org.openmrs.module:fhir2-omod:1.2.2:jar
18-Sep-2021 02:01:47 [INFO] Configured Artifact: org.openmrs.module:serialization.xstream-omod:0.2.15:omod
18-Sep-2021 02:01:47 [INFO] Configured Artifact: org.openmrs.module:registrationapp-omod:1.24.0:jar
18-Sep-2021 02:01:47 [INFO] Configured Artifact: org.openmrs:event-omod:2.10.0-SNAPSHOT:jar
18-Sep-2021 02:01:47 [INFO] Configured Artifact: org.openmrs.module:uilibrary-omod:2.0.7:jar
18-Sep-2021 02:01:47 [INFO] Configured Artifact: org.openmrs.module:htmlwidgets-omod:1.10.0:jar
18-Sep-2021 02:01:47 [INFO] Configured Artifact: org.openmrs.module:dataexchange-omod:1.3.7:jar
18-Sep-2021 02:01:47 [INFO] Configured Artifact: org.openmrs.module:appui-omod:1.14.0:jar
18-Sep-2021 02:01:47 [INFO] Configured Artifact: org.openmrs.module:allergyui-omod:1.8.4:jar
18-Sep-2021 02:01:47 [INFO] Configured Artifact: org.openmrs.module:providermanagement-omod:2.13.0:jar
18-Sep-2021 02:01:47 [INFO] Configured Artifact: org.openmrs.module:appointmentschedulingui-omod:1.12.0:jar
18-Sep-2021 02:01:47 [INFO] Configured Artifact: org.openmrs.module:attachments-omod:2.5.0:jar
18-Sep-2021 02:01:47 [INFO] Configured Artifact: org.openmrs.module:formentryapp-omod:1.4.2:jar
18-Sep-2021 02:01:47 [INFO] Configured Artifact: org.openmrs.module:idgen-omod:4.7.0:jar
18-Sep-2021 02:01:47 [INFO] Configured Artifact: org.openmrs.module:metadatamapping-omod:1.4.0:jar
18-Sep-2021 02:01:47 [INFO] Configured Artifact: org.openmrs.module:htmlformentryui-omod:2.0.0:jar
18-Sep-2021 02:01:47 [INFO] Configured Artifact: org.openmrs.module:referencedemodata-omod:1.4.7:jar
18-Sep-2021 02:01:47 [INFO] Configured Artifact: org.openmrs.module:emrapi-omod:1.32.0:jar
18-Sep-2021 02:01:47 [INFO] Configured Artifact: org.openmrs.module:referenceapplication-omod:2.12.0-SNAPSHOT:jar
18-Sep-2021 02:01:47 [INFO] Configured Artifact: org.openmrs.module:htmlformentry-omod:4.1.0:jar
18-Sep-2021 02:01:47 [INFO] Configured Artifact: org.openmrs.module:appframework-omod:2.16.0:jar
18-Sep-2021 02:01:47 [INFO] Configured Artifact: org.openmrs.module:referencemetadata-omod:2.12.0:jar
18-Sep-2021 02:01:47 [INFO] Configured Artifact: org.openmrs.module:reportingui-omod:1.8.0:jar
18-Sep-2021 02:01:47 [INFO] Configured Artifact: org.openmrs.module:coreapps-omod:1.34.0-SNAPSHOT:jar
18-Sep-2021 02:01:47 [INFO] Configured Artifact: org.openmrs.module:reportingcompatibility-omod:2.0.8:jar
18-Sep-2021 02:01:47 [INFO] Configured Artifact: org.openmrs.module:reporting-omod:1.23.0:jar
18-Sep-2021 02:01:47 [INFO] Configured Artifact: org.openmrs.module:adminui-omod:1.5.0:jar
18-Sep-2021 02:01:47 [INFO] Configured Artifact: org.openmrs.module:registrationcore-omod:1.11.0:jar
18-Sep-2021 02:01:47 [INFO] Configured Artifact: org.openmrs.module:appointmentscheduling-omod:1.16.0:jar
18-Sep-2021 02:01:47 [INFO] Configured Artifact: org.openmrs.module:atlas-omod:2.2.5:omod
18-Sep-2021 02:01:47 [INFO] Configured Artifact: org.openmrs.module:calculation-omod:1.3.0:jar
18-Sep-2021 02:01:47 [INFO] Configured Artifact: org.openmrs.module:webservices.rest-omod:2.32.0-SNAPSHOT:jar
18-Sep-2021 02:01:47 [INFO] Configured Artifact: org.openmrs.module:spa-omod:1.0.8:jar
18-Sep-2021 02:01:47 [INFO] Configured Artifact: org.openmrs.module:uicommons-omod:2.18.0:jar
18-Sep-2021 02:01:47 [INFO] Configured Artifact: org.openmrs.module:uiframework-omod:3.21.0:jar
18-Sep-2021 02:01:47 [INFO] Configured Artifact: org.openmrs.module:metadatasharing-omod:1.8.0:jar
18-Sep-2021 02:01:47 [INFO] Copying addresshierarchy-omod-2.14.2.jar to /home/bamboo-agent/bamboo-agent/xml-data/build-dir/REFAPP-UI-FRAMEWORK/package/target/bundled-distro/web/WEB-INF/bundledModules/addresshierarchy-2.14.2.omod
18-Sep-2021 02:01:47 [INFO] Copying legacyui-omod-1.8.3.jar to /home/bamboo-agent/bamboo-agent/xml-data/build-dir/REFAPP-UI-FRAMEWORK/package/target/bundled-distro/web/WEB-INF/bundledModules/legacyui-1.8.3.omod
18-Sep-2021 02:01:47 [INFO] Copying openconceptlab-omod-1.2.6.jar to /home/bamboo-agent/bamboo-agent/xml-data/build-dir/REFAPP-UI-FRAMEWORK/package/target/bundled-distro/web/WEB-INF/bundledModules/openconceptlab-1.2.6.omod
18-Sep-2021 02:01:47 [INFO] Copying metadatadeploy-omod-1.13.0.jar to /home/bamboo-agent/bamboo-agent/xml-data/build-dir/REFAPP-UI-FRAMEWORK/package/target/bundled-distro/web/WEB-INF/bundledModules/metadatadeploy-1.13.0.omod
18-Sep-2021 02:01:47 [INFO] Copying reportingrest-omod-1.12.0.jar to /home/bamboo-agent/bamboo-agent/xml-data/build-dir/REFAPP-UI-FRAMEWORK/package/target/bundled-distro/web/WEB-INF/bundledModules/reportingrest-1.12.0.omod
18-Sep-2021 02:01:47 [INFO] Copying owa-omod-1.13.0.jar to /home/bamboo-agent/bamboo-agent/xml-data/build-dir/REFAPP-UI-FRAMEWORK/package/target/bundled-distro/web/WEB-INF/bundledModules/owa-1.13.0.omod
18-Sep-2021 02:01:47 [INFO] Copying fhir2-omod-1.2.2.jar to /home/bamboo-agent/bamboo-agent/xml-data/build-dir/REFAPP-UI-FRAMEWORK/package/target/bundled-distro/web/WEB-INF/bundledModules/fhir2-1.2.2.omod
18-Sep-2021 02:01:47 [INFO] Copying serialization.xstream-omod-0.2.15.omod to /home/bamboo-agent/bamboo-agent/xml-data/build-dir/REFAPP-UI-FRAMEWORK/package/target/bundled-distro/web/WEB-INF/bundledModules/serialization.xstream-0.2.15.omod
18-Sep-2021 02:01:47 [INFO] Copying registrationapp-omod-1.24.0.jar to /home/bamboo-agent/bamboo-agent/xml-data/build-dir/REFAPP-UI-FRAMEWORK/package/target/bundled-distro/web/WEB-INF/bundledModules/registrationapp-1.24.0.omod
18-Sep-2021 02:01:47 [INFO] Copying event-omod-2.10.0-SNAPSHOT.jar to /home/bamboo-agent/bamboo-agent/xml-data/build-dir/REFAPP-UI-FRAMEWORK/package/target/bundled-distro/web/WEB-INF/bundledModules/event-2.10.0-SNAPSHOT.omod
18-Sep-2021 02:01:47 [INFO] Copying uilibrary-omod-2.0.7.jar to /home/bamboo-agent/bamboo-agent/xml-data/build-dir/REFAPP-UI-FRAMEWORK/package/target/bundled-distro/web/WEB-INF/bundledModules/uilibrary-2.0.7.omod
18-Sep-2021 02:01:47 [INFO] Copying htmlwidgets-omod-1.10.0.jar to /home/bamboo-agent/bamboo-agent/xml-data/build-dir/REFAPP-UI-FRAMEWORK/package/target/bundled-distro/web/WEB-INF/bundledModules/htmlwidgets-1.10.0.omod
18-Sep-2021 02:01:47 [INFO] Copying dataexchange-omod-1.3.7.jar to /home/bamboo-agent/bamboo-agent/xml-data/build-dir/REFAPP-UI-FRAMEWORK/package/target/bundled-distro/web/WEB-INF/bundledModules/dataexchange-1.3.7.omod
18-Sep-2021 02:01:47 [INFO] Copying appui-omod-1.14.0.jar to /home/bamboo-agent/bamboo-agent/xml-data/build-dir/REFAPP-UI-FRAMEWORK/package/target/bundled-distro/web/WEB-INF/bundledModules/appui-1.14.0.omod
18-Sep-2021 02:01:48 [INFO] Copying allergyui-omod-1.8.4.jar to /home/bamboo-agent/bamboo-agent/xml-data/build-dir/REFAPP-UI-FRAMEWORK/package/target/bundled-distro/web/WEB-INF/bundledModules/allergyui-1.8.4.omod
18-Sep-2021 02:01:48 [INFO] Copying providermanagement-omod-2.13.0.jar to /home/bamboo-agent/bamboo-agent/xml-data/build-dir/REFAPP-UI-FRAMEWORK/package/target/bundled-distro/web/WEB-INF/bundledModules/providermanagement-2.13.0.omod
18-Sep-2021 02:01:48 [INFO] Copying appointmentschedulingui-omod-1.12.0.jar to /home/bamboo-agent/bamboo-agent/xml-data/build-dir/REFAPP-UI-FRAMEWORK/package/target/bundled-distro/web/WEB-INF/bundledModules/appointmentschedulingui-1.12.0.omod
18-Sep-2021 02:01:48 [INFO] Copying attachments-omod-2.5.0.jar to /home/bamboo-agent/bamboo-agent/xml-data/build-dir/REFAPP-UI-FRAMEWORK/package/target/bundled-distro/web/WEB-INF/bundledModules/attachments-2.5.0.omod
18-Sep-2021 02:01:48 [INFO] Copying formentryapp-omod-1.4.2.jar to /home/bamboo-agent/bamboo-agent/xml-data/build-dir/REFAPP-UI-FRAMEWORK/package/target/bundled-distro/web/WEB-INF/bundledModules/formentryapp-1.4.2.omod
18-Sep-2021 02:01:48 [INFO] Copying idgen-omod-4.7.0.jar to /home/bamboo-agent/bamboo-agent/xml-data/build-dir/REFAPP-UI-FRAMEWORK/package/target/bundled-distro/web/WEB-INF/bundledModules/idgen-4.7.0.omod
18-Sep-2021 02:01:48 [INFO] Copying metadatamapping-omod-1.4.0.jar to /home/bamboo-agent/bamboo-agent/xml-data/build-dir/REFAPP-UI-FRAMEWORK/package/target/bundled-distro/web/WEB-INF/bundledModules/metadatamapping-1.4.0.omod
18-Sep-2021 02:01:48 [INFO] Copying htmlformentryui-omod-2.0.0.jar to /home/bamboo-agent/bamboo-agent/xml-data/build-dir/REFAPP-UI-FRAMEWORK/package/target/bundled-distro/web/WEB-INF/bundledModules/htmlformentryui-2.0.0.omod
18-Sep-2021 02:01:48 [INFO] Copying referencedemodata-omod-1.4.7.jar to /home/bamboo-agent/bamboo-agent/xml-data/build-dir/REFAPP-UI-FRAMEWORK/package/target/bundled-distro/web/WEB-INF/bundledModules/referencedemodata-1.4.7.omod
18-Sep-2021 02:01:48 [INFO] Copying emrapi-omod-1.32.0.jar to /home/bamboo-agent/bamboo-agent/xml-data/build-dir/REFAPP-UI-FRAMEWORK/package/target/bundled-distro/web/WEB-INF/bundledModules/emrapi-1.32.0.omod
18-Sep-2021 02:01:48 [INFO] Copying referenceapplication-omod-2.12.0-SNAPSHOT.jar to /home/bamboo-agent/bamboo-agent/xml-data/build-dir/REFAPP-UI-FRAMEWORK/package/target/bundled-distro/web/WEB-INF/bundledModules/referenceapplication-2.12.0-SNAPSHOT.omod
18-Sep-2021 02:01:48 [INFO] Copying htmlformentry-omod-4.1.0.jar to /home/bamboo-agent/bamboo-agent/xml-data/build-dir/REFAPP-UI-FRAMEWORK/package/target/bundled-distro/web/WEB-INF/bundledModules/htmlformentry-4.1.0.omod
18-Sep-2021 02:01:48 [INFO] Copying appframework-omod-2.16.0.jar to /home/bamboo-agent/bamboo-agent/xml-data/build-dir/REFAPP-UI-FRAMEWORK/package/target/bundled-distro/web/WEB-INF/bundledModules/appframework-2.16.0.omod
18-Sep-2021 02:01:48 [INFO] Copying referencemetadata-omod-2.12.0.jar to /home/bamboo-agent/bamboo-agent/xml-data/build-dir/REFAPP-UI-FRAMEWORK/package/target/bundled-distro/web/WEB-INF/bundledModules/referencemetadata-2.12.0.omod
18-Sep-2021 02:01:48 [INFO] Copying reportingui-omod-1.8.0.jar to /home/bamboo-agent/bamboo-agent/xml-data/build-dir/REFAPP-UI-FRAMEWORK/package/target/bundled-distro/web/WEB-INF/bundledModules/reportingui-1.8.0.omod
18-Sep-2021 02:01:48 [INFO] Copying coreapps-omod-1.34.0-SNAPSHOT.jar to /home/bamboo-agent/bamboo-agent/xml-data/build-dir/REFAPP-UI-FRAMEWORK/package/target/bundled-distro/web/WEB-INF/bundledModules/coreapps-1.34.0-SNAPSHOT.omod
18-Sep-2021 02:01:48 [INFO] Copying reportingcompatibility-omod-2.0.8.jar to /home/bamboo-agent/bamboo-agent/xml-data/build-dir/REFAPP-UI-FRAMEWORK/package/target/bundled-distro/web/WEB-INF/bundledModules/reportingcompatibility-2.0.8.omod
18-Sep-2021 02:01:48 [INFO] Copying reporting-omod-1.23.0.jar to /home/bamboo-agent/bamboo-agent/xml-data/build-dir/REFAPP-UI-FRAMEWORK/package/target/bundled-distro/web/WEB-INF/bundledModules/reporting-1.23.0.omod
18-Sep-2021 02:01:48 [INFO] Copying adminui-omod-1.5.0.jar to /home/bamboo-agent/bamboo-agent/xml-data/build-dir/REFAPP-UI-FRAMEWORK/package/target/bundled-distro/web/WEB-INF/bundledModules/adminui-1.5.0.omod
18-Sep-2021 02:01:48 [INFO] Copying registrationcore-omod-1.11.0.jar to /home/bamboo-agent/bamboo-agent/xml-data/build-dir/REFAPP-UI-FRAMEWORK/package/target/bundled-distro/web/WEB-INF/bundledModules/registrationcore-1.11.0.omod
18-Sep-2021 02:01:48 [INFO] Copying appointmentscheduling-omod-1.16.0.jar to /home/bamboo-agent/bamboo-agent/xml-data/build-dir/REFAPP-UI-FRAMEWORK/package/target/bundled-distro/web/WEB-INF/bundledModules/appointmentscheduling-1.16.0.omod
18-Sep-2021 02:01:48 [INFO] Copying atlas-omod-2.2.5.omod to /home/bamboo-agent/bamboo-agent/xml-data/build-dir/REFAPP-UI-FRAMEWORK/package/target/bundled-distro/web/WEB-INF/bundledModules/atlas-2.2.5.omod
18-Sep-2021 02:01:48 [INFO] Copying calculation-omod-1.3.0.jar to /home/bamboo-agent/bamboo-agent/xml-data/build-dir/REFAPP-UI-FRAMEWORK/package/target/bundled-distro/web/WEB-INF/bundledModules/calculation-1.3.0.omod
18-Sep-2021 02:01:48 [INFO] Copying webservices.rest-omod-2.32.0-SNAPSHOT.jar to /home/bamboo-agent/bamboo-agent/xml-data/build-dir/REFAPP-UI-FRAMEWORK/package/target/bundled-distro/web/WEB-INF/bundledModules/webservices.rest-2.32.0-SNAPSHOT.omod
18-Sep-2021 02:01:48 [INFO] Copying spa-omod-1.0.8.jar to /home/bamboo-agent/bamboo-agent/xml-data/build-dir/REFAPP-UI-FRAMEWORK/package/target/bundled-distro/web/WEB-INF/bundledModules/spa-1.0.8.omod
18-Sep-2021 02:01:48 [INFO] Copying uicommons-omod-2.18.0.jar to /home/bamboo-agent/bamboo-agent/xml-data/build-dir/REFAPP-UI-FRAMEWORK/package/target/bundled-distro/web/WEB-INF/bundledModules/uicommons-2.18.0.omod
18-Sep-2021 02:01:48 [INFO] Copying uiframework-omod-3.21.0.jar to /home/bamboo-agent/bamboo-agent/xml-data/build-dir/REFAPP-UI-FRAMEWORK/package/target/bundled-distro/web/WEB-INF/bundledModules/uiframework-3.21.0.omod
18-Sep-2021 02:01:48 [INFO] Copying metadatasharing-omod-1.8.0.jar to /home/bamboo-agent/bamboo-agent/xml-data/build-dir/REFAPP-UI-FRAMEWORK/package/target/bundled-distro/web/WEB-INF/bundledModules/metadatasharing-1.8.0.omod
18-Sep-2021 02:01:48
18-Sep-2021 02:01:48 Downloading OWAs...
18-Sep-2021 02:01:48
18-Sep-2021 02:01:48
18-Sep-2021 02:01:48 Downloading OWA: org.openmrs.owa:openmrs-owa-sysadmin:1.2
18-Sep-2021 02:01:48 [INFO] Configured Artifact: org.openmrs.owa:sysadmin:1.2:zip
18-Sep-2021 02:01:48 [INFO] Copying sysadmin-1.2.zip to /home/bamboo-agent/bamboo-agent/xml-data/build-dir/REFAPP-UI-FRAMEWORK/package/target/bundled-distro/web/WEB-INF/bundledOwas/sysadmin-1.2.zip
18-Sep-2021 02:01:49
18-Sep-2021 02:01:49 Creating Docker Compose configuration...
18-Sep-2021 02:01:49
18-Sep-2021 02:01:51
18-Sep-2021 02:01:51 The 'referenceapplication' distribution created! To start up the server run 'docker-compose up' from /home/bamboo-agent/bamboo-agent/xml-data/build-dir/REFAPP-UI-FRAMEWORK/package/target/bundled-distro
18-Sep-2021 02:01:51
18-Sep-2021 02:01:51 [INFO]
18-Sep-2021 02:01:51 [INFO] --- maven-compiler-plugin:3.1:compile (default-compile) @ referenceapplication-package ---
18-Sep-2021 02:01:51 [INFO] No sources to compile
18-Sep-2021 02:01:51 [INFO]
18-Sep-2021 02:01:51 [INFO] --- maven-resources-plugin:2.6:testResources (default-testResources) @ referenceapplication-package ---
18-Sep-2021 02:01:51 [INFO] Using 'UTF-8' encoding to copy filtered resources.
18-Sep-2021 02:01:51 [INFO] skip non existing resourceDirectory /home/bamboo-agent/bamboo-agent/xml-data/build-dir/REFAPP-UI-FRAMEWORK/package/src/test/resources
18-Sep-2021 02:01:51 [INFO] skip non existing resourceDirectory /home/bamboo-agent/bamboo-agent/xml-data/build-dir/REFAPP-UI-FRAMEWORK/package/src/test/resources
18-Sep-2021 02:01:51 [INFO]
18-Sep-2021 02:01:51 [INFO] --- maven-compiler-plugin:3.1:testCompile (default-testCompile) @ referenceapplication-package ---
18-Sep-2021 02:01:51 [INFO] No sources to compile
18-Sep-2021 02:01:51 [INFO]
18-Sep-2021 02:01:51 [INFO] --- maven-surefire-plugin:2.12:test (default-test) @ referenceapplication-package ---
18-Sep-2021 02:01:51 [INFO] No tests to run.
18-Sep-2021 02:01:51 [INFO] Surefire report directory: /home/bamboo-agent/bamboo-agent/xml-data/build-dir/REFAPP-UI-FRAMEWORK/package/target/surefire-reports
18-Sep-2021 02:01:51
18-Sep-2021 02:01:51 -------------------------------------------------------
18-Sep-2021 02:01:51 T E S T S
18-Sep-2021 02:01:51 -------------------------------------------------------
18-Sep-2021 02:01:56
18-Sep-2021 02:01:56 Results :
18-Sep-2021 02:01:56
18-Sep-2021 02:01:56 Tests run: 0, Failures: 0, Errors: 0, Skipped: 0
18-Sep-2021 02:01:56
18-Sep-2021 02:01:56 [INFO]
18-Sep-2021 02:01:56 [INFO] --- maven-jar-plugin:2.4:jar (default-jar) @ referenceapplication-package ---
18-Sep-2021 02:01:56 [INFO] Building jar: /home/bamboo-agent/bamboo-agent/xml-data/build-dir/REFAPP-UI-FRAMEWORK/package/target/referenceapplication-package-2.12.0-SNAPSHOT.jar
18-Sep-2021 02:01:56 [INFO]
18-Sep-2021 02:01:56 [INFO] --- maven-assembly-plugin:2.3:single (make-assembly) @ referenceapplication-package ---
18-Sep-2021 02:01:57 [INFO] Reading assembly descriptor: /home/bamboo-agent/bamboo-agent/xml-data/build-dir/REFAPP-UI-FRAMEWORK/package/src/main/assembly/assembly.xml
18-Sep-2021 02:01:57 [INFO] Building zip: /home/bamboo-agent/bamboo-agent/xml-data/build-dir/REFAPP-UI-FRAMEWORK/package/target/referenceapplication-package-2.12.0-SNAPSHOT-addons.zip
18-Sep-2021 02:02:02 [INFO]
18-Sep-2021 02:02:02 [INFO] --- build-helper-maven-plugin:3.0.0:attach-artifact (attach-artifacts) @ referenceapplication-package ---
18-Sep-2021 02:02:02 [INFO]
18-Sep-2021 02:02:02 [INFO] --- maven-jar-plugin:2.4:test-jar (default) @ referenceapplication-package ---
18-Sep-2021 02:02:02 [WARNING] JAR will be empty - no content was marked for inclusion!
18-Sep-2021 02:02:02 [INFO] Building jar: /home/bamboo-agent/bamboo-agent/xml-data/build-dir/REFAPP-UI-FRAMEWORK/package/target/referenceapplication-package-2.12.0-SNAPSHOT-tests.jar
18-Sep-2021 02:02:02 [INFO]
18-Sep-2021 02:02:02 [INFO] --- maven-install-plugin:2.4:install (default-install) @ referenceapplication-package ---
18-Sep-2021 02:02:02 [INFO] Installing /home/bamboo-agent/bamboo-agent/xml-data/build-dir/REFAPP-UI-FRAMEWORK/package/target/referenceapplication-package-2.12.0-SNAPSHOT.jar to /home/bamboo-agent/.m2/repository/org/openmrs/distro/referenceapplication-package/2.12.0-SNAPSHOT/referenceapplication-package-2.12.0-SNAPSHOT.jar
18-Sep-2021 02:02:02 [INFO] Installing /home/bamboo-agent/bamboo-agent/xml-data/build-dir/REFAPP-UI-FRAMEWORK/package/pom.xml to /home/bamboo-agent/.m2/repository/org/openmrs/distro/referenceapplication-package/2.12.0-SNAPSHOT/referenceapplication-package-2.12.0-SNAPSHOT.pom
18-Sep-2021 02:02:02 [INFO] Installing /home/bamboo-agent/bamboo-agent/xml-data/build-dir/REFAPP-UI-FRAMEWORK/package/target/referenceapplication-package-2.12.0-SNAPSHOT-addons.zip to /home/bamboo-agent/.m2/repository/org/openmrs/distro/referenceapplication-package/2.12.0-SNAPSHOT/referenceapplication-package-2.12.0-SNAPSHOT-addons.zip
18-Sep-2021 02:02:02 [INFO] Installing /home/bamboo-agent/bamboo-agent/xml-data/build-dir/REFAPP-UI-FRAMEWORK/package/target/bundled-distro/web/openmrs.war to /home/bamboo-agent/.m2/repository/org/openmrs/distro/referenceapplication-package/2.12.0-SNAPSHOT/referenceapplication-package-2.12.0-SNAPSHOT.war
18-Sep-2021 02:02:03 [INFO] Installing /home/bamboo-agent/bamboo-agent/xml-data/build-dir/REFAPP-UI-FRAMEWORK/package/target/referenceapplication-package-2.12.0-SNAPSHOT-tests.jar to /home/bamboo-agent/.m2/repository/org/openmrs/distro/referenceapplication-package/2.12.0-SNAPSHOT/referenceapplication-package-2.12.0-SNAPSHOT-tests.jar
18-Sep-2021 02:02:03 [INFO]                                                                         
18-Sep-2021 02:02:03 [INFO] ------------------------------------------------------------------------
18-Sep-2021 02:02:03 [INFO] Building Reference Application Distribution UI Tests 2.12.0-SNAPSHOT
18-Sep-2021 02:02:03 [INFO] ------------------------------------------------------------------------
18-Sep-2021 02:02:04 [INFO]
18-Sep-2021 02:02:04 [INFO] --- maven-clean-plugin:2.5:clean (default-clean) @ referenceapplication-ui-tests ---
18-Sep-2021 02:02:04 [INFO]
18-Sep-2021 02:02:04 [INFO] --- maven-resources-plugin:2.6:resources (default-resources) @ referenceapplication-ui-tests ---
18-Sep-2021 02:02:04 [INFO] Using 'UTF-8' encoding to copy filtered resources.
18-Sep-2021 02:02:04 [INFO] skip non existing resourceDirectory /home/bamboo-agent/bamboo-agent/xml-data/build-dir/REFAPP-UI-FRAMEWORK/ui-tests/src/main/resources
18-Sep-2021 02:02:04 [INFO]
18-Sep-2021 02:02:04 [INFO] --- maven-compiler-plugin:3.1:compile (default-compile) @ referenceapplication-ui-tests ---
18-Sep-2021 02:02:04 [INFO] No sources to compile
18-Sep-2021 02:02:04 [INFO]
18-Sep-2021 02:02:04 [INFO] --- maven-resources-plugin:2.6:testResources (default-testResources) @ referenceapplication-ui-tests ---
18-Sep-2021 02:02:04 [INFO] Using 'UTF-8' encoding to copy filtered resources.
18-Sep-2021 02:02:04 [INFO] Copying 2 resources
18-Sep-2021 02:02:05 [INFO] Copying 2 resources
18-Sep-2021 02:02:05 [INFO]
18-Sep-2021 02:02:05 [INFO] --- maven-compiler-plugin:3.1:testCompile (default-testCompile) @ referenceapplication-ui-tests ---
18-Sep-2021 02:02:05 [INFO] Changes detected - recompiling the module!
18-Sep-2021 02:02:05 [INFO] Compiling 121 source files to /home/bamboo-agent/bamboo-agent/xml-data/build-dir/REFAPP-UI-FRAMEWORK/ui-tests/target/test-classes
18-Sep-2021 02:02:08 [WARNING] /home/bamboo-agent/bamboo-agent/xml-data/build-dir/REFAPP-UI-FRAMEWORK/ui-tests/src/test/java/org/openmrs/reference/AddDeleteLocationTest.java: Some input files use or override a deprecated API.
18-Sep-2021 02:02:08 [WARNING] /home/bamboo-agent/bamboo-agent/xml-data/build-dir/REFAPP-UI-FRAMEWORK/ui-tests/src/test/java/org/openmrs/reference/AddDeleteLocationTest.java: Recompile with -Xlint:deprecation for details.
18-Sep-2021 02:02:08 [WARNING] /home/bamboo-agent/bamboo-agent/xml-data/build-dir/REFAPP-UI-FRAMEWORK/ui-tests/src/test/java/org/openmrs/reference/AddRolesToUserTest.java: /home/bamboo-agent/bamboo-agent/xml-data/build-dir/REFAPP-UI-FRAMEWORK/ui-tests/src/test/java/org/openmrs/reference/AddRolesToUserTest.java uses unchecked or unsafe operations.
18-Sep-2021 02:02:08 [WARNING] /home/bamboo-agent/bamboo-agent/xml-data/build-dir/REFAPP-UI-FRAMEWORK/ui-tests/src/test/java/org/openmrs/reference/AddRolesToUserTest.java: Recompile with -Xlint:unchecked for details.
18-Sep-2021 02:02:08 [INFO]
18-Sep-2021 02:02:08 [INFO] --- maven-antrun-plugin:1.8:run (make-mac-chromedriver-executable) @ referenceapplication-ui-tests ---
18-Sep-2021 02:02:09 [INFO] Executing tasks
18-Sep-2021 02:02:09
18-Sep-2021 02:02:09 main:
18-Sep-2021 02:02:09 [INFO] An Ant BuildException has occured: /home/bamboo-agent/bamboo-agent/xml-data/build-dir/REFAPP-UI-FRAMEWORK/ui-tests/target/test-classes/chromedriver/mac does not exist.
18-Sep-2021 02:02:09 around Ant part ...<chmod file="target/test-classes/chromedriver/mac/chromedriver" perm="755"/>... @ 4:79 in /home/bamboo-agent/bamboo-agent/xml-data/build-dir/REFAPP-UI-FRAMEWORK/ui-tests/target/antrun/build-main.xml
18-Sep-2021 02:02:09 /home/bamboo-agent/bamboo-agent/xml-data/build-dir/REFAPP-UI-FRAMEWORK/ui-tests/target/antrun/build-main.xml:4: /home/bamboo-agent/bamboo-agent/xml-data/build-dir/REFAPP-UI-FRAMEWORK/ui-tests/target/test-classes/chromedriver/mac does not exist.
18-Sep-2021 02:02:09         at org.apache.tools.ant.types.AbstractFileSet.getDirectoryScanner(AbstractFileSet.java:484)
18-Sep-2021 02:02:09         at org.apache.tools.ant.taskdefs.ExecuteOn.runExec(ExecuteOn.java:369)
18-Sep-2021 02:02:09         at org.apache.tools.ant.taskdefs.ExecTask.execute(ExecTask.java:495)
18-Sep-2021 02:02:09         at org.apache.tools.ant.taskdefs.Chmod.execute(Chmod.java:181)
18-Sep-2021 02:02:09         at org.apache.tools.ant.UnknownElement.execute(UnknownElement.java:292)
18-Sep-2021 02:02:09         at sun.reflect.NativeMethodAccessorImpl.invoke0(Native Method)
18-Sep-2021 02:02:09         at sun.reflect.NativeMethodAccessorImpl.invoke(NativeMethodAccessorImpl.java:62)
18-Sep-2021 02:02:09         at sun.reflect.DelegatingMethodAccessorImpl.invoke(DelegatingMethodAccessorImpl.java:43)
18-Sep-2021 02:02:09         at java.lang.reflect.Method.invoke(Method.java:498)
18-Sep-2021 02:02:09         at org.apache.tools.ant.dispatch.DispatchUtils.execute(DispatchUtils.java:106)
18-Sep-2021 02:02:09         at org.apache.tools.ant.Task.perform(Task.java:348)
18-Sep-2021 02:02:09         at org.apache.tools.ant.Target.execute(Target.java:435)
18-Sep-2021 02:02:09         at org.apache.tools.ant.Target.performTasks(Target.java:456)
18-Sep-2021 02:02:09         at org.apache.tools.ant.Project.executeSortedTargets(Project.java:1393)
18-Sep-2021 02:02:09         at org.apache.tools.ant.Project.executeTarget(Project.java:1364)
18-Sep-2021 02:02:09         at org.apache.maven.plugin.antrun.AntRunMojo.execute(AntRunMojo.java:313)
18-Sep-2021 02:02:09         at org.apache.maven.plugin.DefaultBuildPluginManager.executeMojo(DefaultBuildPluginManager.java:134)
18-Sep-2021 02:02:09         at org.apache.maven.lifecycle.internal.MojoExecutor.execute(MojoExecutor.java:207)
18-Sep-2021 02:02:09         at org.apache.maven.lifecycle.internal.MojoExecutor.execute(MojoExecutor.java:153)
18-Sep-2021 02:02:09         at org.apache.maven.lifecycle.internal.MojoExecutor.execute(MojoExecutor.java:145)
18-Sep-2021 02:02:09         at org.apache.maven.lifecycle.internal.LifecycleModuleBuilder.buildProject(LifecycleModuleBuilder.java:116)
18-Sep-2021 02:02:09         at org.apache.maven.lifecycle.internal.LifecycleModuleBuilder.buildProject(LifecycleModuleBuilder.java:80)
18-Sep-2021 02:02:09         at org.apache.maven.lifecycle.internal.builder.singlethreaded.SingleThreadedBuilder.build(SingleThreadedBuilder.java:51)
18-Sep-2021 02:02:09         at org.apache.maven.lifecycle.internal.LifecycleStarter.execute(LifecycleStarter.java:128)
18-Sep-2021 02:02:09         at org.apache.maven.DefaultMaven.doExecute(DefaultMaven.java:307)
18-Sep-2021 02:02:09         at org.apache.maven.DefaultMaven.doExecute(DefaultMaven.java:193)
18-Sep-2021 02:02:09         at org.apache.maven.DefaultMaven.execute(DefaultMaven.java:106)
18-Sep-2021 02:02:09         at org.apache.maven.cli.MavenCli.execute(MavenCli.java:863)
18-Sep-2021 02:02:09         at org.apache.maven.cli.MavenCli.doMain(MavenCli.java:288)
18-Sep-2021 02:02:09         at org.apache.maven.cli.MavenCli.main(MavenCli.java:199)
18-Sep-2021 02:02:09         at sun.reflect.NativeMethodAccessorImpl.invoke0(Native Method)
18-Sep-2021 02:02:09         at sun.reflect.NativeMethodAccessorImpl.invoke(NativeMethodAccessorImpl.java:62)
18-Sep-2021 02:02:09         at sun.reflect.DelegatingMethodAccessorImpl.invoke(DelegatingMethodAccessorImpl.java:43)
18-Sep-2021 02:02:09         at java.lang.reflect.Method.invoke(Method.java:498)
18-Sep-2021 02:02:09         at org.codehaus.plexus.classworlds.launcher.Launcher.launchEnhanced(Launcher.java:289)
18-Sep-2021 02:02:09         at org.codehaus.plexus.classworlds.launcher.Launcher.launch(Launcher.java:229)
18-Sep-2021 02:02:09         at org.codehaus.plexus.classworlds.launcher.Launcher.mainWithExitCode(Launcher.java:415)
18-Sep-2021 02:02:09         at org.codehaus.plexus.classworlds.launcher.Launcher.main(Launcher.java:356)
18-Sep-2021 02:02:09 [INFO]
18-Sep-2021 02:02:09 [INFO] --- maven-antrun-plugin:1.8:run (make-linux-chromedriver-executable) @ referenceapplication-ui-tests ---
18-Sep-2021 02:02:09 [INFO] Executing tasks
18-Sep-2021 02:02:09
18-Sep-2021 02:02:09 main:
18-Sep-2021 02:02:09 [INFO] Executed tasks
18-Sep-2021 02:02:09 [INFO]
18-Sep-2021 02:02:09 [INFO] --- maven-antrun-plugin:1.8:run (make-mac-firefoxdriver-executable) @ referenceapplication-ui-tests ---
18-Sep-2021 02:02:09 [INFO] Executing tasks
18-Sep-2021 02:02:09
18-Sep-2021 02:02:09 main:
18-Sep-2021 02:02:09 [INFO] An Ant BuildException has occured: /home/bamboo-agent/bamboo-agent/xml-data/build-dir/REFAPP-UI-FRAMEWORK/ui-tests/target/test-classes/firefoxdriver/mac does not exist.
18-Sep-2021 02:02:09 around Ant part ...<chmod file="target/test-classes/firefoxdriver/mac/geckodriver" perm="755"/>... @ 4:79 in /home/bamboo-agent/bamboo-agent/xml-data/build-dir/REFAPP-UI-FRAMEWORK/ui-tests/target/antrun/build-main.xml
18-Sep-2021 02:02:09 /home/bamboo-agent/bamboo-agent/xml-data/build-dir/REFAPP-UI-FRAMEWORK/ui-tests/target/antrun/build-main.xml:4: /home/bamboo-agent/bamboo-agent/xml-data/build-dir/REFAPP-UI-FRAMEWORK/ui-tests/target/test-classes/firefoxdriver/mac does not exist.
18-Sep-2021 02:02:09         at org.apache.tools.ant.types.AbstractFileSet.getDirectoryScanner(AbstractFileSet.java:484)
18-Sep-2021 02:02:09         at org.apache.tools.ant.taskdefs.ExecuteOn.runExec(ExecuteOn.java:369)
18-Sep-2021 02:02:09         at org.apache.tools.ant.taskdefs.ExecTask.execute(ExecTask.java:495)
18-Sep-2021 02:02:09         at org.apache.tools.ant.taskdefs.Chmod.execute(Chmod.java:181)
18-Sep-2021 02:02:09         at org.apache.tools.ant.UnknownElement.execute(UnknownElement.java:292)
18-Sep-2021 02:02:09         at sun.reflect.NativeMethodAccessorImpl.invoke0(Native Method)
18-Sep-2021 02:02:09         at sun.reflect.NativeMethodAccessorImpl.invoke(NativeMethodAccessorImpl.java:62)
18-Sep-2021 02:02:09         at sun.reflect.DelegatingMethodAccessorImpl.invoke(DelegatingMethodAccessorImpl.java:43)
18-Sep-2021 02:02:09         at java.lang.reflect.Method.invoke(Method.java:498)
18-Sep-2021 02:02:09         at org.apache.tools.ant.dispatch.DispatchUtils.execute(DispatchUtils.java:106)
18-Sep-2021 02:02:09         at org.apache.tools.ant.Task.perform(Task.java:348)
18-Sep-2021 02:02:09         at org.apache.tools.ant.Target.execute(Target.java:435)
18-Sep-2021 02:02:09         at org.apache.tools.ant.Target.performTasks(Target.java:456)
18-Sep-2021 02:02:09         at org.apache.tools.ant.Project.executeSortedTargets(Project.java:1393)
18-Sep-2021 02:02:09         at org.apache.tools.ant.Project.executeTarget(Project.java:1364)
18-Sep-2021 02:02:09         at org.apache.maven.plugin.antrun.AntRunMojo.execute(AntRunMojo.java:313)
18-Sep-2021 02:02:09         at org.apache.maven.plugin.DefaultBuildPluginManager.executeMojo(DefaultBuildPluginManager.java:134)
18-Sep-2021 02:02:09         at org.apache.maven.lifecycle.internal.MojoExecutor.execute(MojoExecutor.java:207)
18-Sep-2021 02:02:09         at org.apache.maven.lifecycle.internal.MojoExecutor.execute(MojoExecutor.java:153)
18-Sep-2021 02:02:09         at org.apache.maven.lifecycle.internal.MojoExecutor.execute(MojoExecutor.java:145)
18-Sep-2021 02:02:09         at org.apache.maven.lifecycle.internal.LifecycleModuleBuilder.buildProject(LifecycleModuleBuilder.java:116)
18-Sep-2021 02:02:09         at org.apache.maven.lifecycle.internal.LifecycleModuleBuilder.buildProject(LifecycleModuleBuilder.java:80)
18-Sep-2021 02:02:09         at org.apache.maven.lifecycle.internal.builder.singlethreaded.SingleThreadedBuilder.build(SingleThreadedBuilder.java:51)
18-Sep-2021 02:02:09         at org.apache.maven.lifecycle.internal.LifecycleStarter.execute(LifecycleStarter.java:128)
18-Sep-2021 02:02:09         at org.apache.maven.DefaultMaven.doExecute(DefaultMaven.java:307)
18-Sep-2021 02:02:09         at org.apache.maven.DefaultMaven.doExecute(DefaultMaven.java:193)
18-Sep-2021 02:02:09         at org.apache.maven.DefaultMaven.execute(DefaultMaven.java:106)
18-Sep-2021 02:02:09         at org.apache.maven.cli.MavenCli.execute(MavenCli.java:863)
18-Sep-2021 02:02:09         at org.apache.maven.cli.MavenCli.doMain(MavenCli.java:288)
18-Sep-2021 02:02:09         at org.apache.maven.cli.MavenCli.main(MavenCli.java:199)
18-Sep-2021 02:02:09         at sun.reflect.NativeMethodAccessorImpl.invoke0(Native Method)
18-Sep-2021 02:02:09         at sun.reflect.NativeMethodAccessorImpl.invoke(NativeMethodAccessorImpl.java:62)
18-Sep-2021 02:02:09         at sun.reflect.DelegatingMethodAccessorImpl.invoke(DelegatingMethodAccessorImpl.java:43)
18-Sep-2021 02:02:09         at java.lang.reflect.Method.invoke(Method.java:498)
18-Sep-2021 02:02:09         at org.codehaus.plexus.classworlds.launcher.Launcher.launchEnhanced(Launcher.java:289)
18-Sep-2021 02:02:09         at org.codehaus.plexus.classworlds.launcher.Launcher.launch(Launcher.java:229)
18-Sep-2021 02:02:09         at org.codehaus.plexus.classworlds.launcher.Launcher.mainWithExitCode(Launcher.java:415)
18-Sep-2021 02:02:09         at org.codehaus.plexus.classworlds.launcher.Launcher.main(Launcher.java:356)
18-Sep-2021 02:02:09 [INFO]
18-Sep-2021 02:02:09 [INFO] --- maven-antrun-plugin:1.8:run (make-linux-firefoxdriver-executable) @ referenceapplication-ui-tests ---
18-Sep-2021 02:02:09 [INFO] Executing tasks
18-Sep-2021 02:02:09
18-Sep-2021 02:02:09 main:
18-Sep-2021 02:02:09 [INFO] Executed tasks
18-Sep-2021 02:02:09 [INFO]
18-Sep-2021 02:02:09 [INFO] --- maven-surefire-plugin:2.12:test (default-test) @ referenceapplication-ui-tests ---
18-Sep-2021 02:02:09 [INFO] Surefire report directory: /home/bamboo-agent/bamboo-agent/xml-data/build-dir/REFAPP-UI-FRAMEWORK/ui-tests/target/surefire-reports
18-Sep-2021 02:02:09
18-Sep-2021 02:02:09 -------------------------------------------------------
18-Sep-2021 02:02:09 T E S T S
18-Sep-2021 02:02:09 -------------------------------------------------------
18-Sep-2021 02:02:10 Running org.openmrs.reference.UnidentifiedPatientKeyboardTest
18-Sep-2021 02:02:10 Running locally...
18-Sep-2021 02:02:15 Starting ChromeDriver 90.0.4430.24 (4c6d850f087da467d926e8eddb76550aed655991-refs/branch-heads/4430@{#429}) on port 21671
18-Sep-2021 02:02:15 Only local connections are allowed.
18-Sep-2021 02:02:15 Please see https://chromedriver.chromium.org/security-considerations for suggestions on keeping ChromeDriver safe.
18-Sep-2021 02:02:15 ChromeDriver was started successfully.
18-Sep-2021 02:02:29 Sep 18, 2021 2:02:29 AM org.openqa.selenium.remote.ProtocolHandshake createSession
18-Sep-2021 02:02:29 INFO: Detected dialect: W3C
18-Sep-2021 02:02:43 Tests run: 1, Failures: 0, Errors: 0, Skipped: 0, Time elapsed: 32.897 sec
18-Sep-2021 02:02:43 Running org.openmrs.reference.DeleteAllergyTest
18-Sep-2021 02:02:43 Running locally...
18-Sep-2021 02:02:43 Starting ChromeDriver 90.0.4430.24 (4c6d850f087da467d926e8eddb76550aed655991-refs/branch-heads/4430@{#429}) on port 11231
18-Sep-2021 02:02:43 Only local connections are allowed.
18-Sep-2021 02:02:43 Please see https://chromedriver.chromium.org/security-considerations for suggestions on keeping ChromeDriver safe.
18-Sep-2021 02:02:43 ChromeDriver was started successfully.
18-Sep-2021 02:02:43 Sep 18, 2021 2:02:43 AM org.openqa.selenium.remote.ProtocolHandshake createSession
18-Sep-2021 02:02:43 INFO: Detected dialect: W3C
18-Sep-2021 02:02:52 Tests run: 1, Failures: 0, Errors: 0, Skipped: 0, Time elapsed: 9.044 sec
18-Sep-2021 02:02:52 Running org.openmrs.reference.SearchActiveVisitsTest
18-Sep-2021 02:02:52 Running locally...
18-Sep-2021 02:02:52 Starting ChromeDriver 90.0.4430.24 (4c6d850f087da467d926e8eddb76550aed655991-refs/branch-heads/4430@{#429}) on port 17974
18-Sep-2021 02:02:52 Only local connections are allowed.
18-Sep-2021 02:02:52 Please see https://chromedriver.chromium.org/security-considerations for suggestions on keeping ChromeDriver safe.
18-Sep-2021 02:02:52 ChromeDriver was started successfully.
18-Sep-2021 02:02:52 Sep 18, 2021 2:02:52 AM org.openqa.selenium.remote.ProtocolHandshake createSession
18-Sep-2021 02:02:52 INFO: Detected dialect: W3C
18-Sep-2021 02:02:57 Tests run: 1, Failures: 0, Errors: 0, Skipped: 0, Time elapsed: 4.985 sec
18-Sep-2021 02:02:57 Running org.openmrs.reference.AddVisitTypeTest
18-Sep-2021 02:02:57 Running locally...
18-Sep-2021 02:02:57 Starting ChromeDriver 90.0.4430.24 (4c6d850f087da467d926e8eddb76550aed655991-refs/branch-heads/4430@{#429}) on port 4164
18-Sep-2021 02:02:57 Only local connections are allowed.
18-Sep-2021 02:02:57 Please see https://chromedriver.chromium.org/security-considerations for suggestions on keeping ChromeDriver safe.
18-Sep-2021 02:02:57 ChromeDriver was started successfully.
18-Sep-2021 02:02:57 Sep 18, 2021 2:02:57 AM org.openqa.selenium.remote.ProtocolHandshake createSession
18-Sep-2021 02:02:57 INFO: Detected dialect: W3C
18-Sep-2021 02:03:12 Tests run: 1, Failures: 0, Errors: 0, Skipped: 0, Time elapsed: 15.315 sec
18-Sep-2021 02:03:12 Running org.openmrs.reference.FindPatientRecordTest
18-Sep-2021 02:03:12 Running locally...
18-Sep-2021 02:03:12 Starting ChromeDriver 90.0.4430.24 (4c6d850f087da467d926e8eddb76550aed655991-refs/branch-heads/4430@{#429}) on port 30526
18-Sep-2021 02:03:12 Only local connections are allowed.
18-Sep-2021 02:03:12 Please see https://chromedriver.chromium.org/security-considerations for suggestions on keeping ChromeDriver safe.
18-Sep-2021 02:03:12 ChromeDriver was started successfully.
18-Sep-2021 02:03:12 Sep 18, 2021 2:03:12 AM org.openqa.selenium.remote.ProtocolHandshake createSession
18-Sep-2021 02:03:12 INFO: Detected dialect: W3C
18-Sep-2021 02:03:17 Tests run: 1, Failures: 0, Errors: 0, Skipped: 0, Time elapsed: 4.418 sec
18-Sep-2021 02:03:17 Running org.openmrs.reference.EditPersonTest
18-Sep-2021 02:03:17 Running locally...
18-Sep-2021 02:03:17 Starting ChromeDriver 90.0.4430.24 (4c6d850f087da467d926e8eddb76550aed655991-refs/branch-heads/4430@{#429}) on port 10667
18-Sep-2021 02:03:17 Only local connections are allowed.
18-Sep-2021 02:03:17 Please see https://chromedriver.chromium.org/security-considerations for suggestions on keeping ChromeDriver safe.
18-Sep-2021 02:03:17 ChromeDriver was started successfully.
18-Sep-2021 02:03:17 Sep 18, 2021 2:03:17 AM org.openqa.selenium.remote.ProtocolHandshake createSession
18-Sep-2021 02:03:17 INFO: Detected dialect: W3C
18-Sep-2021 02:03:29 Tests run: 1, Failures: 0, Errors: 0, Skipped: 0, Time elapsed: 12.496 sec
18-Sep-2021 02:03:29 Running org.openmrs.reference.RetireLocationTest
18-Sep-2021 02:03:29 Running locally...
18-Sep-2021 02:03:29 Starting ChromeDriver 90.0.4430.24 (4c6d850f087da467d926e8eddb76550aed655991-refs/branch-heads/4430@{#429}) on port 3528
18-Sep-2021 02:03:29 Only local connections are allowed.
18-Sep-2021 02:03:29 Please see https://chromedriver.chromium.org/security-considerations for suggestions on keeping ChromeDriver safe.
18-Sep-2021 02:03:29 ChromeDriver was started successfully.
18-Sep-2021 02:03:29 Sep 18, 2021 2:03:29 AM org.openqa.selenium.remote.ProtocolHandshake createSession
18-Sep-2021 02:03:29 INFO: Detected dialect: W3C
18-Sep-2021 02:03:32 Tests run: 1, Failures: 0, Errors: 0, Skipped: 0, Time elapsed: 3.348 sec
18-Sep-2021 02:03:32 Running org.openmrs.reference.XSSOnPhoneNumberFieldTest
18-Sep-2021 02:03:32 Running locally...
18-Sep-2021 02:03:32 Starting ChromeDriver 90.0.4430.24 (4c6d850f087da467d926e8eddb76550aed655991-refs/branch-heads/4430@{#429}) on port 4226
18-Sep-2021 02:03:32 Only local connections are allowed.
18-Sep-2021 02:03:32 Please see https://chromedriver.chromium.org/security-considerations for suggestions on keeping ChromeDriver safe.
18-Sep-2021 02:03:32 ChromeDriver was started successfully.
18-Sep-2021 02:03:33 Sep 18, 2021 2:03:33 AM org.openqa.selenium.remote.ProtocolHandshake createSession
18-Sep-2021 02:03:33 INFO: Detected dialect: W3C
18-Sep-2021 02:03:43 Tests run: 1, Failures: 0, Errors: 0, Skipped: 0, Time elapsed: 10.442 sec
18-Sep-2021 02:03:43 Running org.openmrs.reference.TransferToWardServiceTest
18-Sep-2021 02:03:43 Running locally...
18-Sep-2021 02:03:43 Starting ChromeDriver 90.0.4430.24 (4c6d850f087da467d926e8eddb76550aed655991-refs/branch-heads/4430@{#429}) on port 13742
18-Sep-2021 02:03:43 Only local connections are allowed.
18-Sep-2021 02:03:43 Please see https://chromedriver.chromium.org/security-considerations for suggestions on keeping ChromeDriver safe.
18-Sep-2021 02:03:43 ChromeDriver was started successfully.
18-Sep-2021 02:03:44 Sep 18, 2021 2:03:44 AM org.openqa.selenium.remote.ProtocolHandshake createSession
18-Sep-2021 02:03:44 INFO: Detected dialect: W3C
18-Sep-2021 02:03:58 Tests run: 1, Failures: 0, Errors: 0, Skipped: 0, Time elapsed: 15.04 sec
18-Sep-2021 02:03:58 Running org.openmrs.reference.EditVisitTypeTest
18-Sep-2021 02:03:58 Running locally...
18-Sep-2021 02:03:58 Starting ChromeDriver 90.0.4430.24 (4c6d850f087da467d926e8eddb76550aed655991-refs/branch-heads/4430@{#429}) on port 9679
18-Sep-2021 02:03:58 Only local connections are allowed.
18-Sep-2021 02:03:58 Please see https://chromedriver.chromium.org/security-considerations for suggestions on keeping ChromeDriver safe.
18-Sep-2021 02:03:58 ChromeDriver was started successfully.
18-Sep-2021 02:03:58 Sep 18, 2021 2:03:58 AM org.openqa.selenium.remote.ProtocolHandshake createSession
18-Sep-2021 02:03:58 INFO: Detected dialect: W3C
18-Sep-2021 02:04:02 Tests run: 1, Failures: 0, Errors: 0, Skipped: 0, Time elapsed: 3.635 sec
18-Sep-2021 02:04:02 Running org.openmrs.reference.ComeBackToApplicationAfterLogoutTest
18-Sep-2021 02:04:02 Running locally...
18-Sep-2021 02:04:02 Starting ChromeDriver 90.0.4430.24 (4c6d850f087da467d926e8eddb76550aed655991-refs/branch-heads/4430@{#429}) on port 25805
18-Sep-2021 02:04:02 Only local connections are allowed.
18-Sep-2021 02:04:02 Please see https://chromedriver.chromium.org/security-considerations for suggestions on keeping ChromeDriver safe.
18-Sep-2021 02:04:02 ChromeDriver was started successfully.
18-Sep-2021 02:04:02 Sep 18, 2021 2:04:02 AM org.openqa.selenium.remote.ProtocolHandshake createSession
18-Sep-2021 02:04:02 INFO: Detected dialect: W3C
18-Sep-2021 02:04:03 Tests run: 1, Failures: 0, Errors: 0, Skipped: 0, Time elapsed: 1.855 sec
18-Sep-2021 02:04:03 Running org.openmrs.reference.EditDemographicTest
18-Sep-2021 02:04:03 Running locally...
18-Sep-2021 02:04:03 Starting ChromeDriver 90.0.4430.24 (4c6d850f087da467d926e8eddb76550aed655991-refs/branch-heads/4430@{#429}) on port 12891
18-Sep-2021 02:04:03 Only local connections are allowed.
18-Sep-2021 02:04:03 Please see https://chromedriver.chromium.org/security-considerations for suggestions on keeping ChromeDriver safe.
18-Sep-2021 02:04:03 ChromeDriver was started successfully.
18-Sep-2021 02:04:04 Sep 18, 2021 2:04:04 AM org.openqa.selenium.remote.ProtocolHandshake createSession
18-Sep-2021 02:04:04 INFO: Detected dialect: W3C
18-Sep-2021 02:04:12 Tests run: 1, Failures: 0, Errors: 0, Skipped: 0, Time elapsed: 8.614 sec
18-Sep-2021 02:04:12 Running org.openmrs.reference.DeleteVisitTypeTest
18-Sep-2021 02:04:12 Running locally...
18-Sep-2021 02:04:12 Starting ChromeDriver 90.0.4430.24 (4c6d850f087da467d926e8eddb76550aed655991-refs/branch-heads/4430@{#429}) on port 12224
18-Sep-2021 02:04:12 Only local connections are allowed.
18-Sep-2021 02:04:12 Please see https://chromedriver.chromium.org/security-considerations for suggestions on keeping ChromeDriver safe.
18-Sep-2021 02:04:12 ChromeDriver was started successfully.
18-Sep-2021 02:04:12 Sep 18, 2021 2:04:12 AM org.openqa.selenium.remote.ProtocolHandshake createSession
18-Sep-2021 02:04:12 INFO: Detected dialect: W3C
18-Sep-2021 02:04:15 Tests run: 1, Failures: 0, Errors: 0, Skipped: 0, Time elapsed: 3.178 sec
18-Sep-2021 02:04:15 Running org.openmrs.reference.FormTest
18-Sep-2021 02:04:15 Running locally...
18-Sep-2021 02:04:15 Starting ChromeDriver 90.0.4430.24 (4c6d850f087da467d926e8eddb76550aed655991-refs/branch-heads/4430@{#429}) on port 14655
18-Sep-2021 02:04:15 Only local connections are allowed.
18-Sep-2021 02:04:15 Please see https://chromedriver.chromium.org/security-considerations for suggestions on keeping ChromeDriver safe.
18-Sep-2021 02:04:15 ChromeDriver was started successfully.
18-Sep-2021 02:04:15 Sep 18, 2021 2:04:15 AM org.openqa.selenium.remote.ProtocolHandshake createSession
18-Sep-2021 02:04:15 INFO: Detected dialect: W3C
18-Sep-2021 02:04:26 Running locally...
18-Sep-2021 02:04:26 Starting ChromeDriver 90.0.4430.24 (4c6d850f087da467d926e8eddb76550aed655991-refs/branch-heads/4430@{#429}) on port 25233
18-Sep-2021 02:04:26 Only local connections are allowed.
18-Sep-2021 02:04:26 Please see https://chromedriver.chromium.org/security-considerations for suggestions on keeping ChromeDriver safe.
18-Sep-2021 02:04:26 ChromeDriver was started successfully.
18-Sep-2021 02:04:26 Sep 18, 2021 2:04:26 AM org.openqa.selenium.remote.ProtocolHandshake createSession
18-Sep-2021 02:04:26 INFO: Detected dialect: W3C
18-Sep-2021 02:04:32 Running locally...
18-Sep-2021 02:04:32 Starting ChromeDriver 90.0.4430.24 (4c6d850f087da467d926e8eddb76550aed655991-refs/branch-heads/4430@{#429}) on port 8011
18-Sep-2021 02:04:32 Only local connections are allowed.
18-Sep-2021 02:04:32 Please see https://chromedriver.chromium.org/security-considerations for suggestions on keeping ChromeDriver safe.
18-Sep-2021 02:04:32 ChromeDriver was started successfully.
18-Sep-2021 02:04:33 Sep 18, 2021 2:04:33 AM org.openqa.selenium.remote.ProtocolHandshake createSession
18-Sep-2021 02:04:33 INFO: Detected dialect: W3C
18-Sep-2021 02:04:36 Running locally...
18-Sep-2021 02:04:36 Starting ChromeDriver 90.0.4430.24 (4c6d850f087da467d926e8eddb76550aed655991-refs/branch-heads/4430@{#429}) on port 21301
18-Sep-2021 02:04:36 Only local connections are allowed.
18-Sep-2021 02:04:36 Please see https://chromedriver.chromium.org/security-considerations for suggestions on keeping ChromeDriver safe.
18-Sep-2021 02:04:36 ChromeDriver was started successfully.
18-Sep-2021 02:04:37 Sep 18, 2021 2:04:37 AM org.openqa.selenium.remote.ProtocolHandshake createSession
18-Sep-2021 02:04:37 INFO: Detected dialect: W3C
18-Sep-2021 02:04:41 Tests run: 4, Failures: 0, Errors: 0, Skipped: 0, Time elapsed: 25.783 sec
18-Sep-2021 02:04:41 Running org.openmrs.reference.RegisterUnidentifiedPatientTest
18-Sep-2021 02:04:41 Running locally...
18-Sep-2021 02:04:41 Starting ChromeDriver 90.0.4430.24 (4c6d850f087da467d926e8eddb76550aed655991-refs/branch-heads/4430@{#429}) on port 3630
18-Sep-2021 02:04:41 Only local connections are allowed.
18-Sep-2021 02:04:41 Please see https://chromedriver.chromium.org/security-considerations for suggestions on keeping ChromeDriver safe.
18-Sep-2021 02:04:41 ChromeDriver was started successfully.
18-Sep-2021 02:04:41 Sep 18, 2021 2:04:41 AM org.openqa.selenium.remote.ProtocolHandshake createSession
18-Sep-2021 02:04:41 INFO: Detected dialect: W3C
18-Sep-2021 02:04:47 Tests run: 1, Failures: 0, Errors: 0, Skipped: 0, Time elapsed: 6.029 sec
18-Sep-2021 02:04:47 Running org.openmrs.reference.AddPatientAppointmentTest
18-Sep-2021 02:04:47 Running locally...
18-Sep-2021 02:04:47 Starting ChromeDriver 90.0.4430.24 (4c6d850f087da467d926e8eddb76550aed655991-refs/branch-heads/4430@{#429}) on port 18532
18-Sep-2021 02:04:47 Only local connections are allowed.
18-Sep-2021 02:04:47 Please see https://chromedriver.chromium.org/security-considerations for suggestions on keeping ChromeDriver safe.
18-Sep-2021 02:04:47 ChromeDriver was started successfully.
18-Sep-2021 02:04:47 Sep 18, 2021 2:04:47 AM org.openqa.selenium.remote.ProtocolHandshake createSession
18-Sep-2021 02:04:47 INFO: Detected dialect: W3C
18-Sep-2021 02:06:53 Tests run: 2, Failures: 0, Errors: 2, Skipped: 0, Time elapsed: 125.509 sec <<< FAILURE!
18-Sep-2021 02:06:53 Running org.openmrs.reference.AdmitExitInpatientTest
18-Sep-2021 02:06:53 Running locally...
18-Sep-2021 02:06:53 Starting ChromeDriver 90.0.4430.24 (4c6d850f087da467d926e8eddb76550aed655991-refs/branch-heads/4430@{#429}) on port 13990
18-Sep-2021 02:06:53 Only local connections are allowed.
18-Sep-2021 02:06:53 Please see https://chromedriver.chromium.org/security-considerations for suggestions on keeping ChromeDriver safe.
18-Sep-2021 02:06:53 ChromeDriver was started successfully.
18-Sep-2021 02:06:53 Sep 18, 2021 2:06:53 AM org.openqa.selenium.remote.ProtocolHandshake createSession
18-Sep-2021 02:06:53 INFO: Detected dialect: W3C
18-Sep-2021 02:07:06 Tests run: 1, Failures: 0, Errors: 0, Skipped: 0, Time elapsed: 13.619 sec
18-Sep-2021 02:07:06 Running org.openmrs.reference.DeleteRequestAppointmentTest
18-Sep-2021 02:07:06 Running locally...
18-Sep-2021 02:07:06 Starting ChromeDriver 90.0.4430.24 (4c6d850f087da467d926e8eddb76550aed655991-refs/branch-heads/4430@{#429}) on port 21124
18-Sep-2021 02:07:06 Only local connections are allowed.
18-Sep-2021 02:07:06 Please see https://chromedriver.chromium.org/security-considerations for suggestions on keeping ChromeDriver safe.
18-Sep-2021 02:07:06 ChromeDriver was started successfully.
18-Sep-2021 02:07:06 Sep 18, 2021 2:07:06 AM org.openqa.selenium.remote.ProtocolHandshake createSession
18-Sep-2021 02:07:06 INFO: Detected dialect: W3C
18-Sep-2021 02:07:21 Tests run: 1, Failures: 0, Errors: 0, Skipped: 0, Time elapsed: 14.611 sec
18-Sep-2021 02:07:21 Running org.openmrs.reference.EditAllergyTest
18-Sep-2021 02:07:21 Running locally...
18-Sep-2021 02:07:21 Starting ChromeDriver 90.0.4430.24 (4c6d850f087da467d926e8eddb76550aed655991-refs/branch-heads/4430@{#429}) on port 15756
18-Sep-2021 02:07:21 Only local connections are allowed.
18-Sep-2021 02:07:21 Please see https://chromedriver.chromium.org/security-considerations for suggestions on keeping ChromeDriver safe.
18-Sep-2021 02:07:21 ChromeDriver was started successfully.
18-Sep-2021 02:07:21 Sep 18, 2021 2:07:21 AM org.openqa.selenium.remote.ProtocolHandshake createSession
18-Sep-2021 02:07:21 INFO: Detected dialect: W3C
18-Sep-2021 02:07:30 Tests run: 1, Failures: 0, Errors: 0, Skipped: 0, Time elapsed: 9.379 sec
18-Sep-2021 02:07:30 Running org.openmrs.reference.VisitNoteTest
18-Sep-2021 02:07:30 Running locally...
18-Sep-2021 02:07:30 Starting ChromeDriver 90.0.4430.24 (4c6d850f087da467d926e8eddb76550aed655991-refs/branch-heads/4430@{#429}) on port 12626
18-Sep-2021 02:07:30 Only local connections are allowed.
18-Sep-2021 02:07:30 Please see https://chromedriver.chromium.org/security-considerations for suggestions on keeping ChromeDriver safe.
18-Sep-2021 02:07:30 ChromeDriver was started successfully.
18-Sep-2021 02:07:31 Sep 18, 2021 2:07:31 AM org.openqa.selenium.remote.ProtocolHandshake createSession
18-Sep-2021 02:07:31 INFO: Detected dialect: W3C
18-Sep-2021 02:07:55 Tests run: 1, Failures: 0, Errors: 0, Skipped: 0, Time elapsed: 24.931 sec
18-Sep-2021 02:07:55 Running org.openmrs.reference.CreatePersonTest
18-Sep-2021 02:07:55 Running locally...
18-Sep-2021 02:07:55 Starting ChromeDriver 90.0.4430.24 (4c6d850f087da467d926e8eddb76550aed655991-refs/branch-heads/4430@{#429}) on port 12345
18-Sep-2021 02:07:55 Only local connections are allowed.
18-Sep-2021 02:07:55 Please see https://chromedriver.chromium.org/security-considerations for suggestions on keeping ChromeDriver safe.
18-Sep-2021 02:07:55 ChromeDriver was started successfully.
18-Sep-2021 02:07:55 Sep 18, 2021 2:07:55 AM org.openqa.selenium.remote.ProtocolHandshake createSession
18-Sep-2021 02:07:55 INFO: Detected dialect: W3C
18-Sep-2021 02:08:02 Tests run: 1, Failures: 0, Errors: 0, Skipped: 0, Time elapsed: 7.254 sec
18-Sep-2021 02:08:02 Running org.openmrs.reference.FindPatientByNameTest
18-Sep-2021 02:08:02 Running locally...
18-Sep-2021 02:08:02 Starting ChromeDriver 90.0.4430.24 (4c6d850f087da467d926e8eddb76550aed655991-refs/branch-heads/4430@{#429}) on port 13173
18-Sep-2021 02:08:02 Only local connections are allowed.
18-Sep-2021 02:08:02 Please see https://chromedriver.chromium.org/security-considerations for suggestions on keeping ChromeDriver safe.
18-Sep-2021 02:08:02 ChromeDriver was started successfully.
18-Sep-2021 02:08:03 Sep 18, 2021 2:08:03 AM org.openqa.selenium.remote.ProtocolHandshake createSession
18-Sep-2021 02:08:03 INFO: Detected dialect: W3C
18-Sep-2021 02:08:09 Tests run: 1, Failures: 0, Errors: 0, Skipped: 0, Time elapsed: 6.598 sec
18-Sep-2021 02:08:09 Running org.openmrs.reference.AddUserTest
18-Sep-2021 02:08:09 Running locally...
18-Sep-2021 02:08:09 Starting ChromeDriver 90.0.4430.24 (4c6d850f087da467d926e8eddb76550aed655991-refs/branch-heads/4430@{#429}) on port 20724
18-Sep-2021 02:08:09 Only local connections are allowed.
18-Sep-2021 02:08:09 Please see https://chromedriver.chromium.org/security-considerations for suggestions on keeping ChromeDriver safe.
18-Sep-2021 02:08:09 ChromeDriver was started successfully.
18-Sep-2021 02:08:09 Sep 18, 2021 2:08:09 AM org.openqa.selenium.remote.ProtocolHandshake createSession
18-Sep-2021 02:08:09 INFO: Detected dialect: W3C
18-Sep-2021 02:08:24 Tests run: 1, Failures: 0, Errors: 0, Skipped: 0, Time elapsed: 14.713 sec
18-Sep-2021 02:08:24 Running org.openmrs.reference.AddProviderTest
18-Sep-2021 02:08:24 Running locally...
18-Sep-2021 02:08:24 Starting ChromeDriver 90.0.4430.24 (4c6d850f087da467d926e8eddb76550aed655991-refs/branch-heads/4430@{#429}) on port 13710
18-Sep-2021 02:08:24 Only local connections are allowed.
18-Sep-2021 02:08:24 Please see https://chromedriver.chromium.org/security-considerations for suggestions on keeping ChromeDriver safe.
18-Sep-2021 02:08:24 ChromeDriver was started successfully.
18-Sep-2021 02:08:24 Sep 18, 2021 2:08:24 AM org.openqa.selenium.remote.ProtocolHandshake createSession
18-Sep-2021 02:08:24 INFO: Detected dialect: W3C
18-Sep-2021 02:08:35 Tests run: 1, Failures: 0, Errors: 0, Skipped: 0, Time elapsed: 11.327 sec
18-Sep-2021 02:08:35 Running org.openmrs.reference.AddPastVisitTest
18-Sep-2021 02:08:36 Running locally...
18-Sep-2021 02:08:36 Starting ChromeDriver 90.0.4430.24 (4c6d850f087da467d926e8eddb76550aed655991-refs/branch-heads/4430@{#429}) on port 22465
18-Sep-2021 02:08:36 Only local connections are allowed.
18-Sep-2021 02:08:36 Please see https://chromedriver.chromium.org/security-considerations for suggestions on keeping ChromeDriver safe.
18-Sep-2021 02:08:36 ChromeDriver was started successfully.
18-Sep-2021 02:08:36 Sep 18, 2021 2:08:36 AM org.openqa.selenium.remote.ProtocolHandshake createSession
18-Sep-2021 02:08:36 INFO: Detected dialect: W3C
18-Sep-2021 02:08:44 Tests run: 1, Failures: 0, Errors: 0, Skipped: 0, Time elapsed: 9.353 sec
18-Sep-2021 02:08:44 Running org.openmrs.reference.RecordMergeIssueTest
18-Sep-2021 02:08:44 Running locally...
18-Sep-2021 02:08:44 Starting ChromeDriver 90.0.4430.24 (4c6d850f087da467d926e8eddb76550aed655991-refs/branch-heads/4430@{#429}) on port 18008
18-Sep-2021 02:08:44 Only local connections are allowed.
18-Sep-2021 02:08:44 Please see https://chromedriver.chromium.org/security-considerations for suggestions on keeping ChromeDriver safe.
18-Sep-2021 02:08:44 ChromeDriver was started successfully.
18-Sep-2021 02:08:45 Sep 18, 2021 2:08:45 AM org.openqa.selenium.remote.ProtocolHandshake createSession
18-Sep-2021 02:08:45 INFO: Detected dialect: W3C
18-Sep-2021 02:08:57 Tests run: 1, Failures: 0, Errors: 0, Skipped: 0, Time elapsed: 12.742 sec
18-Sep-2021 02:08:57 Running org.openmrs.reference.CaptureVitalsTest
18-Sep-2021 02:08:57 Running locally...
18-Sep-2021 02:08:57 Starting ChromeDriver 90.0.4430.24 (4c6d850f087da467d926e8eddb76550aed655991-refs/branch-heads/4430@{#429}) on port 23073
18-Sep-2021 02:08:57 Only local connections are allowed.
18-Sep-2021 02:08:57 Please see https://chromedriver.chromium.org/security-considerations for suggestions on keeping ChromeDriver safe.
18-Sep-2021 02:08:57 ChromeDriver was started successfully.
18-Sep-2021 02:08:57 Sep 18, 2021 2:08:57 AM org.openqa.selenium.remote.ProtocolHandshake createSession
18-Sep-2021 02:08:57 INFO: Detected dialect: W3C
18-Sep-2021 02:09:07 Tests run: 1, Failures: 0, Errors: 0, Skipped: 0, Time elapsed: 9.774 sec
18-Sep-2021 02:09:07 Running org.openmrs.reference.NamePatientAccentedLetterTest
18-Sep-2021 02:09:07 Running locally...
18-Sep-2021 02:09:07 Starting ChromeDriver 90.0.4430.24 (4c6d850f087da467d926e8eddb76550aed655991-refs/branch-heads/4430@{#429}) on port 31463
18-Sep-2021 02:09:07 Only local connections are allowed.
18-Sep-2021 02:09:07 Please see https://chromedriver.chromium.org/security-considerations for suggestions on keeping ChromeDriver safe.
18-Sep-2021 02:09:07 ChromeDriver was started successfully.
18-Sep-2021 02:09:07 Sep 18, 2021 2:09:07 AM org.openqa.selenium.remote.ProtocolHandshake createSession
18-Sep-2021 02:09:07 INFO: Detected dialect: W3C
18-Sep-2021 02:09:14 Tests run: 1, Failures: 0, Errors: 0, Skipped: 0, Time elapsed: 7.472 sec
18-Sep-2021 02:09:14 Running org.openmrs.reference.RetirePersonTest
18-Sep-2021 02:09:14 Running locally...
18-Sep-2021 02:09:14 Starting ChromeDriver 90.0.4430.24 (4c6d850f087da467d926e8eddb76550aed655991-refs/branch-heads/4430@{#429}) on port 19324
18-Sep-2021 02:09:14 Only local connections are allowed.
18-Sep-2021 02:09:14 Please see https://chromedriver.chromium.org/security-considerations for suggestions on keeping ChromeDriver safe.
18-Sep-2021 02:09:14 ChromeDriver was started successfully.
18-Sep-2021 02:09:15 Sep 18, 2021 2:09:15 AM org.openqa.selenium.remote.ProtocolHandshake createSession
18-Sep-2021 02:09:15 INFO: Detected dialect: W3C
18-Sep-2021 02:09:19 Tests run: 1, Failures: 0, Errors: 0, Skipped: 0, Time elapsed: 4.912 sec
18-Sep-2021 02:09:19 Running org.openmrs.reference.EndVisitTest
18-Sep-2021 02:09:19 Running locally...
18-Sep-2021 02:09:19 Starting ChromeDriver 90.0.4430.24 (4c6d850f087da467d926e8eddb76550aed655991-refs/branch-heads/4430@{#429}) on port 7318
18-Sep-2021 02:09:19 Only local connections are allowed.
18-Sep-2021 02:09:19 Please see https://chromedriver.chromium.org/security-considerations for suggestions on keeping ChromeDriver safe.
18-Sep-2021 02:09:19 ChromeDriver was started successfully.
18-Sep-2021 02:09:20 Sep 18, 2021 2:09:20 AM org.openqa.selenium.remote.ProtocolHandshake createSession
18-Sep-2021 02:09:20 INFO: Detected dialect: W3C
18-Sep-2021 02:09:30 Tests run: 1, Failures: 0, Errors: 0, Skipped: 0, Time elapsed: 10.849 sec
18-Sep-2021 02:09:30 Running org.openmrs.reference.DeleteAppointmentBlockTest
18-Sep-2021 02:09:30 Running locally...
18-Sep-2021 02:09:30 Starting ChromeDriver 90.0.4430.24 (4c6d850f087da467d926e8eddb76550aed655991-refs/branch-heads/4430@{#429}) on port 13350
18-Sep-2021 02:09:30 Only local connections are allowed.
18-Sep-2021 02:09:30 Please see https://chromedriver.chromium.org/security-considerations for suggestions on keeping ChromeDriver safe.
18-Sep-2021 02:09:30 ChromeDriver was started successfully.
18-Sep-2021 02:09:30 Sep 18, 2021 2:09:30 AM org.openqa.selenium.remote.ProtocolHandshake createSession
18-Sep-2021 02:09:30 INFO: Detected dialect: W3C
18-Sep-2021 02:09:36 Tests run: 1, Failures: 0, Errors: 0, Skipped: 0, Time elapsed: 5.53 sec
18-Sep-2021 02:09:36 Running org.openmrs.reference.BookRequestAppointmentTest
18-Sep-2021 02:09:36 Running locally...
18-Sep-2021 02:09:36 Starting ChromeDriver 90.0.4430.24 (4c6d850f087da467d926e8eddb76550aed655991-refs/branch-heads/4430@{#429}) on port 13231
18-Sep-2021 02:09:36 Only local connections are allowed.
18-Sep-2021 02:09:36 Please see https://chromedriver.chromium.org/security-considerations for suggestions on keeping ChromeDriver safe.
18-Sep-2021 02:09:36 ChromeDriver was started successfully.
18-Sep-2021 02:09:36 Sep 18, 2021 2:09:36 AM org.openqa.selenium.remote.ProtocolHandshake createSession
18-Sep-2021 02:09:36 INFO: Detected dialect: W3C
18-Sep-2021 02:11:47 Tests run: 2, Failures: 0, Errors: 2, Skipped: 0, Time elapsed: 130.933 sec <<< FAILURE!
18-Sep-2021 02:11:47 Running org.openmrs.reference.AddDeleteServiceTest
18-Sep-2021 02:11:47 Running locally...
18-Sep-2021 02:11:47 Starting ChromeDriver 90.0.4430.24 (4c6d850f087da467d926e8eddb76550aed655991-refs/branch-heads/4430@{#429}) on port 1808
18-Sep-2021 02:11:47 Only local connections are allowed.
18-Sep-2021 02:11:47 Please see https://chromedriver.chromium.org/security-considerations for suggestions on keeping ChromeDriver safe.
18-Sep-2021 02:11:47 ChromeDriver was started successfully.
18-Sep-2021 02:11:47 Sep 18, 2021 2:11:47 AM org.openqa.selenium.remote.ProtocolHandshake createSession
18-Sep-2021 02:11:47 INFO: Detected dialect: W3C
18-Sep-2021 02:11:53 Tests run: 1, Failures: 0, Errors: 0, Skipped: 0, Time elapsed: 5.904 sec
18-Sep-2021 02:11:53 Running org.openmrs.reference.AddEditAppointmentBlockTest
18-Sep-2021 02:11:53 Running locally...
18-Sep-2021 02:11:53 Starting ChromeDriver 90.0.4430.24 (4c6d850f087da467d926e8eddb76550aed655991-refs/branch-heads/4430@{#429}) on port 26647
18-Sep-2021 02:11:53 Only local connections are allowed.
18-Sep-2021 02:11:53 Please see https://chromedriver.chromium.org/security-considerations for suggestions on keeping ChromeDriver safe.
18-Sep-2021 02:11:53 ChromeDriver was started successfully.
18-Sep-2021 02:11:53 Sep 18, 2021 2:11:53 AM org.openqa.selenium.remote.ProtocolHandshake createSession
18-Sep-2021 02:11:53 INFO: Detected dialect: W3C
18-Sep-2021 02:11:59 Tests run: 1, Failures: 0, Errors: 0, Skipped: 0, Time elapsed: 6.535 sec
18-Sep-2021 02:11:59 Running org.openmrs.reference.RetireProviderTest
18-Sep-2021 02:11:59 Running locally...
18-Sep-2021 02:11:59 Starting ChromeDriver 90.0.4430.24 (4c6d850f087da467d926e8eddb76550aed655991-refs/branch-heads/4430@{#429}) on port 21083
18-Sep-2021 02:11:59 Only local connections are allowed.
18-Sep-2021 02:11:59 Please see https://chromedriver.chromium.org/security-considerations for suggestions on keeping ChromeDriver safe.
18-Sep-2021 02:11:59 ChromeDriver was started successfully.
18-Sep-2021 02:11:59 Sep 18, 2021 2:11:59 AM org.openqa.selenium.remote.ProtocolHandshake createSession
18-Sep-2021 02:11:59 INFO: Detected dialect: W3C
18-Sep-2021 02:12:04 Tests run: 1, Failures: 0, Errors: 0, Skipped: 0, Time elapsed: 4.495 sec
18-Sep-2021 02:12:04 Running org.openmrs.reference.MergePatientTest
18-Sep-2021 02:12:04 Running locally...
18-Sep-2021 02:12:04 Starting ChromeDriver 90.0.4430.24 (4c6d850f087da467d926e8eddb76550aed655991-refs/branch-heads/4430@{#429}) on port 18189
18-Sep-2021 02:12:04 Only local connections are allowed.
18-Sep-2021 02:12:04 Please see https://chromedriver.chromium.org/security-considerations for suggestions on keeping ChromeDriver safe.
18-Sep-2021 02:12:04 ChromeDriver was started successfully.
18-Sep-2021 02:12:04 Sep 18, 2021 2:12:04 AM org.openqa.selenium.remote.ProtocolHandshake createSession
18-Sep-2021 02:12:04 INFO: Detected dialect: W3C
18-Sep-2021 02:12:11 Tests run: 1, Failures: 0, Errors: 0, Skipped: 0, Time elapsed: 6.885 sec
18-Sep-2021 02:12:11 Running org.openmrs.reference.AddDeleteLocationTest
18-Sep-2021 02:12:11 Running locally...
18-Sep-2021 02:12:11 Starting ChromeDriver 90.0.4430.24 (4c6d850f087da467d926e8eddb76550aed655991-refs/branch-heads/4430@{#429}) on port 27223
18-Sep-2021 02:12:11 Only local connections are allowed.
18-Sep-2021 02:12:11 Please see https://chromedriver.chromium.org/security-considerations for suggestions on keeping ChromeDriver safe.
18-Sep-2021 02:12:11 ChromeDriver was started successfully.
18-Sep-2021 02:12:11 Sep 18, 2021 2:12:11 AM org.openqa.selenium.remote.ProtocolHandshake createSession
18-Sep-2021 02:12:11 INFO: Detected dialect: W3C
18-Sep-2021 02:12:16 Tests run: 1, Failures: 0, Errors: 0, Skipped: 0, Time elapsed: 5.177 sec
18-Sep-2021 02:12:16 Running org.openmrs.reference.DuplicatePatientRegisterTest
18-Sep-2021 02:12:16 Running locally...
18-Sep-2021 02:12:16 Starting ChromeDriver 90.0.4430.24 (4c6d850f087da467d926e8eddb76550aed655991-refs/branch-heads/4430@{#429}) on port 1590
18-Sep-2021 02:12:16 Only local connections are allowed.
18-Sep-2021 02:12:16 Please see https://chromedriver.chromium.org/security-considerations for suggestions on keeping ChromeDriver safe.
18-Sep-2021 02:12:16 ChromeDriver was started successfully.
18-Sep-2021 02:12:16 Sep 18, 2021 2:12:16 AM org.openqa.selenium.remote.ProtocolHandshake createSession
18-Sep-2021 02:12:16 INFO: Detected dialect: W3C
18-Sep-2021 02:12:28 Tests run: 1, Failures: 0, Errors: 0, Skipped: 0, Time elapsed: 11.957 sec
18-Sep-2021 02:12:28 Running org.openmrs.reference.UsingBackButtonInMergePatientTest
18-Sep-2021 02:12:28 Running locally...
18-Sep-2021 02:12:28 Starting ChromeDriver 90.0.4430.24 (4c6d850f087da467d926e8eddb76550aed655991-refs/branch-heads/4430@{#429}) on port 13532
18-Sep-2021 02:12:28 Only local connections are allowed.
18-Sep-2021 02:12:28 Please see https://chromedriver.chromium.org/security-considerations for suggestions on keeping ChromeDriver safe.
18-Sep-2021 02:12:28 ChromeDriver was started successfully.
18-Sep-2021 02:12:28 Sep 18, 2021 2:12:28 AM org.openqa.selenium.remote.ProtocolHandshake createSession
18-Sep-2021 02:12:28 INFO: Detected dialect: W3C
18-Sep-2021 02:12:40 Tests run: 1, Failures: 0, Errors: 0, Skipped: 0, Time elapsed: 12.034 sec
18-Sep-2021 02:12:40 Running org.openmrs.reference.AddDiagnosisToVisitNoteTest
18-Sep-2021 02:12:40 Running locally...
18-Sep-2021 02:12:40 Starting ChromeDriver 90.0.4430.24 (4c6d850f087da467d926e8eddb76550aed655991-refs/branch-heads/4430@{#429}) on port 5826
18-Sep-2021 02:12:40 Only local connections are allowed.
18-Sep-2021 02:12:40 Please see https://chromedriver.chromium.org/security-considerations for suggestions on keeping ChromeDriver safe.
18-Sep-2021 02:12:40 ChromeDriver was started successfully.
18-Sep-2021 02:12:40 Sep 18, 2021 2:12:40 AM org.openqa.selenium.remote.ProtocolHandshake createSession
18-Sep-2021 02:12:40 INFO: Detected dialect: W3C
18-Sep-2021 02:12:51 Tests run: 1, Failures: 0, Errors: 0, Skipped: 0, Time elapsed: 11.491 sec
18-Sep-2021 02:12:51 Running org.openmrs.reference.MergeVisitsTest
18-Sep-2021 02:12:51 Running locally...
18-Sep-2021 02:12:51 Starting ChromeDriver 90.0.4430.24 (4c6d850f087da467d926e8eddb76550aed655991-refs/branch-heads/4430@{#429}) on port 29497
18-Sep-2021 02:12:51 Only local connections are allowed.
18-Sep-2021 02:12:51 Please see https://chromedriver.chromium.org/security-considerations for suggestions on keeping ChromeDriver safe.
18-Sep-2021 02:12:51 ChromeDriver was started successfully.
18-Sep-2021 02:12:52 Sep 18, 2021 2:12:52 AM org.openqa.selenium.remote.ProtocolHandshake createSession
18-Sep-2021 02:12:52 INFO: Detected dialect: W3C
18-Sep-2021 02:13:02 Tests run: 1, Failures: 0, Errors: 0, Skipped: 0, Time elapsed: 10.788 sec
18-Sep-2021 02:13:02 Running org.openmrs.reference.EditServiceTest
18-Sep-2021 02:13:02 Running locally...
18-Sep-2021 02:13:02 Starting ChromeDriver 90.0.4430.24 (4c6d850f087da467d926e8eddb76550aed655991-refs/branch-heads/4430@{#429}) on port 15500
18-Sep-2021 02:13:02 Only local connections are allowed.
18-Sep-2021 02:13:02 Please see https://chromedriver.chromium.org/security-considerations for suggestions on keeping ChromeDriver safe.
18-Sep-2021 02:13:02 ChromeDriver was started successfully.
18-Sep-2021 02:13:02 Sep 18, 2021 2:13:02 AM org.openqa.selenium.remote.ProtocolHandshake createSession
18-Sep-2021 02:13:02 INFO: Detected dialect: W3C
18-Sep-2021 02:13:07 Tests run: 1, Failures: 0, Errors: 0, Skipped: 0, Time elapsed: 5.21 sec
18-Sep-2021 02:13:07 Running org.openmrs.reference.AddNewAllergyTest
18-Sep-2021 02:13:07 Running locally...
18-Sep-2021 02:13:07 Starting ChromeDriver 90.0.4430.24 (4c6d850f087da467d926e8eddb76550aed655991-refs/branch-heads/4430@{#429}) on port 25555
18-Sep-2021 02:13:07 Only local connections are allowed.
18-Sep-2021 02:13:07 Please see https://chromedriver.chromium.org/security-considerations for suggestions on keeping ChromeDriver safe.
18-Sep-2021 02:13:07 ChromeDriver was started successfully.
18-Sep-2021 02:13:08 Sep 18, 2021 2:13:08 AM org.openqa.selenium.remote.ProtocolHandshake createSession
18-Sep-2021 02:13:08 INFO: Detected dialect: W3C
18-Sep-2021 02:13:15 Tests run: 1, Failures: 0, Errors: 0, Skipped: 0, Time elapsed: 7.417 sec
18-Sep-2021 02:13:15 Running org.openmrs.reference.LoginTest
18-Sep-2021 02:13:15 Running locally...
18-Sep-2021 02:13:15 Starting ChromeDriver 90.0.4430.24 (4c6d850f087da467d926e8eddb76550aed655991-refs/branch-heads/4430@{#429}) on port 7802
18-Sep-2021 02:13:15 Only local connections are allowed.
18-Sep-2021 02:13:15 Please see https://chromedriver.chromium.org/security-considerations for suggestions on keeping ChromeDriver safe.
18-Sep-2021 02:13:15 ChromeDriver was started successfully.
18-Sep-2021 02:13:15 Sep 18, 2021 2:13:15 AM org.openqa.selenium.remote.ProtocolHandshake createSession
18-Sep-2021 02:13:15 INFO: Detected dialect: W3C
18-Sep-2021 02:13:17 Running locally...
18-Sep-2021 02:13:17 Starting ChromeDriver 90.0.4430.24 (4c6d850f087da467d926e8eddb76550aed655991-refs/branch-heads/4430@{#429}) on port 31566
18-Sep-2021 02:13:17 Only local connections are allowed.
18-Sep-2021 02:13:17 Please see https://chromedriver.chromium.org/security-considerations for suggestions on keeping ChromeDriver safe.
18-Sep-2021 02:13:17 ChromeDriver was started successfully.
18-Sep-2021 02:13:17 Sep 18, 2021 2:13:17 AM org.openqa.selenium.remote.ProtocolHandshake createSession
18-Sep-2021 02:13:17 INFO: Detected dialect: W3C
18-Sep-2021 02:13:19 Running locally...
18-Sep-2021 02:13:19 Starting ChromeDriver 90.0.4430.24 (4c6d850f087da467d926e8eddb76550aed655991-refs/branch-heads/4430@{#429}) on port 18954
18-Sep-2021 02:13:19 Only local connections are allowed.
18-Sep-2021 02:13:19 Please see https://chromedriver.chromium.org/security-considerations for suggestions on keeping ChromeDriver safe.
18-Sep-2021 02:13:19 ChromeDriver was started successfully.
18-Sep-2021 02:13:19 Sep 18, 2021 2:13:19 AM org.openqa.selenium.remote.ProtocolHandshake createSession
18-Sep-2021 02:13:19 INFO: Detected dialect: W3C
18-Sep-2021 02:13:21 Running locally...
18-Sep-2021 02:13:22 Starting ChromeDriver 90.0.4430.24 (4c6d850f087da467d926e8eddb76550aed655991-refs/branch-heads/4430@{#429}) on port 5353
18-Sep-2021 02:13:22 Only local connections are allowed.
18-Sep-2021 02:13:22 Please see https://chromedriver.chromium.org/security-considerations for suggestions on keeping ChromeDriver safe.
18-Sep-2021 02:13:22 ChromeDriver was started successfully.
18-Sep-2021 02:13:22 Sep 18, 2021 2:13:22 AM org.openqa.selenium.remote.ProtocolHandshake createSession
18-Sep-2021 02:13:22 INFO: Detected dialect: W3C
18-Sep-2021 02:13:24 Running locally...
18-Sep-2021 02:13:24 Starting ChromeDriver 90.0.4430.24 (4c6d850f087da467d926e8eddb76550aed655991-refs/branch-heads/4430@{#429}) on port 18554
18-Sep-2021 02:13:24 Only local connections are allowed.
18-Sep-2021 02:13:24 Please see https://chromedriver.chromium.org/security-considerations for suggestions on keeping ChromeDriver safe.
18-Sep-2021 02:13:24 ChromeDriver was started successfully.
18-Sep-2021 02:13:24 Sep 18, 2021 2:13:24 AM org.openqa.selenium.remote.ProtocolHandshake createSession
18-Sep-2021 02:13:24 INFO: Detected dialect: W3C
18-Sep-2021 02:13:26 Tests run: 5, Failures: 0, Errors: 0, Skipped: 0, Time elapsed: 11.613 sec
18-Sep-2021 02:13:26 Running org.openmrs.reference.DeleteProviderTest
18-Sep-2021 02:13:26 Running locally...
18-Sep-2021 02:13:26 Starting ChromeDriver 90.0.4430.24 (4c6d850f087da467d926e8eddb76550aed655991-refs/branch-heads/4430@{#429}) on port 8617
18-Sep-2021 02:13:26 Only local connections are allowed.
18-Sep-2021 02:13:26 Please see https://chromedriver.chromium.org/security-considerations for suggestions on keeping ChromeDriver safe.
18-Sep-2021 02:13:26 ChromeDriver was started successfully.
18-Sep-2021 02:13:27 Sep 18, 2021 2:13:27 AM org.openqa.selenium.remote.ProtocolHandshake createSession
18-Sep-2021 02:13:27 INFO: Detected dialect: W3C
18-Sep-2021 02:13:31 Tests run: 1, Failures: 0, Errors: 0, Skipped: 0, Time elapsed: 4.445 sec
18-Sep-2021 02:13:31 Running org.openmrs.reference.RegisterPatientTest
18-Sep-2021 02:13:31 Running locally...
18-Sep-2021 02:13:31 Starting ChromeDriver 90.0.4430.24 (4c6d850f087da467d926e8eddb76550aed655991-refs/branch-heads/4430@{#429}) on port 20835
18-Sep-2021 02:13:31 Only local connections are allowed.
18-Sep-2021 02:13:31 Please see https://chromedriver.chromium.org/security-considerations for suggestions on keeping ChromeDriver safe.
18-Sep-2021 02:13:31 ChromeDriver was started successfully.
18-Sep-2021 02:13:31 Sep 18, 2021 2:13:31 AM org.openqa.selenium.remote.ProtocolHandshake createSession
18-Sep-2021 02:13:31 INFO: Detected dialect: W3C
18-Sep-2021 02:13:39 Tests run: 1, Failures: 0, Errors: 0, Skipped: 0, Time elapsed: 7.968 sec
18-Sep-2021 02:13:39 Running org.openmrs.reference.ContactInfoTest
18-Sep-2021 02:13:39 Running locally...
18-Sep-2021 02:13:39 Starting ChromeDriver 90.0.4430.24 (4c6d850f087da467d926e8eddb76550aed655991-refs/branch-heads/4430@{#429}) on port 23623
18-Sep-2021 02:13:39 Only local connections are allowed.
18-Sep-2021 02:13:39 Please see https://chromedriver.chromium.org/security-considerations for suggestions on keeping ChromeDriver safe.
18-Sep-2021 02:13:39 ChromeDriver was started successfully.
18-Sep-2021 02:13:39 Sep 18, 2021 2:13:39 AM org.openqa.selenium.remote.ProtocolHandshake createSession
18-Sep-2021 02:13:39 INFO: Detected dialect: W3C
18-Sep-2021 02:13:50 Tests run: 1, Failures: 0, Errors: 0, Skipped: 0, Time elapsed: 11.493 sec
18-Sep-2021 02:13:50 Running org.openmrs.reference.StartVisitTest
18-Sep-2021 02:13:50 Running locally...
18-Sep-2021 02:13:50 Starting ChromeDriver 90.0.4430.24 (4c6d850f087da467d926e8eddb76550aed655991-refs/branch-heads/4430@{#429}) on port 18695
18-Sep-2021 02:13:50 Only local connections are allowed.
18-Sep-2021 02:13:50 Please see https://chromedriver.chromium.org/security-considerations for suggestions on keeping ChromeDriver safe.
18-Sep-2021 02:13:50 ChromeDriver was started successfully.
18-Sep-2021 02:13:51 Sep 18, 2021 2:13:51 AM org.openqa.selenium.remote.ProtocolHandshake createSession
18-Sep-2021 02:13:51 INFO: Detected dialect: W3C
18-Sep-2021 02:13:58 Tests run: 1, Failures: 0, Errors: 0, Skipped: 0, Time elapsed: 7.715 sec
18-Sep-2021 02:13:58 Running org.openmrs.reference.DeletePersonTest
18-Sep-2021 02:13:58 Running locally...
18-Sep-2021 02:13:58 Starting ChromeDriver 90.0.4430.24 (4c6d850f087da467d926e8eddb76550aed655991-refs/branch-heads/4430@{#429}) on port 13847
18-Sep-2021 02:13:58 Only local connections are allowed.
18-Sep-2021 02:13:58 Please see https://chromedriver.chromium.org/security-considerations for suggestions on keeping ChromeDriver safe.
18-Sep-2021 02:13:58 ChromeDriver was started successfully.
18-Sep-2021 02:13:58 Sep 18, 2021 2:13:58 AM org.openqa.selenium.remote.ProtocolHandshake createSession
18-Sep-2021 02:13:58 INFO: Detected dialect: W3C
18-Sep-2021 02:14:02 Tests run: 1, Failures: 0, Errors: 0, Skipped: 0, Time elapsed: 4.321 sec
18-Sep-2021 02:14:02 Running org.openmrs.reference.EditProviderTest
18-Sep-2021 02:14:02 Running locally...
18-Sep-2021 02:14:02 Starting ChromeDriver 90.0.4430.24 (4c6d850f087da467d926e8eddb76550aed655991-refs/branch-heads/4430@{#429}) on port 29651
18-Sep-2021 02:14:02 Only local connections are allowed.
18-Sep-2021 02:14:02 Please see https://chromedriver.chromium.org/security-considerations for suggestions on keeping ChromeDriver safe.
18-Sep-2021 02:14:02 ChromeDriver was started successfully.
18-Sep-2021 02:14:03 Sep 18, 2021 2:14:03 AM org.openqa.selenium.remote.ProtocolHandshake createSession
18-Sep-2021 02:14:03 INFO: Detected dialect: W3C
18-Sep-2021 02:14:08 Tests run: 1, Failures: 0, Errors: 0, Skipped: 0, Time elapsed: 5.17 sec
18-Sep-2021 02:14:08 Running org.openmrs.reference.RetireVisitTypeTest
18-Sep-2021 02:14:08 Running locally...
18-Sep-2021 02:14:08 Starting ChromeDriver 90.0.4430.24 (4c6d850f087da467d926e8eddb76550aed655991-refs/branch-heads/4430@{#429}) on port 26484
18-Sep-2021 02:14:08 Only local connections are allowed.
18-Sep-2021 02:14:08 Please see https://chromedriver.chromium.org/security-considerations for suggestions on keeping ChromeDriver safe.
18-Sep-2021 02:14:08 ChromeDriver was started successfully.
18-Sep-2021 02:14:08 Sep 18, 2021 2:14:08 AM org.openqa.selenium.remote.ProtocolHandshake createSession
18-Sep-2021 02:14:08 INFO: Detected dialect: W3C
18-Sep-2021 02:14:11 Tests run: 1, Failures: 0, Errors: 0, Skipped: 0, Time elapsed: 3.707 sec
18-Sep-2021 02:14:12
18-Sep-2021 02:14:12 Results :
18-Sep-2021 02:14:12
18-Sep-2021 02:14:12 Tests in error:
18-Sep-2021 02:14:12   addPatientAppointmentTest(org.openmrs.reference.AddPatientAppointmentTest): Error communicating with the remote browser. It may have died.(..)
18-Sep-2021 02:14:12   addPatientAppointmentTest(org.openmrs.reference.AddPatientAppointmentTest): Session ID is null. Using WebDriver after calling quit()?(..)
18-Sep-2021 02:14:12   bookRequestAppointmentTest(org.openmrs.reference.BookRequestAppointmentTest): Error communicating with the remote browser. It may have died.(..)
18-Sep-2021 02:14:12   bookRequestAppointmentTest(org.openmrs.reference.BookRequestAppointmentTest): Session ID is null. Using WebDriver after calling quit()?(..)
18-Sep-2021 02:14:12
18-Sep-2021 02:14:12 Tests run: 60, Failures: 0, Errors: 4, Skipped: 0
18-Sep-2021 02:14:12
18-Sep-2021 02:14:12 [INFO] ------------------------------------------------------------------------
18-Sep-2021 02:14:12 [INFO] Reactor Summary:
18-Sep-2021 02:14:12 [INFO]
18-Sep-2021 02:14:12 [INFO] Reference Application Distribution ................. SUCCESS [  0.435 s]
18-Sep-2021 02:14:12 [INFO] Reference Application Distribution Package ......... SUCCESS [01:31 min]
18-Sep-2021 02:14:12 [INFO] Reference Application Distribution UI Tests ........ FAILURE [12:08 min]
18-Sep-2021 02:14:12 [INFO] ------------------------------------------------------------------------
18-Sep-2021 02:14:12 [INFO] BUILD FAILURE
18-Sep-2021 02:14:12 [INFO] ------------------------------------------------------------------------
18-Sep-2021 02:14:12 [INFO] Total time: 13:40 min
18-Sep-2021 02:14:12 [INFO] Finished at: 2021-09-18T02:14:12+00:00
18-Sep-2021 02:14:12 [INFO] Final Memory: 55M/381M
18-Sep-2021 02:14:12 [INFO] ------------------------------------------------------------------------
18-Sep-2021 02:14:12 [ERROR] Failed to execute goal org.apache.maven.plugins:maven-surefire-plugin:2.12:test (default-test) on project referenceapplication-ui-tests: There are test failures.
18-Sep-2021 02:14:12 [ERROR]
18-Sep-2021 02:14:12 [ERROR] Please refer to /home/bamboo-agent/bamboo-agent/xml-data/build-dir/REFAPP-UI-FRAMEWORK/ui-tests/target/surefire-reports for the individual test results.
18-Sep-2021 02:14:12 [ERROR] -> [Help 1]
18-Sep-2021 02:14:12 org.apache.maven.lifecycle.LifecycleExecutionException: Failed to execute goal org.apache.maven.plugins:maven-surefire-plugin:2.12:test (default-test) on project referenceapplication-ui-tests: There are test failures.
18-Sep-2021 02:14:12
18-Sep-2021 02:14:12 Please refer to /home/bamboo-agent/bamboo-agent/xml-data/build-dir/REFAPP-UI-FRAMEWORK/ui-tests/target/surefire-reports for the individual test results.
18-Sep-2021 02:14:12         at org.apache.maven.lifecycle.internal.MojoExecutor.execute(MojoExecutor.java:212)
18-Sep-2021 02:14:12         at org.apache.maven.lifecycle.internal.MojoExecutor.execute(MojoExecutor.java:153)
18-Sep-2021 02:14:12         at org.apache.maven.lifecycle.internal.MojoExecutor.execute(MojoExecutor.java:145)
18-Sep-2021 02:14:12         at org.apache.maven.lifecycle.internal.LifecycleModuleBuilder.buildProject(LifecycleModuleBuilder.java:116)
18-Sep-2021 02:14:12         at org.apache.maven.lifecycle.internal.LifecycleModuleBuilder.buildProject(LifecycleModuleBuilder.java:80)
18-Sep-2021 02:14:12         at org.apache.maven.lifecycle.internal.builder.singlethreaded.SingleThreadedBuilder.build(SingleThreadedBuilder.java:51)
18-Sep-2021 02:14:12         at org.apache.maven.lifecycle.internal.LifecycleStarter.execute(LifecycleStarter.java:128)
18-Sep-2021 02:14:12         at org.apache.maven.DefaultMaven.doExecute(DefaultMaven.java:307)
18-Sep-2021 02:14:12         at org.apache.maven.DefaultMaven.doExecute(DefaultMaven.java:193)
18-Sep-2021 02:14:12         at org.apache.maven.DefaultMaven.execute(DefaultMaven.java:106)
18-Sep-2021 02:14:12         at org.apache.maven.cli.MavenCli.execute(MavenCli.java:863)
18-Sep-2021 02:14:12         at org.apache.maven.cli.MavenCli.doMain(MavenCli.java:288)
18-Sep-2021 02:14:12         at org.apache.maven.cli.MavenCli.main(MavenCli.java:199)
18-Sep-2021 02:14:12         at sun.reflect.NativeMethodAccessorImpl.invoke0(Native Method)
18-Sep-2021 02:14:12         at sun.reflect.NativeMethodAccessorImpl.invoke(NativeMethodAccessorImpl.java:62)
18-Sep-2021 02:14:12         at sun.reflect.DelegatingMethodAccessorImpl.invoke(DelegatingMethodAccessorImpl.java:43)
18-Sep-2021 02:14:12         at java.lang.reflect.Method.invoke(Method.java:498)
18-Sep-2021 02:14:12         at org.codehaus.plexus.classworlds.launcher.Launcher.launchEnhanced(Launcher.java:289)
18-Sep-2021 02:14:12         at org.codehaus.plexus.classworlds.launcher.Launcher.launch(Launcher.java:229)
18-Sep-2021 02:14:12         at org.codehaus.plexus.classworlds.launcher.Launcher.mainWithExitCode(Launcher.java:415)
18-Sep-2021 02:14:12         at org.codehaus.plexus.classworlds.launcher.Launcher.main(Launcher.java:356)
18-Sep-2021 02:14:12 Caused by: org.apache.maven.plugin.MojoFailureException: There are test failures.
18-Sep-2021 02:14:12
18-Sep-2021 02:14:12 Please refer to /home/bamboo-agent/bamboo-agent/xml-data/build-dir/REFAPP-UI-FRAMEWORK/ui-tests/target/surefire-reports for the individual test results.
18-Sep-2021 02:14:12         at org.apache.maven.plugin.surefire.SurefireHelper.reportExecution(SurefireHelper.java:83)
18-Sep-2021 02:14:12         at org.apache.maven.plugin.surefire.SurefirePlugin.writeSummary(SurefirePlugin.java:673)
18-Sep-2021 02:14:12         at org.apache.maven.plugin.surefire.SurefirePlugin.handleSummary(SurefirePlugin.java:647)
18-Sep-2021 02:14:12         at org.apache.maven.plugin.surefire.AbstractSurefireMojo.executeAfterPreconditionsChecked(AbstractSurefireMojo.java:137)
18-Sep-2021 02:14:12         at org.apache.maven.plugin.surefire.AbstractSurefireMojo.execute(AbstractSurefireMojo.java:98)
18-Sep-2021 02:14:12         at org.apache.maven.plugin.DefaultBuildPluginManager.executeMojo(DefaultBuildPluginManager.java:134)
18-Sep-2021 02:14:12         at org.apache.maven.lifecycle.internal.MojoExecutor.execute(MojoExecutor.java:207)
18-Sep-2021 02:14:12         ... 20 more
18-Sep-2021 02:14:12 [ERROR]
18-Sep-2021 02:14:12 [ERROR] Re-run Maven using the -X switch to enable full debug logging.
18-Sep-2021 02:14:12 [ERROR]
18-Sep-2021 02:14:12 [ERROR] For more information about the errors and possible solutions, please read the following articles:
18-Sep-2021 02:14:12 [ERROR] [Help 1] http://cwiki.apache.org/confluence/display/MAVEN/MojoFailureException
18-Sep-2021 02:14:12 [ERROR]
18-Sep-2021 02:14:12 [ERROR] After correcting the problems, you can resume the build with the command
18-Sep-2021 02:14:12 [ERROR]   mvn <goals> -rf :referenceapplication-ui-tests
18-Sep-2021 02:14:12 Failing task since return code of [/usr/share/apache-maven-3.3.9/bin/mvn --batch-mode -Djava.io.tmpdir=/home/bamboo-agent/bamboo-agent/.agent_tmp/REFAPP-UI-FRAMEWORK clean install -DskipTests=false -e] was 1 while expected 0
18-Sep-2021 02:14:12 Parsing test results under /home/bamboo-agent/bamboo-agent/xml-data/build-dir/REFAPP-UI-FRAMEWORK...
18-Sep-2021 02:14:13 Finished task 'Build distribution' with result: Failed
18-Sep-2021 02:14:13 Running post build plugin 'Docker Container Cleanup'
18-Sep-2021 02:14:13 Running post build plugin 'NCover Results Collector'
18-Sep-2021 02:14:13 Running post build plugin 'Clover Results Collector'
18-Sep-2021 02:14:13 Running post build plugin 'Sauce OnDemand Post Runner'
18-Sep-2021 02:14:13 Running post build plugin 'npm Cache Cleanup'
18-Sep-2021 02:14:13 Running post build plugin 'Artifact Copier'
18-Sep-2021 02:14:13 Finalising the build...
18-Sep-2021 02:14:13 Stopping timer.
18-Sep-2021 02:14:13 Build REFAPP-UI-FRAMEWORK-571 completed.
18-Sep-2021 02:14:13 Running on server: post build plugin 'NCover Results Collector'
18-Sep-2021 02:14:13 Running on server: post build plugin 'Build Hanging Detection Configuration'
18-Sep-2021 02:14:13 Running on server: post build plugin 'Clover Delta Calculator'
18-Sep-2021 02:14:16 Running on server: post build plugin 'Maven Dependencies Postprocessor'
18-Sep-2021 02:14:16 All post build plugins have finished
18-Sep-2021 02:14:16 Generating build results summary...
18-Sep-2021 02:14:17 Saving build results to disk...
18-Sep-2021 02:14:17 Logging substituted variables...
18-Sep-2021 02:14:17 Indexing build results...
18-Sep-2021 02:14:17 Finished building REFAPP-UI-FRAMEWORK-571.