UI tests for the reference application

Build: #588 failed

Job: Run QA UI Tests failed

Stages & jobs

  1. Ref App UI Testing

Build log

The build generated 980 lines of output. Download or view full build log

24-Sep-2021 06:26:32 Build Reference Application - UI - Run QA UI Tests #588 (REFAPP-UI-FRAMEWORK-588) started building on agent yak.openmrs.org (2)
24-Sep-2021 06:26:32 Remote agent on host yak.openmrs.org
24-Sep-2021 06:26:32 Build working directory is /home/bamboo-agent/bamboo-agent/xml-data/build-dir/REFAPP-UI-FRAMEWORK
24-Sep-2021 06:26:32 Executing build Reference Application - UI - Run QA UI Tests #588 (REFAPP-UI-FRAMEWORK-588)
24-Sep-2021 06:26:32 Starting task 'Checkout uitestframework' of type 'com.atlassian.bamboo.plugins.vcs:task.vcs.checkout'
24-Sep-2021 06:26:32 Build always requires a clean checkout
24-Sep-2021 06:26:32 Cleaning build directory '/home/bamboo-agent/bamboo-agent/xml-data/build-dir/REFAPP-UI-FRAMEWORK'
24-Sep-2021 06:26:32 Checking out into /home/bamboo-agent/bamboo-agent/xml-data/build-dir/REFAPP-UI-FRAMEWORK
24-Sep-2021 06:26:32 Updating source code to revision: 8838c8eeee749c044f9846bcb0a31a7065db1260
24-Sep-2021 06:26:32 Creating local git repository in '/home/bamboo-agent/bamboo-agent/xml-data/build-dir/REFAPP-UI-FRAMEWORK/.git'.
24-Sep-2021 06:26:32 Initialized empty Git repository in /home/bamboo-agent/bamboo-agent/xml-data/build-dir/REFAPP-UI-FRAMEWORK/.git/
24-Sep-2021 06:26:32 Fetching 'refs/heads/master' from 'git://github.com/openmrs/openmrs-contrib-uitestframework.git'.
24-Sep-2021 06:26:38 From git://github.com/openmrs/openmrs-contrib-uitestframework
24-Sep-2021 06:26:38 * [new branch]      master     -> master
24-Sep-2021 06:26:38 * [new tag]         1.0        -> 1.0
24-Sep-2021 06:26:38 * [new tag]         1.1        -> 1.1
24-Sep-2021 06:26:38 * [new tag]         1.2        -> 1.2
24-Sep-2021 06:26:38 * [new tag]         1.3        -> 1.3
24-Sep-2021 06:26:38 * [new tag]         1.4        -> 1.4
24-Sep-2021 06:26:38 * [new tag]         1.5        -> 1.5
24-Sep-2021 06:26:38 * [new tag]         1.5.1      -> 1.5.1
24-Sep-2021 06:26:38 * [new tag]         1.6        -> 1.6
24-Sep-2021 06:26:38 * [new tag]         1.7        -> 1.7
24-Sep-2021 06:26:38 * [new tag]         1.7.1      -> 1.7.1
24-Sep-2021 06:26:38 * [new tag]         1.7.2      -> 1.7.2
24-Sep-2021 06:26:38 * [new tag]         1.8        -> 1.8
24-Sep-2021 06:26:38 * [new tag]         2.0.0      -> 2.0.0
24-Sep-2021 06:26:38 * [new tag]         2.0.1      -> 2.0.1
24-Sep-2021 06:26:38 * [new tag]         2.1.0      -> 2.1.0
24-Sep-2021 06:26:38 * [new tag]         2.2.0      -> 2.2.0
24-Sep-2021 06:26:38 * [new tag]         2.3.0      -> 2.3.0
24-Sep-2021 06:26:38 * [new tag]         2.4.0      -> 2.4.0
24-Sep-2021 06:26:38 Checking out revision 8838c8eeee749c044f9846bcb0a31a7065db1260.
24-Sep-2021 06:26:39 Already on 'master'
24-Sep-2021 06:26:39 Updated source code to revision: 8838c8eeee749c044f9846bcb0a31a7065db1260
24-Sep-2021 06:26:39 Finished task 'Checkout uitestframework' with result: Success
24-Sep-2021 06:26:39 Running pre-build action: VCS Version Collector
24-Sep-2021 06:26:39 Running pre-build action: Sauce OnDemand Build Configurator
24-Sep-2021 06:26:39 Running pre-build action: Run Predator
24-Sep-2021 06:26:39 [PredatorPreBuildAction] Starting predator plugin, pre build agent cleaner
24-Sep-2021 06:26:39 [PredatorPreBuildAction] Running these commands: docker system prune -af; docker ps -q| xargs docker kill; docker ps -qa | xargs docker rm -f
24-Sep-2021 06:26:39 [PredatorPreBuildAction] Running command 'docker system prune -af'
24-Sep-2021 06:26:40 [PredatorPreBuildAction] Command 'docker system prune -af' completed with exit code 0
24-Sep-2021 06:26:40 [PredatorPreBuildAction] Running command 'docker ps -q| xargs docker kill'
24-Sep-2021 06:26:41 [PredatorPreBuildAction] Command 'docker ps -q| xargs docker kill' completed with exit code 125
24-Sep-2021 06:26:41 [PredatorPreBuildAction] Running command 'docker ps -qa | xargs docker rm -f'
24-Sep-2021 06:26:42 [PredatorPreBuildAction] Command 'docker ps -qa | xargs docker rm -f' completed with exit code 125
24-Sep-2021 06:26:42 [PredatorPreBuildAction] Identifying Bamboo agent process (or parent):  4282 java        2192 bamboo-age 3026Mb  851Mb 02:59:29 /usr/lib/jvm/java-8-ope
24-Sep-2021 06:26:42 [PredatorPreBuildAction] Identifying Bamboo agent process (or parent):  2192 wrapper        1 bamboo-age   22Mb    0Mb 00:38:25 /home/bamboo-agent/bamb
24-Sep-2021 06:26:42 [PredatorPreBuildAction] Identifying Bamboo agent process (or parent):     1 systemd        0 root        181Mb    5Mb 00:01:49 /sbin/init             
24-Sep-2021 06:26:42 [PredatorPreBuildAction] No processes found for (chromium|chrome|webdriver|mysql|java |mvn )
24-Sep-2021 06:26:42 [PredatorPreBuildAction] Initial free space: 3.520504 GB
24-Sep-2021 06:26:42 [PredatorPreBuildAction] Deleting folder /home/bamboo-agent/bamboo-agent/xml-data/build-dir/OCL-OCLAPI2-BO
24-Sep-2021 06:26:43 [PredatorPreBuildAction] Deleting folder /home/bamboo-agent/bamboo-agent/xml-data/build-dir/REFAPP-OMODDISTRO-TS
24-Sep-2021 06:27:18 [PredatorPreBuildAction] Deleting 2 snapshot folders from /home/bamboo-agent/.m2/repository
24-Sep-2021 06:27:18 [PredatorPreBuildAction] Maven snapshot disk freed: 0 GB
24-Sep-2021 06:27:18 [PredatorPreBuildAction] 0 empty artifacts were found and deleted by Predator
24-Sep-2021 06:27:19 [PredatorPreBuildAction] Maven stable disk freed: 0.0 GB, deleted 0 files
24-Sep-2021 06:27:19 [PredatorPreBuildAction] File /home/bamboo-agent/.npmrc does not exist.
24-Sep-2021 06:27:19 [PredatorPreBuildAction] File /home/bamboo-agent/.docker/config.json does not exist.
24-Sep-2021 06:27:19 [PredatorPreBuildAction] File /home/bamboo-agent/.OpenMRS/liquibaseUpdateLogs.txt does not exist.
24-Sep-2021 06:27:19 [PredatorPreBuildAction] Final free space: 4.3777885 GB
24-Sep-2021 06:27:19 [PredatorPreBuildAction] Done
24-Sep-2021 06:27:19 Starting task 'Build uitestframework' of type 'com.atlassian.bamboo.plugins.maven:task.builder.mvn3'
24-Sep-2021 06:27:19
Beginning to execute external process for build 'Reference Application - UI - Run QA UI Tests #588 (REFAPP-UI-FRAMEWORK-588)'
... running command line:
/usr/share/apache-maven-3.3.9/bin/mvn --batch-mode -Djava.io.tmpdir=/home/bamboo-agent/bamboo-agent/.agent_tmp/REFAPP-UI-FRAMEWORK clean install
... in: /home/bamboo-agent/bamboo-agent/xml-data/build-dir/REFAPP-UI-FRAMEWORK
... using extra environment variables:
bamboo_planRepository_1_branch=master
bamboo_capability_system_builder_grailsBuilder_Grails_2_3_7=/opt/grails
bamboo_planRepository_2_branch=master
bamboo_planRepository_1_branchDisplayName=master
bamboo_repository_revision_number=22434e0afef5495a78b5748d8fa80e8d77dc4b79
MAVEN2_HOME=/usr/share/apache-maven-3.3.9
bamboo_saucelabs_username=rkorytkowski
bamboo_repository_207388681_previous_revision_number=22434e0afef5495a78b5748d8fa80e8d77dc4b79
bamboo_buildKey=REFAPP-UI-FRAMEWORK
bamboo_DISPLAY=10
bamboo_maven_release_version=2.8.0
bamboo_planRepository_2_branchDisplayName=master
bamboo_repository_207388681_name=Distribution
bamboo_shortJobName=Run QA UI Tests
bamboo_buildResultsUrl=https://ci.openmrs.org/browse/REFAPP-UI-FRAMEWORK-588
bamboo_planRepository_repositoryUrl=git://github.com/openmrs/openmrs-distro-referenceapplication.git
bamboo_agentId=189792257
bamboo_maven_development_version=
bamboo_capability_system_jdk_JDK_8=/usr/lib/jvm/java-8-openjdk-amd64
bamboo_planRepository_revision=22434e0afef5495a78b5748d8fa80e8d77dc4b79
bamboo_planRepository_previousRevision=22434e0afef5495a78b5748d8fa80e8d77dc4b79
bamboo_capability_system_jdk_JDK_1_8_0_265=/usr/lib/jvm/java-1.8.0-openjdk-amd64/
bamboo_repository_branch_name=master
bamboo_dockerhub_username=openmrsci
bamboo_refapp_distro_scm=git@github.com:openmrs/openmrs-distro-referenceapplication.git
bamboo_repository_207388681_branch_name=master
JAVA_HOME=/usr/lib/jvm/java-1.8.0-openjdk-amd64/
bamboo_repository_207388680_branch_name=master
bamboo_dependenciesDisabled=false
bamboo_repository_207388681_git_username=
bamboo_planRepository_branch=master
bamboo_repository_207388681_revision_number=22434e0afef5495a78b5748d8fa80e8d77dc4b79
bamboo_capability_system_jdk_JDK_1_8_0_275=/usr/lib/jvm/java-1.8.0-openjdk-amd64/
bamboo_capability_system_jdk_JDK_1_8_0_272=/usr/lib/jvm/java-1.8.0-openjdk-amd64/
bamboo_capability_system_jdk_JDK_11=/usr/lib/jvm/java-11-openjdk-amd64
bamboo_planRepository_1_type=gitv2
bamboo_planRepository_branchName=master
bamboo_saucelabs_password=********
bamboo_capability_system_jdk_JDK=/usr/lib/jvm/java-1.8.0-openjdk-amd64/
bamboo_mavenBuildGoals=clean install
bamboo_hg_cache_directory=/home/bamboo-agent/bamboo-agent/xml-data/build-dir/_hg-repositories-cache
bamboo_planRepository_1_username=
bamboo_planRepository_type=gitv2
bamboo_ManualBuildTriggerReason_userName=kdaud
bamboo_git_cache_directory=/home/bamboo-agent/bamboo-agent/xml-data/build-dir/_git-repositories-cache
bamboo_planRepository_2_branchName=master
useMavenReturnCode=false
bamboo_capability_system_builder_node_Node_js=/usr/bin/node
bamboo_travis_password=********
bamboo_capability_system_builder_mvn3_Maven_3=/usr/share/apache-maven-3.3.9
bamboo_tmp_directory=/home/bamboo-agent/bamboo-agent/temp
bamboo_planKey=REFAPP-UI
bamboo_capability_system_builder_command_nvm=nvm
bamboo_planRepository_username=
bamboo_capability_system_jdk_JDK_1_8_0_282=/usr/lib/jvm/java-1.8.0-openjdk-amd64/
bamboo_planRepository_1_branchName=master
bamboo_dockerhub_password=********
bamboo_resultsUrl=https://ci.openmrs.org/browse/REFAPP-UI-FRAMEWORK-588
bamboo_capability_system_builder_command_transifex=/usr/bin/tx
bamboo_jdbc_password=********
bamboo_build_working_directory=/home/bamboo-agent/bamboo-agent/xml-data/build-dir/REFAPP-UI-FRAMEWORK
bamboo_planRepository_1_name=Distribution
bamboo_capability_system_jdk_JDK_1_8_0_292=/usr/lib/jvm/java-1.8.0-openjdk-amd64/
bamboo_preparing_refapp_distro_release=false
bamboo_shortPlanName=UI
bamboo_planRepository_2_username=
bamboo_planRepository_name=Distribution
bamboo_docs_aws_secret_key=********
bamboo_buildNumber=588
bamboo_repository_207388680_git_username=
bamboo_repository_207388681_git_repositoryUrl=git://github.com/openmrs/openmrs-distro-referenceapplication.git
bamboo_planName=Reference Application - UI
bamboo_shortPlanKey=UI
bamboo_shortJobKey=FRAMEWORK
bamboo_planRepository_2_name=UI Test Framework
bamboo_buildTimeStamp=2021-09-24T06:26:32.249Z
bamboo_repository_previous_revision_number=22434e0afef5495a78b5748d8fa80e8d77dc4b79
M2_HOME=/usr/share/apache-maven-3.3.9
bamboo_refapp_bamboo_build_number=
bamboo_repository_git_branch=master
bamboo_buildResultKey=REFAPP-UI-FRAMEWORK-588
bamboo_docs_aws_access_key=AKIAI7KMDL5KP2673G7A
bamboo_buildPlanName=Reference Application - UI - Run QA UI Tests
bamboo_openMRSVersion=2.1.3
bamboo_planRepository_1_revision=22434e0afef5495a78b5748d8fa80e8d77dc4b79
bamboo_repository_207388680_git_repositoryUrl=git://github.com/openmrs/openmrs-contrib-uitestframework.git
bamboo_repository_name=UI Test Framework
bamboo_capability_system_jdk_openjdk_8_jdk=/usr/lib/jvm/java-8-openjdk-amd64
bamboo_planRepository_2_previousRevision=8838c8eeee749c044f9846bcb0a31a7065db1260
bamboo_transifex_password=********
bamboo_repository_207388680_name=UI Test Framework
bamboo_capability_system_jdk_openjdk_11_jdk=/usr/lib/jvm/java-11-openjdk-amd64
bamboo_repository_207388680_previous_revision_number=8838c8eeee749c044f9846bcb0a31a7065db1260
bamboo_buildFailed=false
bamboo_capability_system_builder_grailsBuilder_Grails_2=/opt/grails
bamboo_capability_system_docker_executable=/usr/bin/docker
bamboo_capability_system_builder_command_Bash=/bin/bash
bamboo_agentWorkingDirectory=/home/bamboo-agent/bamboo-agent/xml-data/build-dir
bamboo_planRepository_2_revision=8838c8eeee749c044f9846bcb0a31a7065db1260
bamboo_capability_system_git_executable=/usr/bin/git
bamboo_repository_git_username=
bamboo_planRepository_1_previousRevision=22434e0afef5495a78b5748d8fa80e8d77dc4b79
bamboo_planRepository_branchDisplayName=master
bamboo_planRepository_2_type=gitv2
bamboo_plan_storageTag=plan-207093778
bamboo_repository_207388680_git_branch=master
bamboo_planRepository_2_repositoryUrl=git://github.com/openmrs/openmrs-contrib-uitestframework.git
bamboo_repository_git_repositoryUrl=git://github.com/openmrs/openmrs-distro-referenceapplication.git
bamboo_transifex_username=api
bamboo_refapp_distro_dev_branch=master
bamboo_working_directory=/home/bamboo-agent/bamboo-agent/xml-data/build-dir/REFAPP-UI-FRAMEWORK
bamboo_planRepository_1_repositoryUrl=git://github.com/openmrs/openmrs-distro-referenceapplication.git
bamboo_capability_system_jdk_JDK_1_8=/usr/lib/jvm/java-1.8.0-openjdk-amd64/
bamboo_repository_207388681_git_branch=master
bamboo_repository_207388680_revision_number=8838c8eeee749c044f9846bcb0a31a7065db1260
PATH=/usr/lib/jvm/java-1.8.0-openjdk-amd64//bin:/home/bamboo-agent/.nvm/versions/node/v10.22.1/bin:/home/bamboo-agent/bin:/home/bamboo-agent/.local/bin:/usr/local/sbin:/usr/local/bin:/usr/sbin:/usr/bin:/sbin:/bin:/usr/games:/usr/local/games:/snap/bin:/opt/puppetlabs/bin
24-Sep-2021 06:27:22 [INFO] Scanning for projects...
24-Sep-2021 06:27:22 [WARNING]
24-Sep-2021 06:27:22 [WARNING] Some problems were encountered while building the effective model for org.openmrs.contrib:uitestframework:jar:2.5.0-SNAPSHOT
24-Sep-2021 06:27:22 [WARNING] 'build.plugins.plugin.version' for org.apache.maven.plugins:maven-compiler-plugin is missing. @ line 125, column 21
24-Sep-2021 06:27:22 [WARNING]
24-Sep-2021 06:27:22 [WARNING] It is highly recommended to fix these problems because they threaten the stability of your build.
24-Sep-2021 06:27:22 [WARNING]
24-Sep-2021 06:27:22 [WARNING] For this reason, future Maven versions might no longer support building such malformed projects.
24-Sep-2021 06:27:22 [WARNING]
24-Sep-2021 06:27:22 [INFO]                                                                         
24-Sep-2021 06:27:22 [INFO] ------------------------------------------------------------------------
24-Sep-2021 06:27:22 [INFO] Building UI Test Framework 2.5.0-SNAPSHOT
24-Sep-2021 06:27:22 [INFO] ------------------------------------------------------------------------
24-Sep-2021 06:27:24 [INFO]
24-Sep-2021 06:27:24 [INFO] --- maven-clean-plugin:2.5:clean (default-clean) @ uitestframework ---
24-Sep-2021 06:27:24 [INFO]
24-Sep-2021 06:27:24 [INFO] --- maven-resources-plugin:2.6:resources (default-resources) @ uitestframework ---
24-Sep-2021 06:27:25 [WARNING] Using platform encoding (UTF-8 actually) to copy filtered resources, i.e. build is platform dependent!
24-Sep-2021 06:27:25 [INFO] Copying 5 resources
24-Sep-2021 06:27:25 [INFO]
24-Sep-2021 06:27:25 [INFO] --- maven-compiler-plugin:3.1:compile (default-compile) @ uitestframework ---
24-Sep-2021 06:27:25 [INFO] Changes detected - recompiling the module!
24-Sep-2021 06:27:25 [WARNING] File encoding has not been set, using platform encoding UTF-8, i.e. build is platform dependent!
24-Sep-2021 06:27:25 [INFO] Compiling 9 source files to /home/bamboo-agent/bamboo-agent/xml-data/build-dir/REFAPP-UI-FRAMEWORK/target/classes
24-Sep-2021 06:27:33 [WARNING] /home/bamboo-agent/bamboo-agent/xml-data/build-dir/REFAPP-UI-FRAMEWORK/src/main/java/org/openmrs/uitestframework/page/Page.java: Some input files use or override a deprecated API.
24-Sep-2021 06:27:33 [WARNING] /home/bamboo-agent/bamboo-agent/xml-data/build-dir/REFAPP-UI-FRAMEWORK/src/main/java/org/openmrs/uitestframework/page/Page.java: Recompile with -Xlint:deprecation for details.
24-Sep-2021 06:27:33 [INFO]
24-Sep-2021 06:27:33 [INFO] --- maven-resources-plugin:2.6:testResources (default-testResources) @ uitestframework ---
24-Sep-2021 06:27:33 [WARNING] Using platform encoding (UTF-8 actually) to copy filtered resources, i.e. build is platform dependent!
24-Sep-2021 06:27:33 [INFO] skip non existing resourceDirectory /home/bamboo-agent/bamboo-agent/xml-data/build-dir/REFAPP-UI-FRAMEWORK/src/test/resources
24-Sep-2021 06:27:33 [INFO]
24-Sep-2021 06:27:33 [INFO] --- maven-compiler-plugin:3.1:testCompile (default-testCompile) @ uitestframework ---
24-Sep-2021 06:27:33 [INFO] No sources to compile
24-Sep-2021 06:27:33 [INFO]
24-Sep-2021 06:27:33 [INFO] --- maven-surefire-plugin:2.12.4:test (default-test) @ uitestframework ---
24-Sep-2021 06:27:33 [INFO] No tests to run.
24-Sep-2021 06:27:33 [INFO]
24-Sep-2021 06:27:33 [INFO] --- maven-jar-plugin:2.4:jar (default-jar) @ uitestframework ---
24-Sep-2021 06:27:33 [INFO] Building jar: /home/bamboo-agent/bamboo-agent/xml-data/build-dir/REFAPP-UI-FRAMEWORK/target/uitestframework-2.5.0-SNAPSHOT.jar
24-Sep-2021 06:27:36 [INFO]
24-Sep-2021 06:27:36 [INFO] --- maven-install-plugin:2.4:install (default-install) @ uitestframework ---
24-Sep-2021 06:27:36 [INFO] Installing /home/bamboo-agent/bamboo-agent/xml-data/build-dir/REFAPP-UI-FRAMEWORK/target/uitestframework-2.5.0-SNAPSHOT.jar to /home/bamboo-agent/.m2/repository/org/openmrs/contrib/uitestframework/2.5.0-SNAPSHOT/uitestframework-2.5.0-SNAPSHOT.jar
24-Sep-2021 06:27:36 [INFO] Installing /home/bamboo-agent/bamboo-agent/xml-data/build-dir/REFAPP-UI-FRAMEWORK/pom.xml to /home/bamboo-agent/.m2/repository/org/openmrs/contrib/uitestframework/2.5.0-SNAPSHOT/uitestframework-2.5.0-SNAPSHOT.pom
24-Sep-2021 06:27:36 [INFO] ------------------------------------------------------------------------
24-Sep-2021 06:27:36 [INFO] BUILD SUCCESS
24-Sep-2021 06:27:36 [INFO] ------------------------------------------------------------------------
24-Sep-2021 06:27:36 [INFO] Total time: 13.811 s
24-Sep-2021 06:27:36 [INFO] Finished at: 2021-09-24T06:27:36+00:00
24-Sep-2021 06:27:36 [INFO] Final Memory: 24M/224M
24-Sep-2021 06:27:36 [INFO] ------------------------------------------------------------------------
24-Sep-2021 06:27:36 Finished task 'Build uitestframework' with result: Success
24-Sep-2021 06:27:36 Starting task 'Checkout distribution' of type 'com.atlassian.bamboo.plugins.vcs:task.vcs.checkout'
24-Sep-2021 06:27:36 Build always requires a clean checkout
24-Sep-2021 06:27:36 Cleaning build directory '/home/bamboo-agent/bamboo-agent/xml-data/build-dir/REFAPP-UI-FRAMEWORK'
24-Sep-2021 06:27:36 Checking out into /home/bamboo-agent/bamboo-agent/xml-data/build-dir/REFAPP-UI-FRAMEWORK
24-Sep-2021 06:27:36 Updating source code to revision: 22434e0afef5495a78b5748d8fa80e8d77dc4b79
24-Sep-2021 06:27:36 Creating local git repository in '/home/bamboo-agent/bamboo-agent/xml-data/build-dir/REFAPP-UI-FRAMEWORK/.git'.
24-Sep-2021 06:27:36 Initialized empty Git repository in /home/bamboo-agent/bamboo-agent/xml-data/build-dir/REFAPP-UI-FRAMEWORK/.git/
24-Sep-2021 06:27:36 Fetching 'refs/heads/master' from 'git://github.com/openmrs/openmrs-distro-referenceapplication.git'.
24-Sep-2021 06:27:39 From git://github.com/openmrs/openmrs-distro-referenceapplication
24-Sep-2021 06:27:39 * [new branch]      master     -> master
24-Sep-2021 06:27:39 * [new tag]         2.0.1769   -> 2.0.1769
24-Sep-2021 06:27:39 * [new tag]         2.1        -> 2.1
24-Sep-2021 06:27:39 * [new tag]         2.10.0     -> 2.10.0
24-Sep-2021 06:27:39 * [new tag]         2.11.0     -> 2.11.0
24-Sep-2021 06:27:39 * [new tag]         2.12.0     -> 2.12.0
24-Sep-2021 06:27:39 * [new tag]         2.2        -> 2.2
24-Sep-2021 06:27:39 * [new tag]         2.3        -> 2.3
24-Sep-2021 06:27:39 * [new tag]         2.4        -> 2.4
24-Sep-2021 06:27:39 * [new tag]         2.5        -> 2.5
24-Sep-2021 06:27:39 * [new tag]         2.6.0      -> 2.6.0
24-Sep-2021 06:27:39 * [new tag]         2.7.0      -> 2.7.0
24-Sep-2021 06:27:39 * [new tag]         2.8.0      -> 2.8.0
24-Sep-2021 06:27:39 * [new tag]         2.8.1      -> 2.8.1
24-Sep-2021 06:27:39 * [new tag]         2.9.0      -> 2.9.0
24-Sep-2021 06:27:39 * [new tag]         latest     -> latest
24-Sep-2021 06:27:39 Checking out revision 22434e0afef5495a78b5748d8fa80e8d77dc4b79.
24-Sep-2021 06:27:39 Already on 'master'
24-Sep-2021 06:27:39 Updated source code to revision: 22434e0afef5495a78b5748d8fa80e8d77dc4b79
24-Sep-2021 06:27:39 Finished task 'Checkout distribution' with result: Success
24-Sep-2021 06:27:39 Skipping execution of task 'deploy docker db and web containers' as it is disabled
24-Sep-2021 06:27:39 Starting task 'ensure refapp instance is app and prepare for testing' of type 'com.atlassian.bamboo.plugins.scripttask:task.builder.script'
24-Sep-2021 06:27:39
Beginning to execute external process for build 'Reference Application - UI - Run QA UI Tests #588 (REFAPP-UI-FRAMEWORK-588)'
... running command line:
/home/bamboo-agent/bamboo-agent/temp/REFAPP-UI-FRAMEWORK-588-ScriptBuildTask-8451398669129419314.sh
... in: /home/bamboo-agent/bamboo-agent/xml-data/build-dir/REFAPP-UI-FRAMEWORK
... using extra environment variables:
bamboo_planRepository_1_branch=master
bamboo_capability_system_builder_grailsBuilder_Grails_2_3_7=/opt/grails
bamboo_planRepository_2_branch=master
bamboo_planRepository_1_branchDisplayName=master
bamboo_repository_revision_number=22434e0afef5495a78b5748d8fa80e8d77dc4b79
bamboo_saucelabs_username=rkorytkowski
bamboo_repository_207388681_previous_revision_number=22434e0afef5495a78b5748d8fa80e8d77dc4b79
bamboo_buildKey=REFAPP-UI-FRAMEWORK
bamboo_DISPLAY=10
bamboo_maven_release_version=2.8.0
bamboo_planRepository_2_branchDisplayName=master
bamboo_repository_207388681_name=Distribution
bamboo_shortJobName=Run QA UI Tests
bamboo_buildResultsUrl=https://ci.openmrs.org/browse/REFAPP-UI-FRAMEWORK-588
bamboo_planRepository_repositoryUrl=git://github.com/openmrs/openmrs-distro-referenceapplication.git
bamboo_agentId=189792257
bamboo_maven_development_version=
bamboo_capability_system_jdk_JDK_8=/usr/lib/jvm/java-8-openjdk-amd64
bamboo_planRepository_revision=22434e0afef5495a78b5748d8fa80e8d77dc4b79
bamboo_planRepository_previousRevision=22434e0afef5495a78b5748d8fa80e8d77dc4b79
bamboo_capability_system_jdk_JDK_1_8_0_265=/usr/lib/jvm/java-1.8.0-openjdk-amd64/
bamboo_repository_branch_name=master
bamboo_dockerhub_username=openmrsci
bamboo_refapp_distro_scm=git@github.com:openmrs/openmrs-distro-referenceapplication.git
bamboo_repository_207388681_branch_name=master
bamboo_repository_207388680_branch_name=master
bamboo_dependenciesDisabled=false
bamboo_repository_207388681_git_username=
bamboo_planRepository_branch=master
bamboo_repository_207388681_revision_number=22434e0afef5495a78b5748d8fa80e8d77dc4b79
bamboo_capability_system_jdk_JDK_1_8_0_275=/usr/lib/jvm/java-1.8.0-openjdk-amd64/
bamboo_capability_system_jdk_JDK_1_8_0_272=/usr/lib/jvm/java-1.8.0-openjdk-amd64/
bamboo_capability_system_jdk_JDK_11=/usr/lib/jvm/java-11-openjdk-amd64
bamboo_planRepository_1_type=gitv2
bamboo_planRepository_branchName=master
bamboo_saucelabs_password=********
bamboo_capability_system_jdk_JDK=/usr/lib/jvm/java-1.8.0-openjdk-amd64/
bamboo_mavenBuildGoals=clean install
bamboo_hg_cache_directory=/home/bamboo-agent/bamboo-agent/xml-data/build-dir/_hg-repositories-cache
bamboo_planRepository_1_username=
bamboo_planRepository_type=gitv2
bamboo_ManualBuildTriggerReason_userName=kdaud
bamboo_git_cache_directory=/home/bamboo-agent/bamboo-agent/xml-data/build-dir/_git-repositories-cache
bamboo_planRepository_2_branchName=master
bamboo_capability_system_builder_node_Node_js=/usr/bin/node
bamboo_build_commandline_com_atlassian_bamboo_plugins_maven_task_builder_mvn3_2=/usr/share/apache-maven-3.3.9/bin/mvn --batch-mode -Djava.io.tmpdir=/home/bamboo-agent/bamboo-agent/.agent_tmp/REFAPP-UI-FRAMEWORK clean install
bamboo_travis_password=********
bamboo_capability_system_builder_mvn3_Maven_3=/usr/share/apache-maven-3.3.9
bamboo_tmp_directory=/home/bamboo-agent/bamboo-agent/temp
bamboo_planKey=REFAPP-UI
bamboo_capability_system_builder_command_nvm=nvm
bamboo_planRepository_username=
bamboo_capability_system_jdk_JDK_1_8_0_282=/usr/lib/jvm/java-1.8.0-openjdk-amd64/
bamboo_planRepository_1_branchName=master
bamboo_dockerhub_password=********
bamboo_resultsUrl=https://ci.openmrs.org/browse/REFAPP-UI-FRAMEWORK-588
bamboo_capability_system_builder_command_transifex=/usr/bin/tx
bamboo_jdbc_password=********
bamboo_build_working_directory=/home/bamboo-agent/bamboo-agent/xml-data/build-dir/REFAPP-UI-FRAMEWORK
bamboo_planRepository_1_name=Distribution
bamboo_capability_system_jdk_JDK_1_8_0_292=/usr/lib/jvm/java-1.8.0-openjdk-amd64/
bamboo_preparing_refapp_distro_release=false
bamboo_shortPlanName=UI
bamboo_planRepository_2_username=
bamboo_planRepository_name=Distribution
bamboo_docs_aws_secret_key=********
bamboo_buildNumber=588
bamboo_repository_207388680_git_username=
bamboo_repository_207388681_git_repositoryUrl=git://github.com/openmrs/openmrs-distro-referenceapplication.git
bamboo_planName=Reference Application - UI
bamboo_shortPlanKey=UI
bamboo_shortJobKey=FRAMEWORK
bamboo_planRepository_2_name=UI Test Framework
bamboo_buildTimeStamp=2021-09-24T06:26:32.249Z
bamboo_repository_previous_revision_number=22434e0afef5495a78b5748d8fa80e8d77dc4b79
bamboo_refapp_bamboo_build_number=
bamboo_repository_git_branch=master
bamboo_buildResultKey=REFAPP-UI-FRAMEWORK-588
bamboo_docs_aws_access_key=AKIAI7KMDL5KP2673G7A
bamboo_buildPlanName=Reference Application - UI - Run QA UI Tests
bamboo_openMRSVersion=2.1.3
bamboo_planRepository_1_revision=22434e0afef5495a78b5748d8fa80e8d77dc4b79
bamboo_repository_207388680_git_repositoryUrl=git://github.com/openmrs/openmrs-contrib-uitestframework.git
bamboo_repository_name=UI Test Framework
bamboo_capability_system_jdk_openjdk_8_jdk=/usr/lib/jvm/java-8-openjdk-amd64
bamboo_planRepository_2_previousRevision=8838c8eeee749c044f9846bcb0a31a7065db1260
bamboo_transifex_password=********
bamboo_repository_207388680_name=UI Test Framework
bamboo_capability_system_jdk_openjdk_11_jdk=/usr/lib/jvm/java-11-openjdk-amd64
bamboo_repository_207388680_previous_revision_number=8838c8eeee749c044f9846bcb0a31a7065db1260
bamboo_buildFailed=false
bamboo_capability_system_builder_grailsBuilder_Grails_2=/opt/grails
bamboo_capability_system_docker_executable=/usr/bin/docker
bamboo_capability_system_builder_command_Bash=/bin/bash
bamboo_agentWorkingDirectory=/home/bamboo-agent/bamboo-agent/xml-data/build-dir
bamboo_planRepository_2_revision=8838c8eeee749c044f9846bcb0a31a7065db1260
bamboo_capability_system_git_executable=/usr/bin/git
bamboo_repository_git_username=
bamboo_planRepository_1_previousRevision=22434e0afef5495a78b5748d8fa80e8d77dc4b79
bamboo_planRepository_branchDisplayName=master
bamboo_planRepository_2_type=gitv2
bamboo_plan_storageTag=plan-207093778
bamboo_repository_207388680_git_branch=master
bamboo_planRepository_2_repositoryUrl=git://github.com/openmrs/openmrs-contrib-uitestframework.git
bamboo_repository_git_repositoryUrl=git://github.com/openmrs/openmrs-distro-referenceapplication.git
bamboo_transifex_username=api
bamboo_refapp_distro_dev_branch=master
bamboo_working_directory=/home/bamboo-agent/bamboo-agent/xml-data/build-dir/REFAPP-UI-FRAMEWORK
bamboo_planRepository_1_repositoryUrl=git://github.com/openmrs/openmrs-distro-referenceapplication.git
bamboo_capability_system_jdk_JDK_1_8=/usr/lib/jvm/java-1.8.0-openjdk-amd64/
bamboo_repository_207388681_git_branch=master
bamboo_repository_207388680_revision_number=8838c8eeee749c044f9846bcb0a31a7065db1260
24-Sep-2021 06:27:39 Finished task 'ensure refapp instance is app and prepare for testing' with result: Success
24-Sep-2021 06:27:39 Starting task 'Build distribution' of type 'com.atlassian.bamboo.plugins.maven:task.builder.mvn3'
24-Sep-2021 06:27:39
Beginning to execute external process for build 'Reference Application - UI - Run QA UI Tests #588 (REFAPP-UI-FRAMEWORK-588)'
... running command line:
/usr/share/apache-maven-3.3.9/bin/mvn --batch-mode -Djava.io.tmpdir=/home/bamboo-agent/bamboo-agent/.agent_tmp/REFAPP-UI-FRAMEWORK clean install -DskipTests=false -e
... in: /home/bamboo-agent/bamboo-agent/xml-data/build-dir/REFAPP-UI-FRAMEWORK
... using extra environment variables:
bamboo_planRepository_1_branch=master
bamboo_capability_system_builder_grailsBuilder_Grails_2_3_7=/opt/grails
bamboo_planRepository_2_branch=master
bamboo_planRepository_1_branchDisplayName=master
bamboo_repository_revision_number=22434e0afef5495a78b5748d8fa80e8d77dc4b79
MAVEN2_HOME=/usr/share/apache-maven-3.3.9
bamboo_saucelabs_username=rkorytkowski
bamboo_repository_207388681_previous_revision_number=22434e0afef5495a78b5748d8fa80e8d77dc4b79
bamboo_buildKey=REFAPP-UI-FRAMEWORK
bamboo_DISPLAY=10
bamboo_maven_release_version=2.8.0
bamboo_planRepository_2_branchDisplayName=master
bamboo_repository_207388681_name=Distribution
bamboo_shortJobName=Run QA UI Tests
bamboo_buildResultsUrl=https://ci.openmrs.org/browse/REFAPP-UI-FRAMEWORK-588
bamboo_planRepository_repositoryUrl=git://github.com/openmrs/openmrs-distro-referenceapplication.git
bamboo_agentId=189792257
bamboo_maven_development_version=
bamboo_capability_system_jdk_JDK_8=/usr/lib/jvm/java-8-openjdk-amd64
bamboo_planRepository_revision=22434e0afef5495a78b5748d8fa80e8d77dc4b79
bamboo_planRepository_previousRevision=22434e0afef5495a78b5748d8fa80e8d77dc4b79
bamboo_capability_system_jdk_JDK_1_8_0_265=/usr/lib/jvm/java-1.8.0-openjdk-amd64/
bamboo_repository_branch_name=master
bamboo_dockerhub_username=openmrsci
bamboo_refapp_distro_scm=git@github.com:openmrs/openmrs-distro-referenceapplication.git
bamboo_repository_207388681_branch_name=master
JAVA_HOME=/usr/lib/jvm/java-1.8.0-openjdk-amd64/
bamboo_repository_207388680_branch_name=master
bamboo_dependenciesDisabled=false
bamboo_repository_207388681_git_username=
bamboo_planRepository_branch=master
bamboo_repository_207388681_revision_number=22434e0afef5495a78b5748d8fa80e8d77dc4b79
bamboo_capability_system_jdk_JDK_1_8_0_275=/usr/lib/jvm/java-1.8.0-openjdk-amd64/
bamboo_capability_system_jdk_JDK_1_8_0_272=/usr/lib/jvm/java-1.8.0-openjdk-amd64/
bamboo_capability_system_jdk_JDK_11=/usr/lib/jvm/java-11-openjdk-amd64
bamboo_planRepository_1_type=gitv2
bamboo_planRepository_branchName=master
bamboo_saucelabs_password=********
bamboo_capability_system_jdk_JDK=/usr/lib/jvm/java-1.8.0-openjdk-amd64/
bamboo_mavenBuildGoals=clean install
bamboo_hg_cache_directory=/home/bamboo-agent/bamboo-agent/xml-data/build-dir/_hg-repositories-cache
bamboo_planRepository_1_username=
bamboo_planRepository_type=gitv2
bamboo_ManualBuildTriggerReason_userName=kdaud
bamboo_git_cache_directory=/home/bamboo-agent/bamboo-agent/xml-data/build-dir/_git-repositories-cache
bamboo_planRepository_2_branchName=master
useMavenReturnCode=false
bamboo_capability_system_builder_node_Node_js=/usr/bin/node
bamboo_build_commandline_com_atlassian_bamboo_plugins_maven_task_builder_mvn3_2=/usr/share/apache-maven-3.3.9/bin/mvn --batch-mode -Djava.io.tmpdir=/home/bamboo-agent/bamboo-agent/.agent_tmp/REFAPP-UI-FRAMEWORK clean install
bamboo_travis_password=********
bamboo_capability_system_builder_mvn3_Maven_3=/usr/share/apache-maven-3.3.9
bamboo_tmp_directory=/home/bamboo-agent/bamboo-agent/temp
bamboo_planKey=REFAPP-UI
bamboo_capability_system_builder_command_nvm=nvm
bamboo_planRepository_username=
bamboo_capability_system_jdk_JDK_1_8_0_282=/usr/lib/jvm/java-1.8.0-openjdk-amd64/
bamboo_planRepository_1_branchName=master
bamboo_dockerhub_password=********
bamboo_resultsUrl=https://ci.openmrs.org/browse/REFAPP-UI-FRAMEWORK-588
bamboo_capability_system_builder_command_transifex=/usr/bin/tx
bamboo_jdbc_password=********
bamboo_build_working_directory=/home/bamboo-agent/bamboo-agent/xml-data/build-dir/REFAPP-UI-FRAMEWORK
bamboo_planRepository_1_name=Distribution
bamboo_capability_system_jdk_JDK_1_8_0_292=/usr/lib/jvm/java-1.8.0-openjdk-amd64/
bamboo_preparing_refapp_distro_release=false
bamboo_shortPlanName=UI
bamboo_planRepository_2_username=
bamboo_planRepository_name=Distribution
bamboo_docs_aws_secret_key=********
bamboo_buildNumber=588
bamboo_repository_207388680_git_username=
bamboo_repository_207388681_git_repositoryUrl=git://github.com/openmrs/openmrs-distro-referenceapplication.git
bamboo_planName=Reference Application - UI
bamboo_build_commandline_com_atlassian_bamboo_plugins_scripttask_task_builder_script_6=/home/bamboo-agent/bamboo-agent/temp/REFAPP-UI-FRAMEWORK-588-ScriptBuildTask-8451398669129419314.sh
bamboo_shortPlanKey=UI
bamboo_shortJobKey=FRAMEWORK
bamboo_planRepository_2_name=UI Test Framework
bamboo_buildTimeStamp=2021-09-24T06:26:32.249Z
bamboo_repository_previous_revision_number=22434e0afef5495a78b5748d8fa80e8d77dc4b79
M2_HOME=/usr/share/apache-maven-3.3.9
bamboo_refapp_bamboo_build_number=
bamboo_repository_git_branch=master
bamboo_buildResultKey=REFAPP-UI-FRAMEWORK-588
bamboo_docs_aws_access_key=AKIAI7KMDL5KP2673G7A
bamboo_buildPlanName=Reference Application - UI - Run QA UI Tests
bamboo_openMRSVersion=2.1.3
bamboo_planRepository_1_revision=22434e0afef5495a78b5748d8fa80e8d77dc4b79
bamboo_repository_207388680_git_repositoryUrl=git://github.com/openmrs/openmrs-contrib-uitestframework.git
bamboo_repository_name=UI Test Framework
bamboo_capability_system_jdk_openjdk_8_jdk=/usr/lib/jvm/java-8-openjdk-amd64
bamboo_planRepository_2_previousRevision=8838c8eeee749c044f9846bcb0a31a7065db1260
bamboo_transifex_password=********
bamboo_repository_207388680_name=UI Test Framework
bamboo_capability_system_jdk_openjdk_11_jdk=/usr/lib/jvm/java-11-openjdk-amd64
bamboo_repository_207388680_previous_revision_number=8838c8eeee749c044f9846bcb0a31a7065db1260
bamboo_buildFailed=false
bamboo_capability_system_builder_grailsBuilder_Grails_2=/opt/grails
bamboo_capability_system_docker_executable=/usr/bin/docker
bamboo_capability_system_builder_command_Bash=/bin/bash
bamboo_agentWorkingDirectory=/home/bamboo-agent/bamboo-agent/xml-data/build-dir
bamboo_planRepository_2_revision=8838c8eeee749c044f9846bcb0a31a7065db1260
bamboo_capability_system_git_executable=/usr/bin/git
bamboo_repository_git_username=
bamboo_planRepository_1_previousRevision=22434e0afef5495a78b5748d8fa80e8d77dc4b79
bamboo_planRepository_branchDisplayName=master
bamboo_planRepository_2_type=gitv2
bamboo_plan_storageTag=plan-207093778
bamboo_repository_207388680_git_branch=master
bamboo_planRepository_2_repositoryUrl=git://github.com/openmrs/openmrs-contrib-uitestframework.git
bamboo_repository_git_repositoryUrl=git://github.com/openmrs/openmrs-distro-referenceapplication.git
bamboo_transifex_username=api
bamboo_refapp_distro_dev_branch=master
bamboo_working_directory=/home/bamboo-agent/bamboo-agent/xml-data/build-dir/REFAPP-UI-FRAMEWORK
bamboo_planRepository_1_repositoryUrl=git://github.com/openmrs/openmrs-distro-referenceapplication.git
bamboo_capability_system_jdk_JDK_1_8=/usr/lib/jvm/java-1.8.0-openjdk-amd64/
bamboo_repository_207388681_git_branch=master
bamboo_repository_207388680_revision_number=8838c8eeee749c044f9846bcb0a31a7065db1260
PATH=/usr/lib/jvm/java-1.8.0-openjdk-amd64//bin:/home/bamboo-agent/.nvm/versions/node/v10.22.1/bin:/home/bamboo-agent/bin:/home/bamboo-agent/.local/bin:/usr/local/sbin:/usr/local/bin:/usr/sbin:/usr/bin:/sbin:/bin:/usr/games:/usr/local/games:/snap/bin:/opt/puppetlabs/bin
24-Sep-2021 06:27:40 [INFO] Error stacktraces are turned on.
24-Sep-2021 06:27:40 [INFO] Scanning for projects...
24-Sep-2021 06:27:40 [WARNING]
24-Sep-2021 06:27:40 [WARNING] Some problems were encountered while building the effective model for org.openmrs.distro:referenceapplication-ui-tests:jar:2.13.0-SNAPSHOT
24-Sep-2021 06:27:40 [WARNING] 'build.plugins.plugin.version' for org.apache.maven.plugins:maven-deploy-plugin is missing. @ line 88, column 21
24-Sep-2021 06:27:40 [WARNING]
24-Sep-2021 06:27:40 [WARNING] It is highly recommended to fix these problems because they threaten the stability of your build.
24-Sep-2021 06:27:40 [WARNING]
24-Sep-2021 06:27:40 [WARNING] For this reason, future Maven versions might no longer support building such malformed projects.
24-Sep-2021 06:27:40 [WARNING]
24-Sep-2021 06:27:40 [INFO] ------------------------------------------------------------------------
24-Sep-2021 06:27:40 [INFO] Reactor Build Order:
24-Sep-2021 06:27:40 [INFO]
24-Sep-2021 06:27:40 [INFO] Reference Application Distribution
24-Sep-2021 06:27:40 [INFO] Reference Application Distribution Package
24-Sep-2021 06:27:40 [INFO] Reference Application Distribution UI Tests
24-Sep-2021 06:27:40 [INFO]                                                                         
24-Sep-2021 06:27:40 [INFO] ------------------------------------------------------------------------
24-Sep-2021 06:27:40 [INFO] Building Reference Application Distribution 2.13.0-SNAPSHOT
24-Sep-2021 06:27:40 [INFO] ------------------------------------------------------------------------
24-Sep-2021 06:27:40 [INFO]
24-Sep-2021 06:27:40 [INFO] --- maven-clean-plugin:2.5:clean (default-clean) @ referenceapplication ---
24-Sep-2021 06:27:40 [INFO]
24-Sep-2021 06:27:40 [INFO] --- maven-install-plugin:2.4:install (default-install) @ referenceapplication ---
24-Sep-2021 06:27:40 [INFO] Installing /home/bamboo-agent/bamboo-agent/xml-data/build-dir/REFAPP-UI-FRAMEWORK/pom.xml to /home/bamboo-agent/.m2/repository/org/openmrs/distro/referenceapplication/2.13.0-SNAPSHOT/referenceapplication-2.13.0-SNAPSHOT.pom
24-Sep-2021 06:27:41 [INFO]                                                                         
24-Sep-2021 06:27:41 [INFO] ------------------------------------------------------------------------
24-Sep-2021 06:27:41 [INFO] Building Reference Application Distribution Package 2.13.0-SNAPSHOT
24-Sep-2021 06:27:41 [INFO] ------------------------------------------------------------------------
24-Sep-2021 06:27:42 [INFO]
24-Sep-2021 06:27:42 [INFO] --- maven-clean-plugin:2.5:clean (default-clean) @ referenceapplication-package ---
24-Sep-2021 06:27:42 [INFO]
24-Sep-2021 06:27:42 [INFO] --- maven-resources-plugin:2.6:resources (default-resources) @ referenceapplication-package ---
24-Sep-2021 06:27:42 [INFO] Using 'UTF-8' encoding to copy filtered resources.
24-Sep-2021 06:27:42 [INFO] Copying 1 resource
24-Sep-2021 06:27:42 [INFO] Copying 2 resources
24-Sep-2021 06:27:42 [INFO] skip non existing resourceDirectory /home/bamboo-agent/bamboo-agent/xml-data/build-dir/REFAPP-UI-FRAMEWORK/package/src/main/webapp
24-Sep-2021 06:27:42 [INFO]
24-Sep-2021 06:27:42 [INFO] --- openmrs-sdk-maven-plugin:4.0.0:build-distro (build-distro) @ referenceapplication-package ---
24-Sep-2021 06:27:46
24-Sep-2021 06:27:46 Downloading modules...
24-Sep-2021 06:27:46
24-Sep-2021 06:27:47 [INFO] Configured Artifact: org.openmrs.web:openmrs-webapp:2.4.0:war
24-Sep-2021 06:27:47 [INFO] Copying openmrs-webapp-2.4.0.war to /home/bamboo-agent/bamboo-agent/xml-data/build-dir/REFAPP-UI-FRAMEWORK/package/target/distro/web/openmrs-2.4.0.war
24-Sep-2021 06:27:48 file:/home/bamboo-agent/bamboo-agent/xml-data/build-dir/REFAPP-UI-FRAMEWORK/package/target/distro/web/openmrs-2.4.0.war
24-Sep-2021 06:27:48 target:/home/bamboo-agent/bamboo-agent/xml-data/build-dir/REFAPP-UI-FRAMEWORK/package/target/distro/web
24-Sep-2021 06:27:49 [INFO] Configured Artifact: org.openmrs.module:addresshierarchy-omod:2.14.2:jar
24-Sep-2021 06:27:49 [INFO] Configured Artifact: org.openmrs.module:legacyui-omod:1.8.3:jar
24-Sep-2021 06:27:49 [INFO] Configured Artifact: org.openmrs.module:openconceptlab-omod:1.2.6:jar
24-Sep-2021 06:27:49 [INFO] Configured Artifact: org.openmrs.module:metadatadeploy-omod:1.13.0:jar
24-Sep-2021 06:27:49 [INFO] Configured Artifact: org.openmrs.module:reportingrest-omod:1.12.0:jar
24-Sep-2021 06:27:49 [INFO] Configured Artifact: org.openmrs.module:owa-omod:1.13.0:jar
24-Sep-2021 06:27:49 [INFO] Configured Artifact: org.openmrs.module:fhir2-omod:1.2.2:jar
24-Sep-2021 06:27:49 [INFO] Configured Artifact: org.openmrs.module:serialization.xstream-omod:0.2.15:omod
24-Sep-2021 06:27:49 [INFO] Configured Artifact: org.openmrs.module:registrationapp-omod:1.24.0:jar
24-Sep-2021 06:27:49 [INFO] Configured Artifact: org.openmrs:event-omod:2.10.0:jar
24-Sep-2021 06:27:49 [INFO] Configured Artifact: org.openmrs.module:uilibrary-omod:2.0.7:jar
24-Sep-2021 06:27:49 [INFO] Configured Artifact: org.openmrs.module:htmlwidgets-omod:1.10.0:jar
24-Sep-2021 06:27:49 [INFO] Configured Artifact: org.openmrs.module:dataexchange-omod:1.3.7:jar
24-Sep-2021 06:27:49 [INFO] Configured Artifact: org.openmrs.module:appui-omod:1.14.0:jar
24-Sep-2021 06:27:49 [INFO] Configured Artifact: org.openmrs.module:allergyui-omod:1.8.4:jar
24-Sep-2021 06:27:49 [INFO] Configured Artifact: org.openmrs.module:providermanagement-omod:2.13.0:jar
24-Sep-2021 06:27:49 [INFO] Configured Artifact: org.openmrs.module:appointmentschedulingui-omod:1.12.0:jar
24-Sep-2021 06:27:49 [INFO] Configured Artifact: org.openmrs.module:attachments-omod:2.5.0:jar
24-Sep-2021 06:27:49 [INFO] Configured Artifact: org.openmrs.module:formentryapp-omod:1.4.2:jar
24-Sep-2021 06:27:49 [INFO] Configured Artifact: org.openmrs.module:idgen-omod:4.7.0:jar
24-Sep-2021 06:27:49 [INFO] Configured Artifact: org.openmrs.module:metadatamapping-omod:1.4.0:jar
24-Sep-2021 06:27:49 [INFO] Configured Artifact: org.openmrs.module:htmlformentryui-omod:2.0.0:jar
24-Sep-2021 06:27:49 [INFO] Configured Artifact: org.openmrs.module:referencedemodata-omod:1.4.7:jar
24-Sep-2021 06:27:49 [INFO] Configured Artifact: org.openmrs.module:emrapi-omod:1.32.0:jar
24-Sep-2021 06:27:49 [INFO] Configured Artifact: org.openmrs.module:referenceapplication-omod:2.12.0-SNAPSHOT:jar
24-Sep-2021 06:27:49 [INFO] Downloading: http://mavenrepo.openmrs.org/nexus/content/repositories/public/org/openmrs/module/referenceapplication-omod/2.12.0-SNAPSHOT/maven-metadata.xml
24-Sep-2021 06:27:51 [INFO] Downloaded: http://mavenrepo.openmrs.org/nexus/content/repositories/public/org/openmrs/module/referenceapplication-omod/2.12.0-SNAPSHOT/maven-metadata.xml (802 B at 0.5 KB/sec)
24-Sep-2021 06:27:51 [INFO] Downloading: http://mavenrepo.openmrs.org/nexus/content/repositories/public/org/openmrs/module/referenceapplication-omod/2.12.0-SNAPSHOT/referenceapplication-omod-2.12.0-20210923.215234-282.jar
24-Sep-2021 06:27:52 [INFO] Downloaded: http://mavenrepo.openmrs.org/nexus/content/repositories/public/org/openmrs/module/referenceapplication-omod/2.12.0-SNAPSHOT/referenceapplication-omod-2.12.0-20210923.215234-282.jar (1902 KB at 1128.2 KB/sec)
24-Sep-2021 06:27:52 [INFO] Configured Artifact: org.openmrs.module:htmlformentry-omod:4.1.0:jar
24-Sep-2021 06:27:52 [INFO] Configured Artifact: org.openmrs.module:appframework-omod:2.16.0:jar
24-Sep-2021 06:27:52 [INFO] Configured Artifact: org.openmrs.module:referencemetadata-omod:2.12.0:jar
24-Sep-2021 06:27:52 [INFO] Configured Artifact: org.openmrs.module:reportingui-omod:1.8.0:jar
24-Sep-2021 06:27:52 [INFO] Configured Artifact: org.openmrs.module:coreapps-omod:1.34.0:jar
24-Sep-2021 06:27:52 [INFO] Configured Artifact: org.openmrs.module:reportingcompatibility-omod:2.0.8:jar
24-Sep-2021 06:27:52 [INFO] Configured Artifact: org.openmrs.module:reporting-omod:1.23.0:jar
24-Sep-2021 06:27:52 [INFO] Configured Artifact: org.openmrs.module:adminui-omod:1.5.0:jar
24-Sep-2021 06:27:52 [INFO] Configured Artifact: org.openmrs.module:registrationcore-omod:1.11.0:jar
24-Sep-2021 06:27:52 [INFO] Configured Artifact: org.openmrs.module:appointmentscheduling-omod:1.16.0:jar
24-Sep-2021 06:27:52 [INFO] Configured Artifact: org.openmrs.module:atlas-omod:2.2.5:omod
24-Sep-2021 06:27:52 [INFO] Configured Artifact: org.openmrs.module:calculation-omod:1.3.0:jar
24-Sep-2021 06:27:52 [INFO] Configured Artifact: org.openmrs.module:webservices.rest-omod:2.32.0:jar
24-Sep-2021 06:27:52 [INFO] Configured Artifact: org.openmrs.module:spa-omod:1.0.8:jar
24-Sep-2021 06:27:52 [INFO] Configured Artifact: org.openmrs.module:uicommons-omod:2.19.0:jar
24-Sep-2021 06:27:52 [INFO] Configured Artifact: org.openmrs.module:uiframework-omod:3.21.0:jar
24-Sep-2021 06:27:52 [INFO] Configured Artifact: org.openmrs.module:metadatasharing-omod:1.8.0:jar
24-Sep-2021 06:27:52 [INFO] Copying addresshierarchy-omod-2.14.2.jar to /home/bamboo-agent/bamboo-agent/xml-data/build-dir/REFAPP-UI-FRAMEWORK/package/target/distro/web/modules/addresshierarchy-2.14.2.omod
24-Sep-2021 06:27:52 [INFO] Copying legacyui-omod-1.8.3.jar to /home/bamboo-agent/bamboo-agent/xml-data/build-dir/REFAPP-UI-FRAMEWORK/package/target/distro/web/modules/legacyui-1.8.3.omod
24-Sep-2021 06:27:52 [INFO] Copying openconceptlab-omod-1.2.6.jar to /home/bamboo-agent/bamboo-agent/xml-data/build-dir/REFAPP-UI-FRAMEWORK/package/target/distro/web/modules/openconceptlab-1.2.6.omod
24-Sep-2021 06:27:52 [INFO] Copying metadatadeploy-omod-1.13.0.jar to /home/bamboo-agent/bamboo-agent/xml-data/build-dir/REFAPP-UI-FRAMEWORK/package/target/distro/web/modules/metadatadeploy-1.13.0.omod
24-Sep-2021 06:27:52 [INFO] Copying reportingrest-omod-1.12.0.jar to /home/bamboo-agent/bamboo-agent/xml-data/build-dir/REFAPP-UI-FRAMEWORK/package/target/distro/web/modules/reportingrest-1.12.0.omod
24-Sep-2021 06:27:52 [INFO] Copying owa-omod-1.13.0.jar to /home/bamboo-agent/bamboo-agent/xml-data/build-dir/REFAPP-UI-FRAMEWORK/package/target/distro/web/modules/owa-1.13.0.omod
24-Sep-2021 06:27:52 [INFO] Copying fhir2-omod-1.2.2.jar to /home/bamboo-agent/bamboo-agent/xml-data/build-dir/REFAPP-UI-FRAMEWORK/package/target/distro/web/modules/fhir2-1.2.2.omod
24-Sep-2021 06:27:53 [INFO] Copying serialization.xstream-omod-0.2.15.omod to /home/bamboo-agent/bamboo-agent/xml-data/build-dir/REFAPP-UI-FRAMEWORK/package/target/distro/web/modules/serialization.xstream-0.2.15.omod
24-Sep-2021 06:27:53 [INFO] Copying registrationapp-omod-1.24.0.jar to /home/bamboo-agent/bamboo-agent/xml-data/build-dir/REFAPP-UI-FRAMEWORK/package/target/distro/web/modules/registrationapp-1.24.0.omod
24-Sep-2021 06:27:53 [INFO] Copying event-omod-2.10.0.jar to /home/bamboo-agent/bamboo-agent/xml-data/build-dir/REFAPP-UI-FRAMEWORK/package/target/distro/web/modules/event-2.10.0.omod
24-Sep-2021 06:27:53 [INFO] Copying uilibrary-omod-2.0.7.jar to /home/bamboo-agent/bamboo-agent/xml-data/build-dir/REFAPP-UI-FRAMEWORK/package/target/distro/web/modules/uilibrary-2.0.7.omod
24-Sep-2021 06:27:53 [INFO] Copying htmlwidgets-omod-1.10.0.jar to /home/bamboo-agent/bamboo-agent/xml-data/build-dir/REFAPP-UI-FRAMEWORK/package/target/distro/web/modules/htmlwidgets-1.10.0.omod
24-Sep-2021 06:27:53 [INFO] Copying dataexchange-omod-1.3.7.jar to /home/bamboo-agent/bamboo-agent/xml-data/build-dir/REFAPP-UI-FRAMEWORK/package/target/distro/web/modules/dataexchange-1.3.7.omod
24-Sep-2021 06:27:53 [INFO] Copying appui-omod-1.14.0.jar to /home/bamboo-agent/bamboo-agent/xml-data/build-dir/REFAPP-UI-FRAMEWORK/package/target/distro/web/modules/appui-1.14.0.omod
24-Sep-2021 06:27:53 [INFO] Copying allergyui-omod-1.8.4.jar to /home/bamboo-agent/bamboo-agent/xml-data/build-dir/REFAPP-UI-FRAMEWORK/package/target/distro/web/modules/allergyui-1.8.4.omod
24-Sep-2021 06:27:53 [INFO] Copying providermanagement-omod-2.13.0.jar to /home/bamboo-agent/bamboo-agent/xml-data/build-dir/REFAPP-UI-FRAMEWORK/package/target/distro/web/modules/providermanagement-2.13.0.omod
24-Sep-2021 06:27:53 [INFO] Copying appointmentschedulingui-omod-1.12.0.jar to /home/bamboo-agent/bamboo-agent/xml-data/build-dir/REFAPP-UI-FRAMEWORK/package/target/distro/web/modules/appointmentschedulingui-1.12.0.omod
24-Sep-2021 06:27:53 [INFO] Copying attachments-omod-2.5.0.jar to /home/bamboo-agent/bamboo-agent/xml-data/build-dir/REFAPP-UI-FRAMEWORK/package/target/distro/web/modules/attachments-2.5.0.omod
24-Sep-2021 06:27:53 [INFO] Copying formentryapp-omod-1.4.2.jar to /home/bamboo-agent/bamboo-agent/xml-data/build-dir/REFAPP-UI-FRAMEWORK/package/target/distro/web/modules/formentryapp-1.4.2.omod
24-Sep-2021 06:27:53 [INFO] Copying idgen-omod-4.7.0.jar to /home/bamboo-agent/bamboo-agent/xml-data/build-dir/REFAPP-UI-FRAMEWORK/package/target/distro/web/modules/idgen-4.7.0.omod
24-Sep-2021 06:27:53 [INFO] Copying metadatamapping-omod-1.4.0.jar to /home/bamboo-agent/bamboo-agent/xml-data/build-dir/REFAPP-UI-FRAMEWORK/package/target/distro/web/modules/metadatamapping-1.4.0.omod
24-Sep-2021 06:27:53 [INFO] Copying htmlformentryui-omod-2.0.0.jar to /home/bamboo-agent/bamboo-agent/xml-data/build-dir/REFAPP-UI-FRAMEWORK/package/target/distro/web/modules/htmlformentryui-2.0.0.omod
24-Sep-2021 06:27:53 [INFO] Copying referencedemodata-omod-1.4.7.jar to /home/bamboo-agent/bamboo-agent/xml-data/build-dir/REFAPP-UI-FRAMEWORK/package/target/distro/web/modules/referencedemodata-1.4.7.omod
24-Sep-2021 06:27:53 [INFO] Copying emrapi-omod-1.32.0.jar to /home/bamboo-agent/bamboo-agent/xml-data/build-dir/REFAPP-UI-FRAMEWORK/package/target/distro/web/modules/emrapi-1.32.0.omod
24-Sep-2021 06:27:53 [INFO] Copying referenceapplication-omod-2.12.0-SNAPSHOT.jar to /home/bamboo-agent/bamboo-agent/xml-data/build-dir/REFAPP-UI-FRAMEWORK/package/target/distro/web/modules/referenceapplication-2.12.0-SNAPSHOT.omod
24-Sep-2021 06:27:53 [INFO] Copying htmlformentry-omod-4.1.0.jar to /home/bamboo-agent/bamboo-agent/xml-data/build-dir/REFAPP-UI-FRAMEWORK/package/target/distro/web/modules/htmlformentry-4.1.0.omod
24-Sep-2021 06:27:53 [INFO] Copying appframework-omod-2.16.0.jar to /home/bamboo-agent/bamboo-agent/xml-data/build-dir/REFAPP-UI-FRAMEWORK/package/target/distro/web/modules/appframework-2.16.0.omod
24-Sep-2021 06:27:53 [INFO] Copying referencemetadata-omod-2.12.0.jar to /home/bamboo-agent/bamboo-agent/xml-data/build-dir/REFAPP-UI-FRAMEWORK/package/target/distro/web/modules/referencemetadata-2.12.0.omod
24-Sep-2021 06:27:53 [INFO] Copying reportingui-omod-1.8.0.jar to /home/bamboo-agent/bamboo-agent/xml-data/build-dir/REFAPP-UI-FRAMEWORK/package/target/distro/web/modules/reportingui-1.8.0.omod
24-Sep-2021 06:27:53 [INFO] Copying coreapps-omod-1.34.0.jar to /home/bamboo-agent/bamboo-agent/xml-data/build-dir/REFAPP-UI-FRAMEWORK/package/target/distro/web/modules/coreapps-1.34.0.omod
24-Sep-2021 06:27:53 [INFO] Copying reportingcompatibility-omod-2.0.8.jar to /home/bamboo-agent/bamboo-agent/xml-data/build-dir/REFAPP-UI-FRAMEWORK/package/target/distro/web/modules/reportingcompatibility-2.0.8.omod
24-Sep-2021 06:27:53 [INFO] Copying reporting-omod-1.23.0.jar to /home/bamboo-agent/bamboo-agent/xml-data/build-dir/REFAPP-UI-FRAMEWORK/package/target/distro/web/modules/reporting-1.23.0.omod
24-Sep-2021 06:27:53 [INFO] Copying adminui-omod-1.5.0.jar to /home/bamboo-agent/bamboo-agent/xml-data/build-dir/REFAPP-UI-FRAMEWORK/package/target/distro/web/modules/adminui-1.5.0.omod
24-Sep-2021 06:27:53 [INFO] Copying registrationcore-omod-1.11.0.jar to /home/bamboo-agent/bamboo-agent/xml-data/build-dir/REFAPP-UI-FRAMEWORK/package/target/distro/web/modules/registrationcore-1.11.0.omod
24-Sep-2021 06:27:53 [INFO] Copying appointmentscheduling-omod-1.16.0.jar to /home/bamboo-agent/bamboo-agent/xml-data/build-dir/REFAPP-UI-FRAMEWORK/package/target/distro/web/modules/appointmentscheduling-1.16.0.omod
24-Sep-2021 06:27:53 [INFO] Copying atlas-omod-2.2.5.omod to /home/bamboo-agent/bamboo-agent/xml-data/build-dir/REFAPP-UI-FRAMEWORK/package/target/distro/web/modules/atlas-2.2.5.omod
24-Sep-2021 06:27:53 [INFO] Copying calculation-omod-1.3.0.jar to /home/bamboo-agent/bamboo-agent/xml-data/build-dir/REFAPP-UI-FRAMEWORK/package/target/distro/web/modules/calculation-1.3.0.omod
24-Sep-2021 06:27:53 [INFO] Copying webservices.rest-omod-2.32.0.jar to /home/bamboo-agent/bamboo-agent/xml-data/build-dir/REFAPP-UI-FRAMEWORK/package/target/distro/web/modules/webservices.rest-2.32.0.omod
24-Sep-2021 06:27:53 [INFO] Copying spa-omod-1.0.8.jar to /home/bamboo-agent/bamboo-agent/xml-data/build-dir/REFAPP-UI-FRAMEWORK/package/target/distro/web/modules/spa-1.0.8.omod
24-Sep-2021 06:27:53 [INFO] Copying uicommons-omod-2.19.0.jar to /home/bamboo-agent/bamboo-agent/xml-data/build-dir/REFAPP-UI-FRAMEWORK/package/target/distro/web/modules/uicommons-2.19.0.omod
24-Sep-2021 06:27:53 [INFO] Copying uiframework-omod-3.21.0.jar to /home/bamboo-agent/bamboo-agent/xml-data/build-dir/REFAPP-UI-FRAMEWORK/package/target/distro/web/modules/uiframework-3.21.0.omod
24-Sep-2021 06:27:53 [INFO] Copying metadatasharing-omod-1.8.0.jar to /home/bamboo-agent/bamboo-agent/xml-data/build-dir/REFAPP-UI-FRAMEWORK/package/target/distro/web/modules/metadatasharing-1.8.0.omod
24-Sep-2021 06:27:53
24-Sep-2021 06:27:53 Downloading OWAs...
24-Sep-2021 06:27:53
24-Sep-2021 06:27:53
24-Sep-2021 06:27:53 Downloading OWA: org.openmrs.owa:openmrs-owa-sysadmin:1.2
24-Sep-2021 06:27:53 [INFO] Configured Artifact: org.openmrs.owa:sysadmin:1.2:zip
24-Sep-2021 06:27:53 [INFO] Copying sysadmin-1.2.zip to /home/bamboo-agent/bamboo-agent/xml-data/build-dir/REFAPP-UI-FRAMEWORK/package/target/distro/web/owa/sysadmin-1.2.zip
24-Sep-2021 06:27:53
24-Sep-2021 06:27:53 Creating Docker Compose configuration...
24-Sep-2021 06:27:53
24-Sep-2021 06:27:54
24-Sep-2021 06:27:54 The 'referenceapplication' distribution created! To start up the server run 'docker-compose up' from /home/bamboo-agent/bamboo-agent/xml-data/build-dir/REFAPP-UI-FRAMEWORK/package/target/distro
24-Sep-2021 06:27:54
24-Sep-2021 06:27:54 [INFO]
24-Sep-2021 06:27:54 [INFO] --- openmrs-sdk-maven-plugin:4.0.0:build-distro (build-bundled-distro) @ referenceapplication-package ---
24-Sep-2021 06:27:54
24-Sep-2021 06:27:54 Downloading modules...
24-Sep-2021 06:27:54
24-Sep-2021 06:27:54 [INFO] Configured Artifact: org.openmrs.web:openmrs-webapp:2.4.0:war
24-Sep-2021 06:27:54 [INFO] Copying openmrs-webapp-2.4.0.war to /home/bamboo-agent/bamboo-agent/xml-data/build-dir/REFAPP-UI-FRAMEWORK/package/target/bundled-distro/web/openmrs-2.4.0.war
24-Sep-2021 06:27:54 file:/home/bamboo-agent/bamboo-agent/xml-data/build-dir/REFAPP-UI-FRAMEWORK/package/target/bundled-distro/web/openmrs-2.4.0.war
24-Sep-2021 06:27:54 target:/home/bamboo-agent/bamboo-agent/xml-data/build-dir/REFAPP-UI-FRAMEWORK/package/target/bundled-distro/web
24-Sep-2021 06:27:54 [INFO] Configured Artifact: org.openmrs.module:addresshierarchy-omod:2.14.2:jar
24-Sep-2021 06:27:54 [INFO] Configured Artifact: org.openmrs.module:legacyui-omod:1.8.3:jar
24-Sep-2021 06:27:54 [INFO] Configured Artifact: org.openmrs.module:openconceptlab-omod:1.2.6:jar
24-Sep-2021 06:27:54 [INFO] Configured Artifact: org.openmrs.module:metadatadeploy-omod:1.13.0:jar
24-Sep-2021 06:27:54 [INFO] Configured Artifact: org.openmrs.module:reportingrest-omod:1.12.0:jar
24-Sep-2021 06:27:54 [INFO] Configured Artifact: org.openmrs.module:owa-omod:1.13.0:jar
24-Sep-2021 06:27:54 [INFO] Configured Artifact: org.openmrs.module:fhir2-omod:1.2.2:jar
24-Sep-2021 06:27:54 [INFO] Configured Artifact: org.openmrs.module:serialization.xstream-omod:0.2.15:omod
24-Sep-2021 06:27:54 [INFO] Configured Artifact: org.openmrs.module:registrationapp-omod:1.24.0:jar
24-Sep-2021 06:27:54 [INFO] Configured Artifact: org.openmrs:event-omod:2.10.0:jar
24-Sep-2021 06:27:54 [INFO] Configured Artifact: org.openmrs.module:uilibrary-omod:2.0.7:jar
24-Sep-2021 06:27:54 [INFO] Configured Artifact: org.openmrs.module:htmlwidgets-omod:1.10.0:jar
24-Sep-2021 06:27:54 [INFO] Configured Artifact: org.openmrs.module:dataexchange-omod:1.3.7:jar
24-Sep-2021 06:27:54 [INFO] Configured Artifact: org.openmrs.module:appui-omod:1.14.0:jar
24-Sep-2021 06:27:54 [INFO] Configured Artifact: org.openmrs.module:allergyui-omod:1.8.4:jar
24-Sep-2021 06:27:54 [INFO] Configured Artifact: org.openmrs.module:providermanagement-omod:2.13.0:jar
24-Sep-2021 06:27:54 [INFO] Configured Artifact: org.openmrs.module:appointmentschedulingui-omod:1.12.0:jar
24-Sep-2021 06:27:54 [INFO] Configured Artifact: org.openmrs.module:attachments-omod:2.5.0:jar
24-Sep-2021 06:27:54 [INFO] Configured Artifact: org.openmrs.module:formentryapp-omod:1.4.2:jar
24-Sep-2021 06:27:54 [INFO] Configured Artifact: org.openmrs.module:idgen-omod:4.7.0:jar
24-Sep-2021 06:27:54 [INFO] Configured Artifact: org.openmrs.module:metadatamapping-omod:1.4.0:jar
24-Sep-2021 06:27:54 [INFO] Configured Artifact: org.openmrs.module:htmlformentryui-omod:2.0.0:jar
24-Sep-2021 06:27:54 [INFO] Configured Artifact: org.openmrs.module:referencedemodata-omod:1.4.7:jar
24-Sep-2021 06:27:54 [INFO] Configured Artifact: org.openmrs.module:emrapi-omod:1.32.0:jar
24-Sep-2021 06:27:54 [INFO] Configured Artifact: org.openmrs.module:referenceapplication-omod:2.12.0-SNAPSHOT:jar
24-Sep-2021 06:27:54 [INFO] Configured Artifact: org.openmrs.module:htmlformentry-omod:4.1.0:jar
24-Sep-2021 06:27:54 [INFO] Configured Artifact: org.openmrs.module:appframework-omod:2.16.0:jar
24-Sep-2021 06:27:54 [INFO] Configured Artifact: org.openmrs.module:referencemetadata-omod:2.12.0:jar
24-Sep-2021 06:27:54 [INFO] Configured Artifact: org.openmrs.module:reportingui-omod:1.8.0:jar
24-Sep-2021 06:27:54 [INFO] Configured Artifact: org.openmrs.module:coreapps-omod:1.34.0:jar
24-Sep-2021 06:27:54 [INFO] Configured Artifact: org.openmrs.module:reportingcompatibility-omod:2.0.8:jar
24-Sep-2021 06:27:54 [INFO] Configured Artifact: org.openmrs.module:reporting-omod:1.23.0:jar
24-Sep-2021 06:27:54 [INFO] Configured Artifact: org.openmrs.module:adminui-omod:1.5.0:jar
24-Sep-2021 06:27:54 [INFO] Configured Artifact: org.openmrs.module:registrationcore-omod:1.11.0:jar
24-Sep-2021 06:27:54 [INFO] Configured Artifact: org.openmrs.module:appointmentscheduling-omod:1.16.0:jar
24-Sep-2021 06:27:54 [INFO] Configured Artifact: org.openmrs.module:atlas-omod:2.2.5:omod
24-Sep-2021 06:27:54 [INFO] Configured Artifact: org.openmrs.module:calculation-omod:1.3.0:jar
24-Sep-2021 06:27:54 [INFO] Configured Artifact: org.openmrs.module:webservices.rest-omod:2.32.0:jar
24-Sep-2021 06:27:54 [INFO] Configured Artifact: org.openmrs.module:spa-omod:1.0.8:jar
24-Sep-2021 06:27:54 [INFO] Configured Artifact: org.openmrs.module:uicommons-omod:2.19.0:jar
24-Sep-2021 06:27:54 [INFO] Configured Artifact: org.openmrs.module:uiframework-omod:3.21.0:jar
24-Sep-2021 06:27:54 [INFO] Configured Artifact: org.openmrs.module:metadatasharing-omod:1.8.0:jar
24-Sep-2021 06:27:54 [INFO] Copying addresshierarchy-omod-2.14.2.jar to /home/bamboo-agent/bamboo-agent/xml-data/build-dir/REFAPP-UI-FRAMEWORK/package/target/bundled-distro/web/WEB-INF/bundledModules/addresshierarchy-2.14.2.omod
24-Sep-2021 06:27:54 [INFO] Copying legacyui-omod-1.8.3.jar to /home/bamboo-agent/bamboo-agent/xml-data/build-dir/REFAPP-UI-FRAMEWORK/package/target/bundled-distro/web/WEB-INF/bundledModules/legacyui-1.8.3.omod
24-Sep-2021 06:27:55 [INFO] Copying openconceptlab-omod-1.2.6.jar to /home/bamboo-agent/bamboo-agent/xml-data/build-dir/REFAPP-UI-FRAMEWORK/package/target/bundled-distro/web/WEB-INF/bundledModules/openconceptlab-1.2.6.omod
24-Sep-2021 06:27:55 [INFO] Copying metadatadeploy-omod-1.13.0.jar to /home/bamboo-agent/bamboo-agent/xml-data/build-dir/REFAPP-UI-FRAMEWORK/package/target/bundled-distro/web/WEB-INF/bundledModules/metadatadeploy-1.13.0.omod
24-Sep-2021 06:27:55 [INFO] Copying reportingrest-omod-1.12.0.jar to /home/bamboo-agent/bamboo-agent/xml-data/build-dir/REFAPP-UI-FRAMEWORK/package/target/bundled-distro/web/WEB-INF/bundledModules/reportingrest-1.12.0.omod
24-Sep-2021 06:27:55 [INFO] Copying owa-omod-1.13.0.jar to /home/bamboo-agent/bamboo-agent/xml-data/build-dir/REFAPP-UI-FRAMEWORK/package/target/bundled-distro/web/WEB-INF/bundledModules/owa-1.13.0.omod
24-Sep-2021 06:27:55 [INFO] Copying fhir2-omod-1.2.2.jar to /home/bamboo-agent/bamboo-agent/xml-data/build-dir/REFAPP-UI-FRAMEWORK/package/target/bundled-distro/web/WEB-INF/bundledModules/fhir2-1.2.2.omod
24-Sep-2021 06:27:55 [INFO] Copying serialization.xstream-omod-0.2.15.omod to /home/bamboo-agent/bamboo-agent/xml-data/build-dir/REFAPP-UI-FRAMEWORK/package/target/bundled-distro/web/WEB-INF/bundledModules/serialization.xstream-0.2.15.omod
24-Sep-2021 06:27:55 [INFO] Copying registrationapp-omod-1.24.0.jar to /home/bamboo-agent/bamboo-agent/xml-data/build-dir/REFAPP-UI-FRAMEWORK/package/target/bundled-distro/web/WEB-INF/bundledModules/registrationapp-1.24.0.omod
24-Sep-2021 06:27:55 [INFO] Copying event-omod-2.10.0.jar to /home/bamboo-agent/bamboo-agent/xml-data/build-dir/REFAPP-UI-FRAMEWORK/package/target/bundled-distro/web/WEB-INF/bundledModules/event-2.10.0.omod
24-Sep-2021 06:27:55 [INFO] Copying uilibrary-omod-2.0.7.jar to /home/bamboo-agent/bamboo-agent/xml-data/build-dir/REFAPP-UI-FRAMEWORK/package/target/bundled-distro/web/WEB-INF/bundledModules/uilibrary-2.0.7.omod
24-Sep-2021 06:27:55 [INFO] Copying htmlwidgets-omod-1.10.0.jar to /home/bamboo-agent/bamboo-agent/xml-data/build-dir/REFAPP-UI-FRAMEWORK/package/target/bundled-distro/web/WEB-INF/bundledModules/htmlwidgets-1.10.0.omod
24-Sep-2021 06:27:55 [INFO] Copying dataexchange-omod-1.3.7.jar to /home/bamboo-agent/bamboo-agent/xml-data/build-dir/REFAPP-UI-FRAMEWORK/package/target/bundled-distro/web/WEB-INF/bundledModules/dataexchange-1.3.7.omod
24-Sep-2021 06:27:55 [INFO] Copying appui-omod-1.14.0.jar to /home/bamboo-agent/bamboo-agent/xml-data/build-dir/REFAPP-UI-FRAMEWORK/package/target/bundled-distro/web/WEB-INF/bundledModules/appui-1.14.0.omod
24-Sep-2021 06:27:55 [INFO] Copying allergyui-omod-1.8.4.jar to /home/bamboo-agent/bamboo-agent/xml-data/build-dir/REFAPP-UI-FRAMEWORK/package/target/bundled-distro/web/WEB-INF/bundledModules/allergyui-1.8.4.omod
24-Sep-2021 06:27:55 [INFO] Copying providermanagement-omod-2.13.0.jar to /home/bamboo-agent/bamboo-agent/xml-data/build-dir/REFAPP-UI-FRAMEWORK/package/target/bundled-distro/web/WEB-INF/bundledModules/providermanagement-2.13.0.omod
24-Sep-2021 06:27:55 [INFO] Copying appointmentschedulingui-omod-1.12.0.jar to /home/bamboo-agent/bamboo-agent/xml-data/build-dir/REFAPP-UI-FRAMEWORK/package/target/bundled-distro/web/WEB-INF/bundledModules/appointmentschedulingui-1.12.0.omod
24-Sep-2021 06:27:55 [INFO] Copying attachments-omod-2.5.0.jar to /home/bamboo-agent/bamboo-agent/xml-data/build-dir/REFAPP-UI-FRAMEWORK/package/target/bundled-distro/web/WEB-INF/bundledModules/attachments-2.5.0.omod
24-Sep-2021 06:27:55 [INFO] Copying formentryapp-omod-1.4.2.jar to /home/bamboo-agent/bamboo-agent/xml-data/build-dir/REFAPP-UI-FRAMEWORK/package/target/bundled-distro/web/WEB-INF/bundledModules/formentryapp-1.4.2.omod
24-Sep-2021 06:27:55 [INFO] Copying idgen-omod-4.7.0.jar to /home/bamboo-agent/bamboo-agent/xml-data/build-dir/REFAPP-UI-FRAMEWORK/package/target/bundled-distro/web/WEB-INF/bundledModules/idgen-4.7.0.omod
24-Sep-2021 06:27:55 [INFO] Copying metadatamapping-omod-1.4.0.jar to /home/bamboo-agent/bamboo-agent/xml-data/build-dir/REFAPP-UI-FRAMEWORK/package/target/bundled-distro/web/WEB-INF/bundledModules/metadatamapping-1.4.0.omod
24-Sep-2021 06:27:55 [INFO] Copying htmlformentryui-omod-2.0.0.jar to /home/bamboo-agent/bamboo-agent/xml-data/build-dir/REFAPP-UI-FRAMEWORK/package/target/bundled-distro/web/WEB-INF/bundledModules/htmlformentryui-2.0.0.omod
24-Sep-2021 06:27:55 [INFO] Copying referencedemodata-omod-1.4.7.jar to /home/bamboo-agent/bamboo-agent/xml-data/build-dir/REFAPP-UI-FRAMEWORK/package/target/bundled-distro/web/WEB-INF/bundledModules/referencedemodata-1.4.7.omod
24-Sep-2021 06:27:55 [INFO] Copying emrapi-omod-1.32.0.jar to /home/bamboo-agent/bamboo-agent/xml-data/build-dir/REFAPP-UI-FRAMEWORK/package/target/bundled-distro/web/WEB-INF/bundledModules/emrapi-1.32.0.omod
24-Sep-2021 06:27:55 [INFO] Copying referenceapplication-omod-2.12.0-SNAPSHOT.jar to /home/bamboo-agent/bamboo-agent/xml-data/build-dir/REFAPP-UI-FRAMEWORK/package/target/bundled-distro/web/WEB-INF/bundledModules/referenceapplication-2.12.0-SNAPSHOT.omod
24-Sep-2021 06:27:55 [INFO] Copying htmlformentry-omod-4.1.0.jar to /home/bamboo-agent/bamboo-agent/xml-data/build-dir/REFAPP-UI-FRAMEWORK/package/target/bundled-distro/web/WEB-INF/bundledModules/htmlformentry-4.1.0.omod
24-Sep-2021 06:27:55 [INFO] Copying appframework-omod-2.16.0.jar to /home/bamboo-agent/bamboo-agent/xml-data/build-dir/REFAPP-UI-FRAMEWORK/package/target/bundled-distro/web/WEB-INF/bundledModules/appframework-2.16.0.omod
24-Sep-2021 06:27:55 [INFO] Copying referencemetadata-omod-2.12.0.jar to /home/bamboo-agent/bamboo-agent/xml-data/build-dir/REFAPP-UI-FRAMEWORK/package/target/bundled-distro/web/WEB-INF/bundledModules/referencemetadata-2.12.0.omod
24-Sep-2021 06:27:55 [INFO] Copying reportingui-omod-1.8.0.jar to /home/bamboo-agent/bamboo-agent/xml-data/build-dir/REFAPP-UI-FRAMEWORK/package/target/bundled-distro/web/WEB-INF/bundledModules/reportingui-1.8.0.omod
24-Sep-2021 06:27:55 [INFO] Copying coreapps-omod-1.34.0.jar to /home/bamboo-agent/bamboo-agent/xml-data/build-dir/REFAPP-UI-FRAMEWORK/package/target/bundled-distro/web/WEB-INF/bundledModules/coreapps-1.34.0.omod
24-Sep-2021 06:27:55 [INFO] Copying reportingcompatibility-omod-2.0.8.jar to /home/bamboo-agent/bamboo-agent/xml-data/build-dir/REFAPP-UI-FRAMEWORK/package/target/bundled-distro/web/WEB-INF/bundledModules/reportingcompatibility-2.0.8.omod
24-Sep-2021 06:27:55 [INFO] Copying reporting-omod-1.23.0.jar to /home/bamboo-agent/bamboo-agent/xml-data/build-dir/REFAPP-UI-FRAMEWORK/package/target/bundled-distro/web/WEB-INF/bundledModules/reporting-1.23.0.omod
24-Sep-2021 06:27:55 [INFO] Copying adminui-omod-1.5.0.jar to /home/bamboo-agent/bamboo-agent/xml-data/build-dir/REFAPP-UI-FRAMEWORK/package/target/bundled-distro/web/WEB-INF/bundledModules/adminui-1.5.0.omod
24-Sep-2021 06:27:55 [INFO] Copying registrationcore-omod-1.11.0.jar to /home/bamboo-agent/bamboo-agent/xml-data/build-dir/REFAPP-UI-FRAMEWORK/package/target/bundled-distro/web/WEB-INF/bundledModules/registrationcore-1.11.0.omod
24-Sep-2021 06:27:55 [INFO] Copying appointmentscheduling-omod-1.16.0.jar to /home/bamboo-agent/bamboo-agent/xml-data/build-dir/REFAPP-UI-FRAMEWORK/package/target/bundled-distro/web/WEB-INF/bundledModules/appointmentscheduling-1.16.0.omod
24-Sep-2021 06:27:55 [INFO] Copying atlas-omod-2.2.5.omod to /home/bamboo-agent/bamboo-agent/xml-data/build-dir/REFAPP-UI-FRAMEWORK/package/target/bundled-distro/web/WEB-INF/bundledModules/atlas-2.2.5.omod
24-Sep-2021 06:27:55 [INFO] Copying calculation-omod-1.3.0.jar to /home/bamboo-agent/bamboo-agent/xml-data/build-dir/REFAPP-UI-FRAMEWORK/package/target/bundled-distro/web/WEB-INF/bundledModules/calculation-1.3.0.omod
24-Sep-2021 06:27:55 [INFO] Copying webservices.rest-omod-2.32.0.jar to /home/bamboo-agent/bamboo-agent/xml-data/build-dir/REFAPP-UI-FRAMEWORK/package/target/bundled-distro/web/WEB-INF/bundledModules/webservices.rest-2.32.0.omod
24-Sep-2021 06:27:55 [INFO] Copying spa-omod-1.0.8.jar to /home/bamboo-agent/bamboo-agent/xml-data/build-dir/REFAPP-UI-FRAMEWORK/package/target/bundled-distro/web/WEB-INF/bundledModules/spa-1.0.8.omod
24-Sep-2021 06:27:55 [INFO] Copying uicommons-omod-2.19.0.jar to /home/bamboo-agent/bamboo-agent/xml-data/build-dir/REFAPP-UI-FRAMEWORK/package/target/bundled-distro/web/WEB-INF/bundledModules/uicommons-2.19.0.omod
24-Sep-2021 06:27:55 [INFO] Copying uiframework-omod-3.21.0.jar to /home/bamboo-agent/bamboo-agent/xml-data/build-dir/REFAPP-UI-FRAMEWORK/package/target/bundled-distro/web/WEB-INF/bundledModules/uiframework-3.21.0.omod
24-Sep-2021 06:27:55 [INFO] Copying metadatasharing-omod-1.8.0.jar to /home/bamboo-agent/bamboo-agent/xml-data/build-dir/REFAPP-UI-FRAMEWORK/package/target/bundled-distro/web/WEB-INF/bundledModules/metadatasharing-1.8.0.omod
24-Sep-2021 06:27:55
24-Sep-2021 06:27:55 Downloading OWAs...
24-Sep-2021 06:27:55
24-Sep-2021 06:27:55
24-Sep-2021 06:27:55 Downloading OWA: org.openmrs.owa:openmrs-owa-sysadmin:1.2
24-Sep-2021 06:27:55 [INFO] Configured Artifact: org.openmrs.owa:sysadmin:1.2:zip
24-Sep-2021 06:27:55 [INFO] Copying sysadmin-1.2.zip to /home/bamboo-agent/bamboo-agent/xml-data/build-dir/REFAPP-UI-FRAMEWORK/package/target/bundled-distro/web/WEB-INF/bundledOwas/sysadmin-1.2.zip
24-Sep-2021 06:27:56
24-Sep-2021 06:27:56 Creating Docker Compose configuration...
24-Sep-2021 06:27:56
24-Sep-2021 06:27:58
24-Sep-2021 06:27:58 The 'referenceapplication' distribution created! To start up the server run 'docker-compose up' from /home/bamboo-agent/bamboo-agent/xml-data/build-dir/REFAPP-UI-FRAMEWORK/package/target/bundled-distro
24-Sep-2021 06:27:58
24-Sep-2021 06:27:58 [INFO]
24-Sep-2021 06:27:58 [INFO] --- maven-compiler-plugin:3.1:compile (default-compile) @ referenceapplication-package ---
24-Sep-2021 06:27:58 [INFO] No sources to compile
24-Sep-2021 06:27:58 [INFO]
24-Sep-2021 06:27:58 [INFO] --- maven-resources-plugin:2.6:testResources (default-testResources) @ referenceapplication-package ---
24-Sep-2021 06:27:58 [INFO] Using 'UTF-8' encoding to copy filtered resources.
24-Sep-2021 06:27:58 [INFO] skip non existing resourceDirectory /home/bamboo-agent/bamboo-agent/xml-data/build-dir/REFAPP-UI-FRAMEWORK/package/src/test/resources
24-Sep-2021 06:27:58 [INFO] skip non existing resourceDirectory /home/bamboo-agent/bamboo-agent/xml-data/build-dir/REFAPP-UI-FRAMEWORK/package/src/test/resources
24-Sep-2021 06:27:58 [INFO]
24-Sep-2021 06:27:58 [INFO] --- maven-compiler-plugin:3.1:testCompile (default-testCompile) @ referenceapplication-package ---
24-Sep-2021 06:27:58 [INFO] No sources to compile
24-Sep-2021 06:27:58 [INFO]
24-Sep-2021 06:27:58 [INFO] --- maven-surefire-plugin:2.12:test (default-test) @ referenceapplication-package ---
24-Sep-2021 06:27:58 [INFO] No tests to run.
24-Sep-2021 06:27:58 [INFO] Surefire report directory: /home/bamboo-agent/bamboo-agent/xml-data/build-dir/REFAPP-UI-FRAMEWORK/package/target/surefire-reports
24-Sep-2021 06:27:58
24-Sep-2021 06:27:58 -------------------------------------------------------
24-Sep-2021 06:27:58 T E S T S
24-Sep-2021 06:27:58 -------------------------------------------------------
24-Sep-2021 06:27:59
24-Sep-2021 06:27:59 Results :
24-Sep-2021 06:27:59
24-Sep-2021 06:27:59 Tests run: 0, Failures: 0, Errors: 0, Skipped: 0
24-Sep-2021 06:27:59
24-Sep-2021 06:27:59 [INFO]
24-Sep-2021 06:27:59 [INFO] --- maven-jar-plugin:2.4:jar (default-jar) @ referenceapplication-package ---
24-Sep-2021 06:27:59 [INFO] Building jar: /home/bamboo-agent/bamboo-agent/xml-data/build-dir/REFAPP-UI-FRAMEWORK/package/target/referenceapplication-package-2.13.0-SNAPSHOT.jar
24-Sep-2021 06:27:59 [INFO]
24-Sep-2021 06:27:59 [INFO] --- maven-assembly-plugin:2.3:single (make-assembly) @ referenceapplication-package ---
24-Sep-2021 06:28:00 [INFO] Reading assembly descriptor: /home/bamboo-agent/bamboo-agent/xml-data/build-dir/REFAPP-UI-FRAMEWORK/package/src/main/assembly/assembly.xml
24-Sep-2021 06:28:00 [INFO] Building zip: /home/bamboo-agent/bamboo-agent/xml-data/build-dir/REFAPP-UI-FRAMEWORK/package/target/referenceapplication-package-2.13.0-SNAPSHOT-addons.zip
24-Sep-2021 06:28:04 [INFO]
24-Sep-2021 06:28:04 [INFO] --- build-helper-maven-plugin:3.0.0:attach-artifact (attach-artifacts) @ referenceapplication-package ---
24-Sep-2021 06:28:04 [INFO]
24-Sep-2021 06:28:04 [INFO] --- maven-jar-plugin:2.4:test-jar (default) @ referenceapplication-package ---
24-Sep-2021 06:28:04 [WARNING] JAR will be empty - no content was marked for inclusion!
24-Sep-2021 06:28:04 [INFO] Building jar: /home/bamboo-agent/bamboo-agent/xml-data/build-dir/REFAPP-UI-FRAMEWORK/package/target/referenceapplication-package-2.13.0-SNAPSHOT-tests.jar
24-Sep-2021 06:28:04 [INFO]
24-Sep-2021 06:28:04 [INFO] --- maven-install-plugin:2.4:install (default-install) @ referenceapplication-package ---
24-Sep-2021 06:28:04 [INFO] Installing /home/bamboo-agent/bamboo-agent/xml-data/build-dir/REFAPP-UI-FRAMEWORK/package/target/referenceapplication-package-2.13.0-SNAPSHOT.jar to /home/bamboo-agent/.m2/repository/org/openmrs/distro/referenceapplication-package/2.13.0-SNAPSHOT/referenceapplication-package-2.13.0-SNAPSHOT.jar
24-Sep-2021 06:28:04 [INFO] Installing /home/bamboo-agent/bamboo-agent/xml-data/build-dir/REFAPP-UI-FRAMEWORK/package/pom.xml to /home/bamboo-agent/.m2/repository/org/openmrs/distro/referenceapplication-package/2.13.0-SNAPSHOT/referenceapplication-package-2.13.0-SNAPSHOT.pom
24-Sep-2021 06:28:04 [INFO] Installing /home/bamboo-agent/bamboo-agent/xml-data/build-dir/REFAPP-UI-FRAMEWORK/package/target/referenceapplication-package-2.13.0-SNAPSHOT-addons.zip to /home/bamboo-agent/.m2/repository/org/openmrs/distro/referenceapplication-package/2.13.0-SNAPSHOT/referenceapplication-package-2.13.0-SNAPSHOT-addons.zip
24-Sep-2021 06:28:05 [INFO] Installing /home/bamboo-agent/bamboo-agent/xml-data/build-dir/REFAPP-UI-FRAMEWORK/package/target/bundled-distro/web/openmrs.war to /home/bamboo-agent/.m2/repository/org/openmrs/distro/referenceapplication-package/2.13.0-SNAPSHOT/referenceapplication-package-2.13.0-SNAPSHOT.war
24-Sep-2021 06:28:05 [INFO] Installing /home/bamboo-agent/bamboo-agent/xml-data/build-dir/REFAPP-UI-FRAMEWORK/package/target/referenceapplication-package-2.13.0-SNAPSHOT-tests.jar to /home/bamboo-agent/.m2/repository/org/openmrs/distro/referenceapplication-package/2.13.0-SNAPSHOT/referenceapplication-package-2.13.0-SNAPSHOT-tests.jar
24-Sep-2021 06:28:05 [INFO]                                                                         
24-Sep-2021 06:28:05 [INFO] ------------------------------------------------------------------------
24-Sep-2021 06:28:05 [INFO] Building Reference Application Distribution UI Tests 2.13.0-SNAPSHOT
24-Sep-2021 06:28:05 [INFO] ------------------------------------------------------------------------
24-Sep-2021 06:28:06 [INFO]
24-Sep-2021 06:28:06 [INFO] --- maven-clean-plugin:2.5:clean (default-clean) @ referenceapplication-ui-tests ---
24-Sep-2021 06:28:06 [INFO]
24-Sep-2021 06:28:06 [INFO] --- maven-resources-plugin:2.6:resources (default-resources) @ referenceapplication-ui-tests ---
24-Sep-2021 06:28:06 [INFO] Using 'UTF-8' encoding to copy filtered resources.
24-Sep-2021 06:28:06 [INFO] skip non existing resourceDirectory /home/bamboo-agent/bamboo-agent/xml-data/build-dir/REFAPP-UI-FRAMEWORK/ui-tests/src/main/resources
24-Sep-2021 06:28:06 [INFO]
24-Sep-2021 06:28:06 [INFO] --- maven-compiler-plugin:3.1:compile (default-compile) @ referenceapplication-ui-tests ---
24-Sep-2021 06:28:06 [INFO] No sources to compile
24-Sep-2021 06:28:06 [INFO]
24-Sep-2021 06:28:06 [INFO] --- maven-resources-plugin:2.6:testResources (default-testResources) @ referenceapplication-ui-tests ---
24-Sep-2021 06:28:06 [INFO] Using 'UTF-8' encoding to copy filtered resources.
24-Sep-2021 06:28:06 [INFO] Copying 2 resources
24-Sep-2021 06:28:06 [INFO] Copying 2 resources
24-Sep-2021 06:28:06 [INFO]
24-Sep-2021 06:28:06 [INFO] --- maven-compiler-plugin:3.1:testCompile (default-testCompile) @ referenceapplication-ui-tests ---
24-Sep-2021 06:28:06 [INFO] Changes detected - recompiling the module!
24-Sep-2021 06:28:06 [INFO] Compiling 121 source files to /home/bamboo-agent/bamboo-agent/xml-data/build-dir/REFAPP-UI-FRAMEWORK/ui-tests/target/test-classes
24-Sep-2021 06:28:09 [WARNING] /home/bamboo-agent/bamboo-agent/xml-data/build-dir/REFAPP-UI-FRAMEWORK/ui-tests/src/test/java/org/openmrs/reference/AddDeleteLocationTest.java: Some input files use or override a deprecated API.
24-Sep-2021 06:28:09 [WARNING] /home/bamboo-agent/bamboo-agent/xml-data/build-dir/REFAPP-UI-FRAMEWORK/ui-tests/src/test/java/org/openmrs/reference/AddDeleteLocationTest.java: Recompile with -Xlint:deprecation for details.
24-Sep-2021 06:28:09 [WARNING] /home/bamboo-agent/bamboo-agent/xml-data/build-dir/REFAPP-UI-FRAMEWORK/ui-tests/src/test/java/org/openmrs/reference/AddRolesToUserTest.java: /home/bamboo-agent/bamboo-agent/xml-data/build-dir/REFAPP-UI-FRAMEWORK/ui-tests/src/test/java/org/openmrs/reference/AddRolesToUserTest.java uses unchecked or unsafe operations.
24-Sep-2021 06:28:09 [WARNING] /home/bamboo-agent/bamboo-agent/xml-data/build-dir/REFAPP-UI-FRAMEWORK/ui-tests/src/test/java/org/openmrs/reference/AddRolesToUserTest.java: Recompile with -Xlint:unchecked for details.
24-Sep-2021 06:28:09 [INFO]
24-Sep-2021 06:28:09 [INFO] --- maven-antrun-plugin:1.8:run (make-mac-chromedriver-executable) @ referenceapplication-ui-tests ---
24-Sep-2021 06:28:10 [INFO] Executing tasks
24-Sep-2021 06:28:10
24-Sep-2021 06:28:10 main:
24-Sep-2021 06:28:10 [INFO] An Ant BuildException has occured: /home/bamboo-agent/bamboo-agent/xml-data/build-dir/REFAPP-UI-FRAMEWORK/ui-tests/target/test-classes/chromedriver/mac does not exist.
24-Sep-2021 06:28:10 around Ant part ...<chmod file="target/test-classes/chromedriver/mac/chromedriver" perm="755"/>... @ 4:79 in /home/bamboo-agent/bamboo-agent/xml-data/build-dir/REFAPP-UI-FRAMEWORK/ui-tests/target/antrun/build-main.xml
24-Sep-2021 06:28:10 /home/bamboo-agent/bamboo-agent/xml-data/build-dir/REFAPP-UI-FRAMEWORK/ui-tests/target/antrun/build-main.xml:4: /home/bamboo-agent/bamboo-agent/xml-data/build-dir/REFAPP-UI-FRAMEWORK/ui-tests/target/test-classes/chromedriver/mac does not exist.
24-Sep-2021 06:28:10         at org.apache.tools.ant.types.AbstractFileSet.getDirectoryScanner(AbstractFileSet.java:484)
24-Sep-2021 06:28:10         at org.apache.tools.ant.taskdefs.ExecuteOn.runExec(ExecuteOn.java:369)
24-Sep-2021 06:28:10         at org.apache.tools.ant.taskdefs.ExecTask.execute(ExecTask.java:495)
24-Sep-2021 06:28:10         at org.apache.tools.ant.taskdefs.Chmod.execute(Chmod.java:181)
24-Sep-2021 06:28:10         at org.apache.tools.ant.UnknownElement.execute(UnknownElement.java:292)
24-Sep-2021 06:28:10         at sun.reflect.NativeMethodAccessorImpl.invoke0(Native Method)
24-Sep-2021 06:28:10         at sun.reflect.NativeMethodAccessorImpl.invoke(NativeMethodAccessorImpl.java:62)
24-Sep-2021 06:28:10         at sun.reflect.DelegatingMethodAccessorImpl.invoke(DelegatingMethodAccessorImpl.java:43)
24-Sep-2021 06:28:10         at java.lang.reflect.Method.invoke(Method.java:498)
24-Sep-2021 06:28:10         at org.apache.tools.ant.dispatch.DispatchUtils.execute(DispatchUtils.java:106)
24-Sep-2021 06:28:10         at org.apache.tools.ant.Task.perform(Task.java:348)
24-Sep-2021 06:28:10         at org.apache.tools.ant.Target.execute(Target.java:435)
24-Sep-2021 06:28:10         at org.apache.tools.ant.Target.performTasks(Target.java:456)
24-Sep-2021 06:28:10         at org.apache.tools.ant.Project.executeSortedTargets(Project.java:1393)
24-Sep-2021 06:28:10         at org.apache.tools.ant.Project.executeTarget(Project.java:1364)
24-Sep-2021 06:28:10         at org.apache.maven.plugin.antrun.AntRunMojo.execute(AntRunMojo.java:313)
24-Sep-2021 06:28:10         at org.apache.maven.plugin.DefaultBuildPluginManager.executeMojo(DefaultBuildPluginManager.java:134)
24-Sep-2021 06:28:10         at org.apache.maven.lifecycle.internal.MojoExecutor.execute(MojoExecutor.java:207)
24-Sep-2021 06:28:10         at org.apache.maven.lifecycle.internal.MojoExecutor.execute(MojoExecutor.java:153)
24-Sep-2021 06:28:10         at org.apache.maven.lifecycle.internal.MojoExecutor.execute(MojoExecutor.java:145)
24-Sep-2021 06:28:10         at org.apache.maven.lifecycle.internal.LifecycleModuleBuilder.buildProject(LifecycleModuleBuilder.java:116)
24-Sep-2021 06:28:10         at org.apache.maven.lifecycle.internal.LifecycleModuleBuilder.buildProject(LifecycleModuleBuilder.java:80)
24-Sep-2021 06:28:10         at org.apache.maven.lifecycle.internal.builder.singlethreaded.SingleThreadedBuilder.build(SingleThreadedBuilder.java:51)
24-Sep-2021 06:28:10         at org.apache.maven.lifecycle.internal.LifecycleStarter.execute(LifecycleStarter.java:128)
24-Sep-2021 06:28:10         at org.apache.maven.DefaultMaven.doExecute(DefaultMaven.java:307)
24-Sep-2021 06:28:10         at org.apache.maven.DefaultMaven.doExecute(DefaultMaven.java:193)
24-Sep-2021 06:28:10         at org.apache.maven.DefaultMaven.execute(DefaultMaven.java:106)
24-Sep-2021 06:28:10         at org.apache.maven.cli.MavenCli.execute(MavenCli.java:863)
24-Sep-2021 06:28:10         at org.apache.maven.cli.MavenCli.doMain(MavenCli.java:288)
24-Sep-2021 06:28:10         at org.apache.maven.cli.MavenCli.main(MavenCli.java:199)
24-Sep-2021 06:28:10         at sun.reflect.NativeMethodAccessorImpl.invoke0(Native Method)
24-Sep-2021 06:28:10         at sun.reflect.NativeMethodAccessorImpl.invoke(NativeMethodAccessorImpl.java:62)
24-Sep-2021 06:28:10         at sun.reflect.DelegatingMethodAccessorImpl.invoke(DelegatingMethodAccessorImpl.java:43)
24-Sep-2021 06:28:10         at java.lang.reflect.Method.invoke(Method.java:498)
24-Sep-2021 06:28:10         at org.codehaus.plexus.classworlds.launcher.Launcher.launchEnhanced(Launcher.java:289)
24-Sep-2021 06:28:10         at org.codehaus.plexus.classworlds.launcher.Launcher.launch(Launcher.java:229)
24-Sep-2021 06:28:10         at org.codehaus.plexus.classworlds.launcher.Launcher.mainWithExitCode(Launcher.java:415)
24-Sep-2021 06:28:10         at org.codehaus.plexus.classworlds.launcher.Launcher.main(Launcher.java:356)
24-Sep-2021 06:28:10 [INFO]
24-Sep-2021 06:28:10 [INFO] --- maven-antrun-plugin:1.8:run (make-linux-chromedriver-executable) @ referenceapplication-ui-tests ---
24-Sep-2021 06:28:10 [INFO] Executing tasks
24-Sep-2021 06:28:10
24-Sep-2021 06:28:10 main:
24-Sep-2021 06:28:10 [INFO] Executed tasks
24-Sep-2021 06:28:10 [INFO]
24-Sep-2021 06:28:10 [INFO] --- maven-antrun-plugin:1.8:run (make-mac-firefoxdriver-executable) @ referenceapplication-ui-tests ---
24-Sep-2021 06:28:10 [INFO] Executing tasks
24-Sep-2021 06:28:10
24-Sep-2021 06:28:10 main:
24-Sep-2021 06:28:10 [INFO] An Ant BuildException has occured: /home/bamboo-agent/bamboo-agent/xml-data/build-dir/REFAPP-UI-FRAMEWORK/ui-tests/target/test-classes/firefoxdriver/mac does not exist.
24-Sep-2021 06:28:10 around Ant part ...<chmod file="target/test-classes/firefoxdriver/mac/geckodriver" perm="755"/>... @ 4:79 in /home/bamboo-agent/bamboo-agent/xml-data/build-dir/REFAPP-UI-FRAMEWORK/ui-tests/target/antrun/build-main.xml
24-Sep-2021 06:28:10 /home/bamboo-agent/bamboo-agent/xml-data/build-dir/REFAPP-UI-FRAMEWORK/ui-tests/target/antrun/build-main.xml:4: /home/bamboo-agent/bamboo-agent/xml-data/build-dir/REFAPP-UI-FRAMEWORK/ui-tests/target/test-classes/firefoxdriver/mac does not exist.
24-Sep-2021 06:28:10         at org.apache.tools.ant.types.AbstractFileSet.getDirectoryScanner(AbstractFileSet.java:484)
24-Sep-2021 06:28:10         at org.apache.tools.ant.taskdefs.ExecuteOn.runExec(ExecuteOn.java:369)
24-Sep-2021 06:28:10         at org.apache.tools.ant.taskdefs.ExecTask.execute(ExecTask.java:495)
24-Sep-2021 06:28:10         at org.apache.tools.ant.taskdefs.Chmod.execute(Chmod.java:181)
24-Sep-2021 06:28:10         at org.apache.tools.ant.UnknownElement.execute(UnknownElement.java:292)
24-Sep-2021 06:28:10         at sun.reflect.NativeMethodAccessorImpl.invoke0(Native Method)
24-Sep-2021 06:28:10         at sun.reflect.NativeMethodAccessorImpl.invoke(NativeMethodAccessorImpl.java:62)
24-Sep-2021 06:28:10         at sun.reflect.DelegatingMethodAccessorImpl.invoke(DelegatingMethodAccessorImpl.java:43)
24-Sep-2021 06:28:10         at java.lang.reflect.Method.invoke(Method.java:498)
24-Sep-2021 06:28:10         at org.apache.tools.ant.dispatch.DispatchUtils.execute(DispatchUtils.java:106)
24-Sep-2021 06:28:10         at org.apache.tools.ant.Task.perform(Task.java:348)
24-Sep-2021 06:28:10         at org.apache.tools.ant.Target.execute(Target.java:435)
24-Sep-2021 06:28:10         at org.apache.tools.ant.Target.performTasks(Target.java:456)
24-Sep-2021 06:28:10         at org.apache.tools.ant.Project.executeSortedTargets(Project.java:1393)
24-Sep-2021 06:28:10         at org.apache.tools.ant.Project.executeTarget(Project.java:1364)
24-Sep-2021 06:28:10         at org.apache.maven.plugin.antrun.AntRunMojo.execute(AntRunMojo.java:313)
24-Sep-2021 06:28:10         at org.apache.maven.plugin.DefaultBuildPluginManager.executeMojo(DefaultBuildPluginManager.java:134)
24-Sep-2021 06:28:10         at org.apache.maven.lifecycle.internal.MojoExecutor.execute(MojoExecutor.java:207)
24-Sep-2021 06:28:10         at org.apache.maven.lifecycle.internal.MojoExecutor.execute(MojoExecutor.java:153)
24-Sep-2021 06:28:10         at org.apache.maven.lifecycle.internal.MojoExecutor.execute(MojoExecutor.java:145)
24-Sep-2021 06:28:10         at org.apache.maven.lifecycle.internal.LifecycleModuleBuilder.buildProject(LifecycleModuleBuilder.java:116)
24-Sep-2021 06:28:10         at org.apache.maven.lifecycle.internal.LifecycleModuleBuilder.buildProject(LifecycleModuleBuilder.java:80)
24-Sep-2021 06:28:10         at org.apache.maven.lifecycle.internal.builder.singlethreaded.SingleThreadedBuilder.build(SingleThreadedBuilder.java:51)
24-Sep-2021 06:28:10         at org.apache.maven.lifecycle.internal.LifecycleStarter.execute(LifecycleStarter.java:128)
24-Sep-2021 06:28:10         at org.apache.maven.DefaultMaven.doExecute(DefaultMaven.java:307)
24-Sep-2021 06:28:10         at org.apache.maven.DefaultMaven.doExecute(DefaultMaven.java:193)
24-Sep-2021 06:28:10         at org.apache.maven.DefaultMaven.execute(DefaultMaven.java:106)
24-Sep-2021 06:28:10         at org.apache.maven.cli.MavenCli.execute(MavenCli.java:863)
24-Sep-2021 06:28:10         at org.apache.maven.cli.MavenCli.doMain(MavenCli.java:288)
24-Sep-2021 06:28:10         at org.apache.maven.cli.MavenCli.main(MavenCli.java:199)
24-Sep-2021 06:28:10         at sun.reflect.NativeMethodAccessorImpl.invoke0(Native Method)
24-Sep-2021 06:28:10         at sun.reflect.NativeMethodAccessorImpl.invoke(NativeMethodAccessorImpl.java:62)
24-Sep-2021 06:28:10         at sun.reflect.DelegatingMethodAccessorImpl.invoke(DelegatingMethodAccessorImpl.java:43)
24-Sep-2021 06:28:10         at java.lang.reflect.Method.invoke(Method.java:498)
24-Sep-2021 06:28:10         at org.codehaus.plexus.classworlds.launcher.Launcher.launchEnhanced(Launcher.java:289)
24-Sep-2021 06:28:10         at org.codehaus.plexus.classworlds.launcher.Launcher.launch(Launcher.java:229)
24-Sep-2021 06:28:10         at org.codehaus.plexus.classworlds.launcher.Launcher.mainWithExitCode(Launcher.java:415)
24-Sep-2021 06:28:10         at org.codehaus.plexus.classworlds.launcher.Launcher.main(Launcher.java:356)
24-Sep-2021 06:28:10 [INFO]
24-Sep-2021 06:28:10 [INFO] --- maven-antrun-plugin:1.8:run (make-linux-firefoxdriver-executable) @ referenceapplication-ui-tests ---
24-Sep-2021 06:28:10 [INFO] Executing tasks
24-Sep-2021 06:28:10
24-Sep-2021 06:28:10 main:
24-Sep-2021 06:28:10 [INFO] Executed tasks
24-Sep-2021 06:28:10 [INFO]
24-Sep-2021 06:28:10 [INFO] --- maven-surefire-plugin:2.12:test (default-test) @ referenceapplication-ui-tests ---
24-Sep-2021 06:28:10 [INFO] Surefire report directory: /home/bamboo-agent/bamboo-agent/xml-data/build-dir/REFAPP-UI-FRAMEWORK/ui-tests/target/surefire-reports
24-Sep-2021 06:28:10
24-Sep-2021 06:28:10 -------------------------------------------------------
24-Sep-2021 06:28:10 T E S T S
24-Sep-2021 06:28:10 -------------------------------------------------------
24-Sep-2021 06:28:11 Running org.openmrs.reference.UnidentifiedPatientKeyboardTest
24-Sep-2021 06:28:11 Running locally...
24-Sep-2021 06:28:16 Starting ChromeDriver 90.0.4430.24 (4c6d850f087da467d926e8eddb76550aed655991-refs/branch-heads/4430@{#429}) on port 1030
24-Sep-2021 06:28:16 Only local connections are allowed.
24-Sep-2021 06:28:16 Please see https://chromedriver.chromium.org/security-considerations for suggestions on keeping ChromeDriver safe.
24-Sep-2021 06:28:16 ChromeDriver was started successfully.
24-Sep-2021 06:28:37 Sep 24, 2021 6:28:37 AM org.openqa.selenium.remote.ProtocolHandshake createSession
24-Sep-2021 06:28:37 INFO: Detected dialect: W3C
24-Sep-2021 06:28:51 Tests run: 1, Failures: 0, Errors: 0, Skipped: 0, Time elapsed: 40.373 sec
24-Sep-2021 06:28:51 Running org.openmrs.reference.DeleteAllergyTest
24-Sep-2021 06:28:51 Running locally...
24-Sep-2021 06:28:51 Starting ChromeDriver 90.0.4430.24 (4c6d850f087da467d926e8eddb76550aed655991-refs/branch-heads/4430@{#429}) on port 14994
24-Sep-2021 06:28:51 Only local connections are allowed.
24-Sep-2021 06:28:51 Please see https://chromedriver.chromium.org/security-considerations for suggestions on keeping ChromeDriver safe.
24-Sep-2021 06:28:51 ChromeDriver was started successfully.
24-Sep-2021 06:28:52 Sep 24, 2021 6:28:52 AM org.openqa.selenium.remote.ProtocolHandshake createSession
24-Sep-2021 06:28:52 INFO: Detected dialect: W3C
24-Sep-2021 06:29:01 Tests run: 1, Failures: 0, Errors: 0, Skipped: 0, Time elapsed: 10.427 sec
24-Sep-2021 06:29:02 Running org.openmrs.reference.SearchActiveVisitsTest
24-Sep-2021 06:29:02 Running locally...
24-Sep-2021 06:29:02 Starting ChromeDriver 90.0.4430.24 (4c6d850f087da467d926e8eddb76550aed655991-refs/branch-heads/4430@{#429}) on port 11506
24-Sep-2021 06:29:02 Only local connections are allowed.
24-Sep-2021 06:29:02 Please see https://chromedriver.chromium.org/security-considerations for suggestions on keeping ChromeDriver safe.
24-Sep-2021 06:29:02 ChromeDriver was started successfully.
24-Sep-2021 06:29:02 Sep 24, 2021 6:29:02 AM org.openqa.selenium.remote.ProtocolHandshake createSession
24-Sep-2021 06:29:02 INFO: Detected dialect: W3C
24-Sep-2021 06:29:07 Tests run: 1, Failures: 0, Errors: 0, Skipped: 0, Time elapsed: 5.306 sec
24-Sep-2021 06:29:07 Running org.openmrs.reference.AddVisitTypeTest
24-Sep-2021 06:29:07 Running locally...
24-Sep-2021 06:29:07 Starting ChromeDriver 90.0.4430.24 (4c6d850f087da467d926e8eddb76550aed655991-refs/branch-heads/4430@{#429}) on port 23502
24-Sep-2021 06:29:07 Only local connections are allowed.
24-Sep-2021 06:29:07 Please see https://chromedriver.chromium.org/security-considerations for suggestions on keeping ChromeDriver safe.
24-Sep-2021 06:29:07 ChromeDriver was started successfully.
24-Sep-2021 06:29:07 Sep 24, 2021 6:29:07 AM org.openqa.selenium.remote.ProtocolHandshake createSession
24-Sep-2021 06:29:07 INFO: Detected dialect: W3C
24-Sep-2021 06:29:11 Tests run: 1, Failures: 0, Errors: 0, Skipped: 0, Time elapsed: 4.626 sec
24-Sep-2021 06:29:11 Running org.openmrs.reference.FindPatientRecordTest
24-Sep-2021 06:29:11 Running locally...
24-Sep-2021 06:29:11 Starting ChromeDriver 90.0.4430.24 (4c6d850f087da467d926e8eddb76550aed655991-refs/branch-heads/4430@{#429}) on port 18330
24-Sep-2021 06:29:11 Only local connections are allowed.
24-Sep-2021 06:29:11 Please see https://chromedriver.chromium.org/security-considerations for suggestions on keeping ChromeDriver safe.
24-Sep-2021 06:29:11 ChromeDriver was started successfully.
24-Sep-2021 06:29:12 Sep 24, 2021 6:29:12 AM org.openqa.selenium.remote.ProtocolHandshake createSession
24-Sep-2021 06:29:12 INFO: Detected dialect: W3C
24-Sep-2021 06:29:16 Tests run: 1, Failures: 0, Errors: 0, Skipped: 0, Time elapsed: 4.512 sec
24-Sep-2021 06:29:16 Running org.openmrs.reference.EditPersonTest
24-Sep-2021 06:29:16 Running locally...
24-Sep-2021 06:29:16 Starting ChromeDriver 90.0.4430.24 (4c6d850f087da467d926e8eddb76550aed655991-refs/branch-heads/4430@{#429}) on port 30750
24-Sep-2021 06:29:16 Only local connections are allowed.
24-Sep-2021 06:29:16 Please see https://chromedriver.chromium.org/security-considerations for suggestions on keeping ChromeDriver safe.
24-Sep-2021 06:29:16 ChromeDriver was started successfully.
24-Sep-2021 06:29:16 Sep 24, 2021 6:29:16 AM org.openqa.selenium.remote.ProtocolHandshake createSession
24-Sep-2021 06:29:16 INFO: Detected dialect: W3C
24-Sep-2021 06:29:27 Tests run: 1, Failures: 0, Errors: 0, Skipped: 0, Time elapsed: 11.099 sec
24-Sep-2021 06:29:27 Running org.openmrs.reference.RetireLocationTest
24-Sep-2021 06:29:27 Running locally...
24-Sep-2021 06:29:27 Starting ChromeDriver 90.0.4430.24 (4c6d850f087da467d926e8eddb76550aed655991-refs/branch-heads/4430@{#429}) on port 23331
24-Sep-2021 06:29:27 Only local connections are allowed.
24-Sep-2021 06:29:27 Please see https://chromedriver.chromium.org/security-considerations for suggestions on keeping ChromeDriver safe.
24-Sep-2021 06:29:27 ChromeDriver was started successfully.
24-Sep-2021 06:29:27 Sep 24, 2021 6:29:27 AM org.openqa.selenium.remote.ProtocolHandshake createSession
24-Sep-2021 06:29:27 INFO: Detected dialect: W3C
24-Sep-2021 06:29:30 Tests run: 1, Failures: 0, Errors: 0, Skipped: 0, Time elapsed: 3.259 sec
24-Sep-2021 06:29:30 Running org.openmrs.reference.XSSOnPhoneNumberFieldTest
24-Sep-2021 06:29:30 Running locally...
24-Sep-2021 06:29:30 Starting ChromeDriver 90.0.4430.24 (4c6d850f087da467d926e8eddb76550aed655991-refs/branch-heads/4430@{#429}) on port 18662
24-Sep-2021 06:29:30 Only local connections are allowed.
24-Sep-2021 06:29:30 Please see https://chromedriver.chromium.org/security-considerations for suggestions on keeping ChromeDriver safe.
24-Sep-2021 06:29:30 ChromeDriver was started successfully.
24-Sep-2021 06:29:31 Sep 24, 2021 6:29:31 AM org.openqa.selenium.remote.ProtocolHandshake createSession
24-Sep-2021 06:29:31 INFO: Detected dialect: W3C
24-Sep-2021 06:29:41 Tests run: 1, Failures: 0, Errors: 0, Skipped: 0, Time elapsed: 10.991 sec
24-Sep-2021 06:29:41 Running org.openmrs.reference.TransferToWardServiceTest
24-Sep-2021 06:29:41 Running locally...
24-Sep-2021 06:29:41 Starting ChromeDriver 90.0.4430.24 (4c6d850f087da467d926e8eddb76550aed655991-refs/branch-heads/4430@{#429}) on port 2310
24-Sep-2021 06:29:41 Only local connections are allowed.
24-Sep-2021 06:29:41 Please see https://chromedriver.chromium.org/security-considerations for suggestions on keeping ChromeDriver safe.
24-Sep-2021 06:29:41 ChromeDriver was started successfully.
24-Sep-2021 06:29:42 Sep 24, 2021 6:29:42 AM org.openqa.selenium.remote.ProtocolHandshake createSession
24-Sep-2021 06:29:42 INFO: Detected dialect: W3C
24-Sep-2021 06:29:58 Tests run: 1, Failures: 0, Errors: 0, Skipped: 0, Time elapsed: 16.252 sec
24-Sep-2021 06:29:58 Running org.openmrs.reference.EditVisitTypeTest
24-Sep-2021 06:29:58 Running locally...
24-Sep-2021 06:29:58 Starting ChromeDriver 90.0.4430.24 (4c6d850f087da467d926e8eddb76550aed655991-refs/branch-heads/4430@{#429}) on port 8281
24-Sep-2021 06:29:58 Only local connections are allowed.
24-Sep-2021 06:29:58 Please see https://chromedriver.chromium.org/security-considerations for suggestions on keeping ChromeDriver safe.
24-Sep-2021 06:29:58 ChromeDriver was started successfully.
24-Sep-2021 06:29:58 Sep 24, 2021 6:29:58 AM org.openqa.selenium.remote.ProtocolHandshake createSession
24-Sep-2021 06:29:58 INFO: Detected dialect: W3C
24-Sep-2021 06:30:03 Tests run: 1, Failures: 0, Errors: 0, Skipped: 0, Time elapsed: 5.799 sec
24-Sep-2021 06:30:03 Running org.openmrs.reference.ComeBackToApplicationAfterLogoutTest
24-Sep-2021 06:30:03 Running locally...
24-Sep-2021 06:30:03 Starting ChromeDriver 90.0.4430.24 (4c6d850f087da467d926e8eddb76550aed655991-refs/branch-heads/4430@{#429}) on port 10731
24-Sep-2021 06:30:03 Only local connections are allowed.
24-Sep-2021 06:30:03 Please see https://chromedriver.chromium.org/security-considerations for suggestions on keeping ChromeDriver safe.
24-Sep-2021 06:30:03 ChromeDriver was started successfully.
24-Sep-2021 06:30:04 Sep 24, 2021 6:30:04 AM org.openqa.selenium.remote.ProtocolHandshake createSession
24-Sep-2021 06:30:04 INFO: Detected dialect: W3C
24-Sep-2021 06:30:07 Tests run: 1, Failures: 0, Errors: 0, Skipped: 0, Time elapsed: 3.406 sec
24-Sep-2021 06:30:07 Running org.openmrs.reference.EditDemographicTest
24-Sep-2021 06:30:07 Running locally...
24-Sep-2021 06:30:07 Starting ChromeDriver 90.0.4430.24 (4c6d850f087da467d926e8eddb76550aed655991-refs/branch-heads/4430@{#429}) on port 25127
24-Sep-2021 06:30:07 Only local connections are allowed.
24-Sep-2021 06:30:07 Please see https://chromedriver.chromium.org/security-considerations for suggestions on keeping ChromeDriver safe.
24-Sep-2021 06:30:07 ChromeDriver was started successfully.
24-Sep-2021 06:30:07 Sep 24, 2021 6:30:07 AM org.openqa.selenium.remote.ProtocolHandshake createSession
24-Sep-2021 06:30:07 INFO: Detected dialect: W3C
24-Sep-2021 06:30:16 Tests run: 2, Failures: 0, Errors: 2, Skipped: 0, Time elapsed: 9.433 sec <<< FAILURE!
24-Sep-2021 06:30:16 Running org.openmrs.reference.DeleteVisitTypeTest
24-Sep-2021 06:30:16 Running locally...
24-Sep-2021 06:30:16 Starting ChromeDriver 90.0.4430.24 (4c6d850f087da467d926e8eddb76550aed655991-refs/branch-heads/4430@{#429}) on port 17908
24-Sep-2021 06:30:16 Only local connections are allowed.
24-Sep-2021 06:30:16 Please see https://chromedriver.chromium.org/security-considerations for suggestions on keeping ChromeDriver safe.
24-Sep-2021 06:30:16 ChromeDriver was started successfully.
24-Sep-2021 06:30:17 Sep 24, 2021 6:30:17 AM org.openqa.selenium.remote.ProtocolHandshake createSession
24-Sep-2021 06:30:17 INFO: Detected dialect: W3C
24-Sep-2021 06:30:17 Test killed due to server failure in DeleteVisitTypeTest.deleteVisitTypeTest
24-Sep-2021 06:30:17 jakarta.ws.rs.ServerErrorException: Bad Gateway
24-Sep-2021 06:30:17         at org.openmrs.uitestframework.test.TestBase.goToLoginPage(TestBase.java:245)
24-Sep-2021 06:30:17         at org.openmrs.uitestframework.test.TestBase.login(TestBase.java:231)
24-Sep-2021 06:30:17         at org.openmrs.uitestframework.test.TestBase.launchBrowser(TestBase.java:191)
24-Sep-2021 06:30:17         at org.openmrs.uitestframework.test.TestBase.startWebDriver(TestBase.java:130)
24-Sep-2021 06:30:17         at sun.reflect.NativeMethodAccessorImpl.invoke0(Native Method)
24-Sep-2021 06:30:17         at sun.reflect.NativeMethodAccessorImpl.invoke(NativeMethodAccessorImpl.java:62)
24-Sep-2021 06:30:17         at sun.reflect.DelegatingMethodAccessorImpl.invoke(DelegatingMethodAccessorImpl.java:43)
24-Sep-2021 06:30:17         at java.lang.reflect.Method.invoke(Method.java:498)
24-Sep-2021 06:30:17         at org.junit.runners.model.FrameworkMethod$1.runReflectiveCall(FrameworkMethod.java:59)
24-Sep-2021 06:30:17         at org.junit.internal.runners.model.ReflectiveCallable.run(ReflectiveCallable.java:12)
24-Sep-2021 06:30:17         at org.junit.runners.model.FrameworkMethod.invokeExplosively(FrameworkMethod.java:56)
24-Sep-2021 06:30:17         at org.junit.internal.runners.statements.RunBefores.invokeMethod(RunBefores.java:33)
24-Sep-2021 06:30:17         at org.junit.internal.runners.statements.RunBefores.evaluate(RunBefores.java:24)
24-Sep-2021 06:30:17         at org.junit.internal.runners.statements.RunAfters.evaluate(RunAfters.java:27)
24-Sep-2021 06:30:17         at org.junit.rules.TestWatcher$1.evaluate(TestWatcher.java:61)
24-Sep-2021 06:30:17         at org.junit.rules.TestWatcher$1.evaluate(TestWatcher.java:61)
24-Sep-2021 06:30:17         at org.junit.runners.ParentRunner$3.evaluate(ParentRunner.java:306)
24-Sep-2021 06:30:17         at org.junit.runners.BlockJUnit4ClassRunner$1.evaluate(BlockJUnit4ClassRunner.java:100)
24-Sep-2021 06:30:17         at org.junit.runners.ParentRunner.runLeaf(ParentRunner.java:366)
24-Sep-2021 06:30:17         at org.junit.runners.BlockJUnit4ClassRunner.runChild(BlockJUnit4ClassRunner.java:103)
24-Sep-2021 06:30:17         at org.junit.runners.BlockJUnit4ClassRunner.runChild(BlockJUnit4ClassRunner.java:63)
24-Sep-2021 06:30:17         at org.junit.runners.ParentRunner$4.run(ParentRunner.java:331)
24-Sep-2021 06:30:17         at org.junit.runners.ParentRunner$1.schedule(ParentRunner.java:79)
24-Sep-2021 06:30:17         at org.junit.runners.ParentRunner.runChildren(ParentRunner.java:329)
24-Sep-2021 06:30:17         at org.junit.runners.ParentRunner.access$100(ParentRunner.java:66)
24-Sep-2021 06:30:17         at org.junit.runners.ParentRunner$2.evaluate(ParentRunner.java:293)
24-Sep-2021 06:30:17         at org.junit.runners.ParentRunner$3.evaluate(ParentRunner.java:306)
24-Sep-2021 06:30:17         at org.junit.runners.ParentRunner.run(ParentRunner.java:413)
24-Sep-2021 06:30:17         at org.apache.maven.surefire.junit4.JUnit4Provider.execute(JUnit4Provider.java:236)
24-Sep-2021 06:30:17         at org.apache.maven.surefire.junit4.JUnit4Provider.executeTestSet(JUnit4Provider.java:134)
24-Sep-2021 06:30:17         at org.apache.maven.surefire.junit4.JUnit4Provider.invoke(JUnit4Provider.java:113)
24-Sep-2021 06:30:17         at sun.reflect.NativeMethodAccessorImpl.invoke0(Native Method)
24-Sep-2021 06:30:17         at sun.reflect.NativeMethodAccessorImpl.invoke(NativeMethodAccessorImpl.java:62)
24-Sep-2021 06:30:17         at sun.reflect.DelegatingMethodAccessorImpl.invoke(DelegatingMethodAccessorImpl.java:43)
24-Sep-2021 06:30:17         at java.lang.reflect.Method.invoke(Method.java:498)
24-Sep-2021 06:30:17         at org.apache.maven.surefire.util.ReflectionUtils.invokeMethodWithArray(ReflectionUtils.java:189)
24-Sep-2021 06:30:17         at org.apache.maven.surefire.booter.ProviderFactory$ProviderProxy.invoke(ProviderFactory.java:165)
24-Sep-2021 06:30:17         at org.apache.maven.surefire.booter.ProviderFactory.invokeProvider(ProviderFactory.java:85)
24-Sep-2021 06:30:17         at org.apache.maven.surefire.booter.ForkedBooter.runSuitesInProcess(ForkedBooter.java:103)
24-Sep-2021 06:30:17         at org.apache.maven.surefire.booter.ForkedBooter.main(ForkedBooter.java:74)
24-Sep-2021 06:30:17 Tests run: 3, Failures: 1, Errors: 2, Skipped: 0, Time elapsed: 0.493 sec <<< FAILURE!
24-Sep-2021 06:30:17 Running org.openmrs.reference.FormTest
24-Sep-2021 06:30:17 Tests run: 8, Failures: 4, Errors: 4, Skipped: 0, Time elapsed: 0.119 sec <<< FAILURE!
24-Sep-2021 06:30:17 Running org.openmrs.reference.RegisterUnidentifiedPatientTest
24-Sep-2021 06:30:17 Tests run: 2, Failures: 1, Errors: 1, Skipped: 0, Time elapsed: 0.012 sec <<< FAILURE!
24-Sep-2021 06:30:17 Running org.openmrs.reference.AddPatientAppointmentTest
24-Sep-2021 06:30:17 Tests run: 1, Failures: 1, Errors: 0, Skipped: 0, Time elapsed: 0.004 sec <<< FAILURE!
24-Sep-2021 06:30:17 Running org.openmrs.reference.AdmitExitInpatientTest
24-Sep-2021 06:30:17 Tests run: 1, Failures: 1, Errors: 0, Skipped: 0, Time elapsed: 0 sec <<< FAILURE!
24-Sep-2021 06:30:17 Running org.openmrs.reference.DeleteRequestAppointmentTest
24-Sep-2021 06:30:17 Tests run: 1, Failures: 1, Errors: 0, Skipped: 0, Time elapsed: 0.008 sec <<< FAILURE!
24-Sep-2021 06:30:17 Running org.openmrs.reference.EditAllergyTest
24-Sep-2021 06:30:17 Tests run: 1, Failures: 1, Errors: 0, Skipped: 0, Time elapsed: 0.005 sec <<< FAILURE!
24-Sep-2021 06:30:17 Running org.openmrs.reference.VisitNoteTest
24-Sep-2021 06:30:17 Tests run: 1, Failures: 1, Errors: 0, Skipped: 0, Time elapsed: 0.002 sec <<< FAILURE!
24-Sep-2021 06:30:17 Running org.openmrs.reference.CreatePersonTest
24-Sep-2021 06:30:17 Tests run: 1, Failures: 1, Errors: 0, Skipped: 0, Time elapsed: 0.001 sec <<< FAILURE!
24-Sep-2021 06:30:17 Running org.openmrs.reference.FindPatientByNameTest
24-Sep-2021 06:30:17 Tests run: 2, Failures: 1, Errors: 1, Skipped: 0, Time elapsed: 0.01 sec <<< FAILURE!
24-Sep-2021 06:30:17 Running org.openmrs.reference.AddUserTest
24-Sep-2021 06:30:17 Tests run: 1, Failures: 1, Errors: 0, Skipped: 0, Time elapsed: 0.004 sec <<< FAILURE!
24-Sep-2021 06:30:17 Running org.openmrs.reference.AddProviderTest
24-Sep-2021 06:30:17 Tests run: 2, Failures: 1, Errors: 1, Skipped: 0, Time elapsed: 0.05 sec <<< FAILURE!
24-Sep-2021 06:30:17 Running org.openmrs.reference.AddPastVisitTest
24-Sep-2021 06:30:17 Tests run: 1, Failures: 1, Errors: 0, Skipped: 0, Time elapsed: 0.004 sec <<< FAILURE!
24-Sep-2021 06:30:17 Running org.openmrs.reference.RecordMergeIssueTest
24-Sep-2021 06:30:17 Tests run: 2, Failures: 1, Errors: 1, Skipped: 0, Time elapsed: 0.017 sec <<< FAILURE!
24-Sep-2021 06:30:17 Running org.openmrs.reference.CaptureVitalsTest
24-Sep-2021 06:30:17 Tests run: 1, Failures: 1, Errors: 0, Skipped: 0, Time elapsed: 0 sec <<< FAILURE!
24-Sep-2021 06:30:17 Running org.openmrs.reference.NamePatientAccentedLetterTest
24-Sep-2021 06:30:17 Tests run: 2, Failures: 1, Errors: 1, Skipped: 0, Time elapsed: 0.002 sec <<< FAILURE!
24-Sep-2021 06:30:17 Running org.openmrs.reference.RetirePersonTest
24-Sep-2021 06:30:17 Tests run: 2, Failures: 1, Errors: 1, Skipped: 0, Time elapsed: 0.032 sec <<< FAILURE!
24-Sep-2021 06:30:17 Running org.openmrs.reference.EndVisitTest
24-Sep-2021 06:30:17 Tests run: 1, Failures: 1, Errors: 0, Skipped: 0, Time elapsed: 0.002 sec <<< FAILURE!
24-Sep-2021 06:30:17 Running org.openmrs.reference.DeleteAppointmentBlockTest
24-Sep-2021 06:30:17 Tests run: 1, Failures: 1, Errors: 0, Skipped: 0, Time elapsed: 0.014 sec <<< FAILURE!
24-Sep-2021 06:30:17 Running org.openmrs.reference.BookRequestAppointmentTest
24-Sep-2021 06:30:17 Tests run: 1, Failures: 1, Errors: 0, Skipped: 0, Time elapsed: 0 sec <<< FAILURE!
24-Sep-2021 06:30:17 Running org.openmrs.reference.AddDeleteServiceTest
24-Sep-2021 06:30:17 Tests run: 1, Failures: 1, Errors: 0, Skipped: 0, Time elapsed: 0.001 sec <<< FAILURE!
24-Sep-2021 06:30:17 Running org.openmrs.reference.AddEditAppointmentBlockTest
24-Sep-2021 06:30:17 Tests run: 1, Failures: 1, Errors: 0, Skipped: 0, Time elapsed: 0.001 sec <<< FAILURE!
24-Sep-2021 06:30:17 Running org.openmrs.reference.RetireProviderTest
24-Sep-2021 06:30:17 Tests run: 2, Failures: 1, Errors: 1, Skipped: 0, Time elapsed: 0.028 sec <<< FAILURE!
24-Sep-2021 06:30:17 Running org.openmrs.reference.MergePatientTest
24-Sep-2021 06:30:17 Tests run: 1, Failures: 1, Errors: 0, Skipped: 0, Time elapsed: 0 sec <<< FAILURE!
24-Sep-2021 06:30:17 Running org.openmrs.reference.AddDeleteLocationTest
24-Sep-2021 06:30:17 Tests run: 2, Failures: 1, Errors: 1, Skipped: 0, Time elapsed: 0.033 sec <<< FAILURE!
24-Sep-2021 06:30:17 Running org.openmrs.reference.DuplicatePatientRegisterTest
24-Sep-2021 06:30:17 Tests run: 2, Failures: 1, Errors: 1, Skipped: 0, Time elapsed: 0.001 sec <<< FAILURE!
24-Sep-2021 06:30:17 Running org.openmrs.reference.UsingBackButtonInMergePatientTest
24-Sep-2021 06:30:17 Tests run: 2, Failures: 1, Errors: 1, Skipped: 0, Time elapsed: 0.036 sec <<< FAILURE!
24-Sep-2021 06:30:17 Running org.openmrs.reference.AddDiagnosisToVisitNoteTest
24-Sep-2021 06:30:17 Tests run: 1, Failures: 1, Errors: 0, Skipped: 0, Time elapsed: 0.001 sec <<< FAILURE!
24-Sep-2021 06:30:17 Running org.openmrs.reference.MergeVisitsTest
24-Sep-2021 06:30:17 Tests run: 2, Failures: 1, Errors: 1, Skipped: 0, Time elapsed: 0 sec <<< FAILURE!
24-Sep-2021 06:30:17 Running org.openmrs.reference.EditServiceTest
24-Sep-2021 06:30:17 Tests run: 1, Failures: 1, Errors: 0, Skipped: 0, Time elapsed: 0 sec <<< FAILURE!
24-Sep-2021 06:30:17 Running org.openmrs.reference.AddNewAllergyTest
24-Sep-2021 06:30:17 Tests run: 1, Failures: 1, Errors: 0, Skipped: 0, Time elapsed: 0 sec <<< FAILURE!
24-Sep-2021 06:30:17 Running org.openmrs.reference.LoginTest
24-Sep-2021 06:30:17 Tests run: 5, Failures: 5, Errors: 0, Skipped: 0, Time elapsed: 0.004 sec <<< FAILURE!
24-Sep-2021 06:30:17 Running org.openmrs.reference.DeleteProviderTest
24-Sep-2021 06:30:17 Tests run: 2, Failures: 1, Errors: 1, Skipped: 0, Time elapsed: 0 sec <<< FAILURE!
24-Sep-2021 06:30:17 Running org.openmrs.reference.RegisterPatientTest
24-Sep-2021 06:30:17 Tests run: 2, Failures: 1, Errors: 1, Skipped: 0, Time elapsed: 0 sec <<< FAILURE!
24-Sep-2021 06:30:17 Running org.openmrs.reference.ContactInfoTest
24-Sep-2021 06:30:17 Tests run: 1, Failures: 1, Errors: 0, Skipped: 0, Time elapsed: 0.006 sec <<< FAILURE!
24-Sep-2021 06:30:17 Running org.openmrs.reference.StartVisitTest
24-Sep-2021 06:30:17 Tests run: 1, Failures: 1, Errors: 0, Skipped: 0, Time elapsed: 0 sec <<< FAILURE!
24-Sep-2021 06:30:17 Running org.openmrs.reference.DeletePersonTest
24-Sep-2021 06:30:17 Tests run: 2, Failures: 1, Errors: 1, Skipped: 0, Time elapsed: 0.028 sec <<< FAILURE!
24-Sep-2021 06:30:17 Running org.openmrs.reference.EditProviderTest
24-Sep-2021 06:30:17 Tests run: 2, Failures: 1, Errors: 1, Skipped: 0, Time elapsed: 0.036 sec <<< FAILURE!
24-Sep-2021 06:30:17 Running org.openmrs.reference.RetireVisitTypeTest
24-Sep-2021 06:30:17 Tests run: 2, Failures: 1, Errors: 1, Skipped: 0, Time elapsed: 0.046 sec <<< FAILURE!
24-Sep-2021 06:30:18
24-Sep-2021 06:30:18 Results :
24-Sep-2021 06:30:18
24-Sep-2021 06:30:18 Failed tests:   deleteVisitTypeTest(org.openmrs.reference.DeleteVisitTypeTest): Test killed due to server failure
24-Sep-2021 06:30:18   deleteFormTest(org.openmrs.reference.FormTest): Test killed due to server failure
24-Sep-2021 06:30:18   editFormTest(org.openmrs.reference.FormTest): Test killed due to server failure
24-Sep-2021 06:30:18   initiateFormPresence(org.openmrs.reference.FormTest): Test killed due to server failure
24-Sep-2021 06:30:18   addFormTest(org.openmrs.reference.FormTest): Test killed due to server failure
24-Sep-2021 06:30:18   registerUnidentifiedPatientTest(org.openmrs.reference.RegisterUnidentifiedPatientTest): Test killed due to server failure
24-Sep-2021 06:30:18   addPatientAppointmentTest(org.openmrs.reference.AddPatientAppointmentTest): Test killed due to server failure
24-Sep-2021 06:30:18   admitExitInpatientTest(org.openmrs.reference.AdmitExitInpatientTest): Test killed due to server failure
24-Sep-2021 06:30:18   deleteRequestAppointmentTest(org.openmrs.reference.DeleteRequestAppointmentTest): Test killed due to server failure
24-Sep-2021 06:30:18   editAllergyTest(org.openmrs.reference.EditAllergyTest): Test killed due to server failure
24-Sep-2021 06:30:18   visitNoteTest(org.openmrs.reference.VisitNoteTest): Test killed due to server failure
24-Sep-2021 06:30:18   createPersonTest(org.openmrs.reference.CreatePersonTest): Test killed due to server failure
24-Sep-2021 06:30:18   findPatientByNameTest(org.openmrs.reference.FindPatientByNameTest): Test killed due to server failure
24-Sep-2021 06:30:18   addUserTest(org.openmrs.reference.AddUserTest): Test killed due to server failure
24-Sep-2021 06:30:18   addProviderTest(org.openmrs.reference.AddProviderTest): Test killed due to server failure
24-Sep-2021 06:30:18   addPastVisitTest(org.openmrs.reference.AddPastVisitTest): Test killed due to server failure
24-Sep-2021 06:30:18   recordMergeIssueTest(org.openmrs.reference.RecordMergeIssueTest): Test killed due to server failure
24-Sep-2021 06:30:18   captureVitalsTest(org.openmrs.reference.CaptureVitalsTest): Test killed due to server failure
24-Sep-2021 06:30:18   namePatientAccentedLetterTest(org.openmrs.reference.NamePatientAccentedLetterTest): Test killed due to server failure
24-Sep-2021 06:30:18   retirePersonTest(org.openmrs.reference.RetirePersonTest): Test killed due to server failure
24-Sep-2021 06:30:18   endVisitTest(org.openmrs.reference.EndVisitTest): Test killed due to server failure
24-Sep-2021 06:30:18   deleteAppointmentBlockTest(org.openmrs.reference.DeleteAppointmentBlockTest): Test killed due to server failure
24-Sep-2021 06:30:18   bookRequestAppointmentTest(org.openmrs.reference.BookRequestAppointmentTest): Test killed due to server failure
24-Sep-2021 06:30:18   addDeleteServiceTest(org.openmrs.reference.AddDeleteServiceTest): Test killed due to server failure
24-Sep-2021 06:30:18   addEditAppointmentBlockTest(org.openmrs.reference.AddEditAppointmentBlockTest): Test killed due to server failure
24-Sep-2021 06:30:18   retireProviderTest(org.openmrs.reference.RetireProviderTest): Test killed due to server failure
24-Sep-2021 06:30:18   mergePatientTest(org.openmrs.reference.MergePatientTest): Test killed due to server failure
24-Sep-2021 06:30:18   addLocationTest(org.openmrs.reference.AddDeleteLocationTest): Test killed due to server failure
24-Sep-2021 06:30:18   duplicatePatientRegisterTest(org.openmrs.reference.DuplicatePatientRegisterTest): Test killed due to server failure
24-Sep-2021 06:30:18   usingBackButtonInMergePatientTest(org.openmrs.reference.UsingBackButtonInMergePatientTest): Test killed due to server failure
24-Sep-2021 06:30:18   addDiagnosisToVisitNoteTest(org.openmrs.reference.AddDiagnosisToVisitNoteTest): Test killed due to server failure
24-Sep-2021 06:30:18   mergeVisitsTest(org.openmrs.reference.MergeVisitsTest): Test killed due to server failure
24-Sep-2021 06:30:18   editServiceTest(org.openmrs.reference.EditServiceTest): Test killed due to server failure
24-Sep-2021 06:30:18   addNewAllergyTest(org.openmrs.reference.AddNewAllergyTest): Test killed due to server failure
24-Sep-2021 06:30:18   verifyNurseModulesAvailableOnHomePage(org.openmrs.reference.LoginTest): Test killed due to server failure
24-Sep-2021 06:30:18   verifyModulesAvailableOnHomePage(org.openmrs.reference.LoginTest): Test killed due to server failure
24-Sep-2021 06:30:18   verifySysadminModulesAvailableOnHomePage(org.openmrs.reference.LoginTest): Test killed due to server failure
24-Sep-2021 06:30:18   verifyClerkModulesAvailableOnHomePage(org.openmrs.reference.LoginTest): Test killed due to server failure
24-Sep-2021 06:30:18   verifyDoctorModulesAvailableOnHomePage(org.openmrs.reference.LoginTest): Test killed due to server failure
24-Sep-2021 06:30:18   deleteProviderTest(org.openmrs.reference.DeleteProviderTest): Test killed due to server failure
24-Sep-2021 06:30:18   registerPatientTest(org.openmrs.reference.RegisterPatientTest): Test killed due to server failure
24-Sep-2021 06:30:18   contactInfoTest(org.openmrs.reference.ContactInfoTest): Test killed due to server failure
24-Sep-2021 06:30:18   startVisitTest(org.openmrs.reference.StartVisitTest): Test killed due to server failure
24-Sep-2021 06:30:18   deletePersonTest(org.openmrs.reference.DeletePersonTest): Test killed due to server failure
24-Sep-2021 06:30:18   editProviderTest(org.openmrs.reference.EditProviderTest): Test killed due to server failure
24-Sep-2021 06:30:18   retireVisitTypeTest(org.openmrs.reference.RetireVisitTypeTest): Test killed due to server failure
24-Sep-2021 06:30:18
24-Sep-2021 06:30:18 Tests in error:
24-Sep-2021 06:30:18   editDemographicTest(org.openmrs.reference.EditDemographicTest): Delete request failed: https://qa-refapp.openmrs.org/openmrs/ws/rest/v1/patient/108139b0-d629-448b-b0d9-be6f91f9992b
24-Sep-2021 06:30:18   editDemographicTest(org.openmrs.reference.EditDemographicTest): Session ID is null. Using WebDriver after calling quit()?(..)
24-Sep-2021 06:30:18   deleteVisitTypeTest(org.openmrs.reference.DeleteVisitTypeTest): Delete request failed: https://qa-refapp.openmrs.org/openmrs/ws/rest/v1/visittype/null?purge=true
24-Sep-2021 06:30:18   deleteVisitTypeTest(org.openmrs.reference.DeleteVisitTypeTest): Session ID is null. Using WebDriver after calling quit()?(..)
24-Sep-2021 06:30:18   deleteFormTest(org.openmrs.reference.FormTest)
24-Sep-2021 06:30:18   editFormTest(org.openmrs.reference.FormTest)
24-Sep-2021 06:30:18   initiateFormPresence(org.openmrs.reference.FormTest)
24-Sep-2021 06:30:18   addFormTest(org.openmrs.reference.FormTest)
24-Sep-2021 06:30:18   registerUnidentifiedPatientTest(org.openmrs.reference.RegisterUnidentifiedPatientTest)
24-Sep-2021 06:30:18   findPatientByNameTest(org.openmrs.reference.FindPatientByNameTest)
24-Sep-2021 06:30:18   addProviderTest(org.openmrs.reference.AddProviderTest): Delete request failed: https://qa-refapp.openmrs.org/openmrs/ws/rest/v1/person/null?purge=true
24-Sep-2021 06:30:18   recordMergeIssueTest(org.openmrs.reference.RecordMergeIssueTest)
24-Sep-2021 06:30:18   namePatientAccentedLetterTest(org.openmrs.reference.NamePatientAccentedLetterTest)
24-Sep-2021 06:30:18   retirePersonTest(org.openmrs.reference.RetirePersonTest): Delete request failed: https://qa-refapp.openmrs.org/openmrs/ws/rest/v1/person/null?purge=true
24-Sep-2021 06:30:18   retireProviderTest(org.openmrs.reference.RetireProviderTest): Delete request failed: https://qa-refapp.openmrs.org/openmrs/ws/rest/v1/provider/null?purge=true
24-Sep-2021 06:30:18   addLocationTest(org.openmrs.reference.AddDeleteLocationTest): Delete request failed: https://qa-refapp.openmrs.org/openmrs/ws/rest/v1//locationtag/null?purge=true
24-Sep-2021 06:30:18   duplicatePatientRegisterTest(org.openmrs.reference.DuplicatePatientRegisterTest)
24-Sep-2021 06:30:18   usingBackButtonInMergePatientTest(org.openmrs.reference.UsingBackButtonInMergePatientTest)
24-Sep-2021 06:30:18   mergeVisitsTest(org.openmrs.reference.MergeVisitsTest)
24-Sep-2021 06:30:18   deleteProviderTest(org.openmrs.reference.DeleteProviderTest): Delete request failed: https://qa-refapp.openmrs.org/openmrs/ws/rest/v1/provider/null?purge=true
24-Sep-2021 06:30:18   registerPatientTest(org.openmrs.reference.RegisterPatientTest)
24-Sep-2021 06:30:18   deletePersonTest(org.openmrs.reference.DeletePersonTest): Delete request failed: https://qa-refapp.openmrs.org/openmrs/ws/rest/v1/person/null?purge=true
24-Sep-2021 06:30:18   editProviderTest(org.openmrs.reference.EditProviderTest): Delete request failed: https://qa-refapp.openmrs.org/openmrs/ws/rest/v1/provider/null?purge=true
24-Sep-2021 06:30:18   retireVisitTypeTest(org.openmrs.reference.RetireVisitTypeTest): Delete request failed: https://qa-refapp.openmrs.org/openmrs/ws/rest/v1/visittype/null?purge=true
24-Sep-2021 06:30:18
24-Sep-2021 06:30:18 Tests run: 81, Failures: 46, Errors: 24, Skipped: 0
24-Sep-2021 06:30:18
24-Sep-2021 06:30:18 [INFO] ------------------------------------------------------------------------
24-Sep-2021 06:30:18 [INFO] Reactor Summary:
24-Sep-2021 06:30:18 [INFO]
24-Sep-2021 06:30:18 [INFO] Reference Application Distribution ................. SUCCESS [  0.472 s]
24-Sep-2021 06:30:18 [INFO] Reference Application Distribution Package ......... SUCCESS [ 24.486 s]
24-Sep-2021 06:30:18 [INFO] Reference Application Distribution UI Tests ........ FAILURE [02:12 min]
24-Sep-2021 06:30:18 [INFO] ------------------------------------------------------------------------
24-Sep-2021 06:30:18 [INFO] BUILD FAILURE
24-Sep-2021 06:30:18 [INFO] ------------------------------------------------------------------------
24-Sep-2021 06:30:18 [INFO] Total time: 02:37 min
24-Sep-2021 06:30:18 [INFO] Finished at: 2021-09-24T06:30:18+00:00
24-Sep-2021 06:30:18 [INFO] Final Memory: 63M/386M
24-Sep-2021 06:30:18 [INFO] ------------------------------------------------------------------------
24-Sep-2021 06:30:18 [ERROR] Failed to execute goal org.apache.maven.plugins:maven-surefire-plugin:2.12:test (default-test) on project referenceapplication-ui-tests: There are test failures.
24-Sep-2021 06:30:18 [ERROR]
24-Sep-2021 06:30:18 [ERROR] Please refer to /home/bamboo-agent/bamboo-agent/xml-data/build-dir/REFAPP-UI-FRAMEWORK/ui-tests/target/surefire-reports for the individual test results.
24-Sep-2021 06:30:18 [ERROR] -> [Help 1]
24-Sep-2021 06:30:18 org.apache.maven.lifecycle.LifecycleExecutionException: Failed to execute goal org.apache.maven.plugins:maven-surefire-plugin:2.12:test (default-test) on project referenceapplication-ui-tests: There are test failures.
24-Sep-2021 06:30:18
24-Sep-2021 06:30:18 Please refer to /home/bamboo-agent/bamboo-agent/xml-data/build-dir/REFAPP-UI-FRAMEWORK/ui-tests/target/surefire-reports for the individual test results.
24-Sep-2021 06:30:18         at org.apache.maven.lifecycle.internal.MojoExecutor.execute(MojoExecutor.java:212)
24-Sep-2021 06:30:18         at org.apache.maven.lifecycle.internal.MojoExecutor.execute(MojoExecutor.java:153)
24-Sep-2021 06:30:18         at org.apache.maven.lifecycle.internal.MojoExecutor.execute(MojoExecutor.java:145)
24-Sep-2021 06:30:18         at org.apache.maven.lifecycle.internal.LifecycleModuleBuilder.buildProject(LifecycleModuleBuilder.java:116)
24-Sep-2021 06:30:18         at org.apache.maven.lifecycle.internal.LifecycleModuleBuilder.buildProject(LifecycleModuleBuilder.java:80)
24-Sep-2021 06:30:18         at org.apache.maven.lifecycle.internal.builder.singlethreaded.SingleThreadedBuilder.build(SingleThreadedBuilder.java:51)
24-Sep-2021 06:30:18         at org.apache.maven.lifecycle.internal.LifecycleStarter.execute(LifecycleStarter.java:128)
24-Sep-2021 06:30:18         at org.apache.maven.DefaultMaven.doExecute(DefaultMaven.java:307)
24-Sep-2021 06:30:18         at org.apache.maven.DefaultMaven.doExecute(DefaultMaven.java:193)
24-Sep-2021 06:30:18         at org.apache.maven.DefaultMaven.execute(DefaultMaven.java:106)
24-Sep-2021 06:30:18         at org.apache.maven.cli.MavenCli.execute(MavenCli.java:863)
24-Sep-2021 06:30:18         at org.apache.maven.cli.MavenCli.doMain(MavenCli.java:288)
24-Sep-2021 06:30:18         at org.apache.maven.cli.MavenCli.main(MavenCli.java:199)
24-Sep-2021 06:30:18         at sun.reflect.NativeMethodAccessorImpl.invoke0(Native Method)
24-Sep-2021 06:30:18         at sun.reflect.NativeMethodAccessorImpl.invoke(NativeMethodAccessorImpl.java:62)
24-Sep-2021 06:30:18         at sun.reflect.DelegatingMethodAccessorImpl.invoke(DelegatingMethodAccessorImpl.java:43)
24-Sep-2021 06:30:18         at java.lang.reflect.Method.invoke(Method.java:498)
24-Sep-2021 06:30:18         at org.codehaus.plexus.classworlds.launcher.Launcher.launchEnhanced(Launcher.java:289)
24-Sep-2021 06:30:18         at org.codehaus.plexus.classworlds.launcher.Launcher.launch(Launcher.java:229)
24-Sep-2021 06:30:18         at org.codehaus.plexus.classworlds.launcher.Launcher.mainWithExitCode(Launcher.java:415)
24-Sep-2021 06:30:18         at org.codehaus.plexus.classworlds.launcher.Launcher.main(Launcher.java:356)
24-Sep-2021 06:30:18 Caused by: org.apache.maven.plugin.MojoFailureException: There are test failures.
24-Sep-2021 06:30:18
24-Sep-2021 06:30:18 Please refer to /home/bamboo-agent/bamboo-agent/xml-data/build-dir/REFAPP-UI-FRAMEWORK/ui-tests/target/surefire-reports for the individual test results.
24-Sep-2021 06:30:18         at org.apache.maven.plugin.surefire.SurefireHelper.reportExecution(SurefireHelper.java:83)
24-Sep-2021 06:30:18         at org.apache.maven.plugin.surefire.SurefirePlugin.writeSummary(SurefirePlugin.java:673)
24-Sep-2021 06:30:18         at org.apache.maven.plugin.surefire.SurefirePlugin.handleSummary(SurefirePlugin.java:647)
24-Sep-2021 06:30:18         at org.apache.maven.plugin.surefire.AbstractSurefireMojo.executeAfterPreconditionsChecked(AbstractSurefireMojo.java:137)
24-Sep-2021 06:30:18         at org.apache.maven.plugin.surefire.AbstractSurefireMojo.execute(AbstractSurefireMojo.java:98)
24-Sep-2021 06:30:18         at org.apache.maven.plugin.DefaultBuildPluginManager.executeMojo(DefaultBuildPluginManager.java:134)
24-Sep-2021 06:30:18         at org.apache.maven.lifecycle.internal.MojoExecutor.execute(MojoExecutor.java:207)
24-Sep-2021 06:30:18         ... 20 more
24-Sep-2021 06:30:18 [ERROR]
24-Sep-2021 06:30:18 [ERROR] Re-run Maven using the -X switch to enable full debug logging.
24-Sep-2021 06:30:18 [ERROR]
24-Sep-2021 06:30:18 [ERROR] For more information about the errors and possible solutions, please read the following articles:
24-Sep-2021 06:30:18 [ERROR] [Help 1] http://cwiki.apache.org/confluence/display/MAVEN/MojoFailureException
24-Sep-2021 06:30:18 [ERROR]
24-Sep-2021 06:30:18 [ERROR] After correcting the problems, you can resume the build with the command
24-Sep-2021 06:30:18 [ERROR]   mvn <goals> -rf :referenceapplication-ui-tests
24-Sep-2021 06:30:18 Failing task since return code of [/usr/share/apache-maven-3.3.9/bin/mvn --batch-mode -Djava.io.tmpdir=/home/bamboo-agent/bamboo-agent/.agent_tmp/REFAPP-UI-FRAMEWORK clean install -DskipTests=false -e] was 1 while expected 0
24-Sep-2021 06:30:18 Parsing test results under /home/bamboo-agent/bamboo-agent/xml-data/build-dir/REFAPP-UI-FRAMEWORK...
24-Sep-2021 06:30:19 Finished task 'Build distribution' with result: Failed
24-Sep-2021 06:30:19 Running post build plugin 'Docker Container Cleanup'
24-Sep-2021 06:30:19 Running post build plugin 'NCover Results Collector'
24-Sep-2021 06:30:19 Running post build plugin 'Clover Results Collector'
24-Sep-2021 06:30:19 Running post build plugin 'Sauce OnDemand Post Runner'
24-Sep-2021 06:30:19 Running post build plugin 'npm Cache Cleanup'
24-Sep-2021 06:30:19 Running post build plugin 'Artifact Copier'
24-Sep-2021 06:30:19 Finalising the build...
24-Sep-2021 06:30:19 Stopping timer.
24-Sep-2021 06:30:19 Build REFAPP-UI-FRAMEWORK-588 completed.
24-Sep-2021 06:30:19 Running on server: post build plugin 'NCover Results Collector'
24-Sep-2021 06:30:19 Running on server: post build plugin 'Build Hanging Detection Configuration'
24-Sep-2021 06:30:19 Running on server: post build plugin 'Clover Delta Calculator'
24-Sep-2021 06:30:20 Running on server: post build plugin 'Maven Dependencies Postprocessor'
24-Sep-2021 06:30:20 All post build plugins have finished
24-Sep-2021 06:30:20 Generating build results summary...
24-Sep-2021 06:30:20 Saving build results to disk...
24-Sep-2021 06:30:20 Logging substituted variables...
24-Sep-2021 06:30:20 Indexing build results...
24-Sep-2021 06:30:20 Finished building REFAPP-UI-FRAMEWORK-588.