UI tests for the reference application

Build: #588 failed

Job: Run QA UI Tests failed

Stages & jobs

  1. Ref App UI Testing

Test results

  • 58 tests in total
  • 47 tests failed
  • 47 failures are new
  • 2 minutes taken in total.

Build 588 has the following 47 errors: 47 new failure(s) occurred since the previous build.

New test failures 47
Status Test Duration
Collapse Failed AddDeleteLocationTest addLocationTest History
< 1 sec
java.lang.AssertionError: Test killed due to server failure
	at org.junit.Assert.fail(Assert.java:89)
	at org.openmrs.uitestframework.test.TestBase.startWebDriver(TestBase.java:127)
	at sun.reflect.GeneratedMethodAccessor6.invoke(Unknown Source)
	at sun.reflect.DelegatingMethodAccessorImpl.invoke(DelegatingMethodAccessorImpl.java:43)
	at java.lang.reflect.Method.invoke(Method.java:498)
	at org.junit.runners.model.FrameworkMethod$1.runReflectiveCall(FrameworkMethod.java:59)
	at org.junit.internal.runners.model.ReflectiveCallable.run(ReflectiveCallable.java:12)
(30 more lines...)
Collapse Failed AddDeleteServiceTest addDeleteServiceTest History
< 1 sec
java.lang.AssertionError: Test killed due to server failure
	at org.junit.Assert.fail(Assert.java:89)
	at org.openmrs.uitestframework.test.TestBase.startWebDriver(TestBase.java:127)
	at sun.reflect.GeneratedMethodAccessor6.invoke(Unknown Source)
	at sun.reflect.DelegatingMethodAccessorImpl.invoke(DelegatingMethodAccessorImpl.java:43)
	at java.lang.reflect.Method.invoke(Method.java:498)
	at org.junit.runners.model.FrameworkMethod$1.runReflectiveCall(FrameworkMethod.java:59)
	at org.junit.internal.runners.model.ReflectiveCallable.run(ReflectiveCallable.java:12)
(30 more lines...)
Collapse Failed AddDiagnosisToVisitNoteTest addDiagnosisToVisitNoteTest History
< 1 sec
java.lang.AssertionError: Test killed due to server failure
	at org.junit.Assert.fail(Assert.java:89)
	at org.openmrs.uitestframework.test.TestBase.startWebDriver(TestBase.java:127)
	at sun.reflect.GeneratedMethodAccessor6.invoke(Unknown Source)
	at sun.reflect.DelegatingMethodAccessorImpl.invoke(DelegatingMethodAccessorImpl.java:43)
	at java.lang.reflect.Method.invoke(Method.java:498)
	at org.junit.runners.model.FrameworkMethod$1.runReflectiveCall(FrameworkMethod.java:59)
	at org.junit.internal.runners.model.ReflectiveCallable.run(ReflectiveCallable.java:12)
(30 more lines...)
Collapse Failed AddEditAppointmentBlockTest addEditAppointmentBlockTest History
< 1 sec
java.lang.AssertionError: Test killed due to server failure
	at org.junit.Assert.fail(Assert.java:89)
	at org.openmrs.uitestframework.test.TestBase.startWebDriver(TestBase.java:127)
	at sun.reflect.GeneratedMethodAccessor6.invoke(Unknown Source)
	at sun.reflect.DelegatingMethodAccessorImpl.invoke(DelegatingMethodAccessorImpl.java:43)
	at java.lang.reflect.Method.invoke(Method.java:498)
	at org.junit.runners.model.FrameworkMethod$1.runReflectiveCall(FrameworkMethod.java:59)
	at org.junit.internal.runners.model.ReflectiveCallable.run(ReflectiveCallable.java:12)
(30 more lines...)
Collapse Failed AddNewAllergyTest addNewAllergyTest History
< 1 sec
java.lang.AssertionError: Test killed due to server failure
	at org.junit.Assert.fail(Assert.java:89)
	at org.openmrs.uitestframework.test.TestBase.startWebDriver(TestBase.java:127)
	at sun.reflect.GeneratedMethodAccessor6.invoke(Unknown Source)
	at sun.reflect.DelegatingMethodAccessorImpl.invoke(DelegatingMethodAccessorImpl.java:43)
	at java.lang.reflect.Method.invoke(Method.java:498)
	at org.junit.runners.model.FrameworkMethod$1.runReflectiveCall(FrameworkMethod.java:59)
	at org.junit.internal.runners.model.ReflectiveCallable.run(ReflectiveCallable.java:12)
(30 more lines...)
Collapse Failed AddPastVisitTest addPastVisitTest History
< 1 sec
java.lang.AssertionError: Test killed due to server failure
	at org.junit.Assert.fail(Assert.java:89)
	at org.openmrs.uitestframework.test.TestBase.startWebDriver(TestBase.java:127)
	at sun.reflect.GeneratedMethodAccessor6.invoke(Unknown Source)
	at sun.reflect.DelegatingMethodAccessorImpl.invoke(DelegatingMethodAccessorImpl.java:43)
	at java.lang.reflect.Method.invoke(Method.java:498)
	at org.junit.runners.model.FrameworkMethod$1.runReflectiveCall(FrameworkMethod.java:59)
	at org.junit.internal.runners.model.ReflectiveCallable.run(ReflectiveCallable.java:12)
(30 more lines...)
Collapse Failed AddPatientAppointmentTest addPatientAppointmentTest History
< 1 sec
java.lang.AssertionError: Test killed due to server failure
	at org.junit.Assert.fail(Assert.java:89)
	at org.openmrs.uitestframework.test.TestBase.startWebDriver(TestBase.java:127)
	at sun.reflect.GeneratedMethodAccessor6.invoke(Unknown Source)
	at sun.reflect.DelegatingMethodAccessorImpl.invoke(DelegatingMethodAccessorImpl.java:43)
	at java.lang.reflect.Method.invoke(Method.java:498)
	at org.junit.runners.model.FrameworkMethod$1.runReflectiveCall(FrameworkMethod.java:59)
	at org.junit.internal.runners.model.ReflectiveCallable.run(ReflectiveCallable.java:12)
(30 more lines...)
Collapse Failed AddProviderTest addProviderTest History
< 1 sec
java.lang.AssertionError: Test killed due to server failure
	at org.junit.Assert.fail(Assert.java:89)
	at org.openmrs.uitestframework.test.TestBase.startWebDriver(TestBase.java:127)
	at sun.reflect.GeneratedMethodAccessor6.invoke(Unknown Source)
	at sun.reflect.DelegatingMethodAccessorImpl.invoke(DelegatingMethodAccessorImpl.java:43)
	at java.lang.reflect.Method.invoke(Method.java:498)
	at org.junit.runners.model.FrameworkMethod$1.runReflectiveCall(FrameworkMethod.java:59)
	at org.junit.internal.runners.model.ReflectiveCallable.run(ReflectiveCallable.java:12)
(30 more lines...)
Collapse Failed AddUserTest addUserTest History
< 1 sec
java.lang.AssertionError: Test killed due to server failure
	at org.junit.Assert.fail(Assert.java:89)
	at org.openmrs.uitestframework.test.TestBase.startWebDriver(TestBase.java:127)
	at sun.reflect.GeneratedMethodAccessor6.invoke(Unknown Source)
	at sun.reflect.DelegatingMethodAccessorImpl.invoke(DelegatingMethodAccessorImpl.java:43)
	at java.lang.reflect.Method.invoke(Method.java:498)
	at org.junit.runners.model.FrameworkMethod$1.runReflectiveCall(FrameworkMethod.java:59)
	at org.junit.internal.runners.model.ReflectiveCallable.run(ReflectiveCallable.java:12)
(30 more lines...)
Collapse Failed AdmitExitInpatientTest admitExitInpatientTest History
< 1 sec
java.lang.AssertionError: Test killed due to server failure
	at org.junit.Assert.fail(Assert.java:89)
	at org.openmrs.uitestframework.test.TestBase.startWebDriver(TestBase.java:127)
	at sun.reflect.GeneratedMethodAccessor6.invoke(Unknown Source)
	at sun.reflect.DelegatingMethodAccessorImpl.invoke(DelegatingMethodAccessorImpl.java:43)
	at java.lang.reflect.Method.invoke(Method.java:498)
	at org.junit.runners.model.FrameworkMethod$1.runReflectiveCall(FrameworkMethod.java:59)
	at org.junit.internal.runners.model.ReflectiveCallable.run(ReflectiveCallable.java:12)
(30 more lines...)
Collapse Failed BookRequestAppointmentTest bookRequestAppointmentTest History
< 1 sec
java.lang.AssertionError: Test killed due to server failure
	at org.junit.Assert.fail(Assert.java:89)
	at org.openmrs.uitestframework.test.TestBase.startWebDriver(TestBase.java:127)
	at sun.reflect.GeneratedMethodAccessor6.invoke(Unknown Source)
	at sun.reflect.DelegatingMethodAccessorImpl.invoke(DelegatingMethodAccessorImpl.java:43)
	at java.lang.reflect.Method.invoke(Method.java:498)
	at org.junit.runners.model.FrameworkMethod$1.runReflectiveCall(FrameworkMethod.java:59)
	at org.junit.internal.runners.model.ReflectiveCallable.run(ReflectiveCallable.java:12)
(30 more lines...)
Collapse Failed CaptureVitalsTest captureVitalsTest History
< 1 sec
java.lang.AssertionError: Test killed due to server failure
	at org.junit.Assert.fail(Assert.java:89)
	at org.openmrs.uitestframework.test.TestBase.startWebDriver(TestBase.java:127)
	at sun.reflect.GeneratedMethodAccessor6.invoke(Unknown Source)
	at sun.reflect.DelegatingMethodAccessorImpl.invoke(DelegatingMethodAccessorImpl.java:43)
	at java.lang.reflect.Method.invoke(Method.java:498)
	at org.junit.runners.model.FrameworkMethod$1.runReflectiveCall(FrameworkMethod.java:59)
	at org.junit.internal.runners.model.ReflectiveCallable.run(ReflectiveCallable.java:12)
(30 more lines...)
Collapse Failed ContactInfoTest contactInfoTest History
< 1 sec
java.lang.AssertionError: Test killed due to server failure
	at org.junit.Assert.fail(Assert.java:89)
	at org.openmrs.uitestframework.test.TestBase.startWebDriver(TestBase.java:127)
	at sun.reflect.GeneratedMethodAccessor6.invoke(Unknown Source)
	at sun.reflect.DelegatingMethodAccessorImpl.invoke(DelegatingMethodAccessorImpl.java:43)
	at java.lang.reflect.Method.invoke(Method.java:498)
	at org.junit.runners.model.FrameworkMethod$1.runReflectiveCall(FrameworkMethod.java:59)
	at org.junit.internal.runners.model.ReflectiveCallable.run(ReflectiveCallable.java:12)
(30 more lines...)
Collapse Failed CreatePersonTest createPersonTest History
< 1 sec
java.lang.AssertionError: Test killed due to server failure
	at org.junit.Assert.fail(Assert.java:89)
	at org.openmrs.uitestframework.test.TestBase.startWebDriver(TestBase.java:127)
	at sun.reflect.GeneratedMethodAccessor6.invoke(Unknown Source)
	at sun.reflect.DelegatingMethodAccessorImpl.invoke(DelegatingMethodAccessorImpl.java:43)
	at java.lang.reflect.Method.invoke(Method.java:498)
	at org.junit.runners.model.FrameworkMethod$1.runReflectiveCall(FrameworkMethod.java:59)
	at org.junit.internal.runners.model.ReflectiveCallable.run(ReflectiveCallable.java:12)
(30 more lines...)
Collapse Failed DeleteAppointmentBlockTest deleteAppointmentBlockTest History
< 1 sec
java.lang.AssertionError: Test killed due to server failure
	at org.junit.Assert.fail(Assert.java:89)
	at org.openmrs.uitestframework.test.TestBase.startWebDriver(TestBase.java:127)
	at sun.reflect.GeneratedMethodAccessor6.invoke(Unknown Source)
	at sun.reflect.DelegatingMethodAccessorImpl.invoke(DelegatingMethodAccessorImpl.java:43)
	at java.lang.reflect.Method.invoke(Method.java:498)
	at org.junit.runners.model.FrameworkMethod$1.runReflectiveCall(FrameworkMethod.java:59)
	at org.junit.internal.runners.model.ReflectiveCallable.run(ReflectiveCallable.java:12)
(30 more lines...)
Collapse Failed DeletePersonTest deletePersonTest History
< 1 sec
java.lang.AssertionError: Test killed due to server failure
	at org.junit.Assert.fail(Assert.java:89)
	at org.openmrs.uitestframework.test.TestBase.startWebDriver(TestBase.java:127)
	at sun.reflect.GeneratedMethodAccessor6.invoke(Unknown Source)
	at sun.reflect.DelegatingMethodAccessorImpl.invoke(DelegatingMethodAccessorImpl.java:43)
	at java.lang.reflect.Method.invoke(Method.java:498)
	at org.junit.runners.model.FrameworkMethod$1.runReflectiveCall(FrameworkMethod.java:59)
	at org.junit.internal.runners.model.ReflectiveCallable.run(ReflectiveCallable.java:12)
(30 more lines...)
Collapse Failed DeleteProviderTest deleteProviderTest History
< 1 sec
java.lang.AssertionError: Test killed due to server failure
	at org.junit.Assert.fail(Assert.java:89)
	at org.openmrs.uitestframework.test.TestBase.startWebDriver(TestBase.java:127)
	at sun.reflect.GeneratedMethodAccessor6.invoke(Unknown Source)
	at sun.reflect.DelegatingMethodAccessorImpl.invoke(DelegatingMethodAccessorImpl.java:43)
	at java.lang.reflect.Method.invoke(Method.java:498)
	at org.junit.runners.model.FrameworkMethod$1.runReflectiveCall(FrameworkMethod.java:59)
	at org.junit.internal.runners.model.ReflectiveCallable.run(ReflectiveCallable.java:12)
(30 more lines...)
Collapse Failed DeleteRequestAppointmentTest deleteRequestAppointmentTest History
< 1 sec
java.lang.AssertionError: Test killed due to server failure
	at org.junit.Assert.fail(Assert.java:89)
	at org.openmrs.uitestframework.test.TestBase.startWebDriver(TestBase.java:127)
	at sun.reflect.GeneratedMethodAccessor6.invoke(Unknown Source)
	at sun.reflect.DelegatingMethodAccessorImpl.invoke(DelegatingMethodAccessorImpl.java:43)
	at java.lang.reflect.Method.invoke(Method.java:498)
	at org.junit.runners.model.FrameworkMethod$1.runReflectiveCall(FrameworkMethod.java:59)
	at org.junit.internal.runners.model.ReflectiveCallable.run(ReflectiveCallable.java:12)
(30 more lines...)
Collapse Failed DeleteVisitTypeTest deleteVisitTypeTest History
< 1 sec
java.lang.AssertionError: Test killed due to server failure
	at org.junit.Assert.fail(Assert.java:89)
	at org.openmrs.uitestframework.test.TestBase.failTest(TestBase.java:216)
	at org.openmrs.uitestframework.test.TestBase.launchBrowser(TestBase.java:196)
	at org.openmrs.uitestframework.test.TestBase.startWebDriver(TestBase.java:130)
	at sun.reflect.NativeMethodAccessorImpl.invoke0(Native Method)
	at sun.reflect.NativeMethodAccessorImpl.invoke(NativeMethodAccessorImpl.java:62)
	at sun.reflect.DelegatingMethodAccessorImpl.invoke(DelegatingMethodAccessorImpl.java:43)
(33 more lines...)
Collapse Failed DuplicatePatientRegisterTest duplicatePatientRegisterTest History
< 1 sec
java.lang.AssertionError: Test killed due to server failure
	at org.junit.Assert.fail(Assert.java:89)
	at org.openmrs.uitestframework.test.TestBase.startWebDriver(TestBase.java:127)
	at sun.reflect.GeneratedMethodAccessor6.invoke(Unknown Source)
	at sun.reflect.DelegatingMethodAccessorImpl.invoke(DelegatingMethodAccessorImpl.java:43)
	at java.lang.reflect.Method.invoke(Method.java:498)
	at org.junit.runners.model.FrameworkMethod$1.runReflectiveCall(FrameworkMethod.java:59)
	at org.junit.internal.runners.model.ReflectiveCallable.run(ReflectiveCallable.java:12)
(30 more lines...)
Collapse Failed EditAllergyTest editAllergyTest History
< 1 sec
java.lang.AssertionError: Test killed due to server failure
	at org.junit.Assert.fail(Assert.java:89)
	at org.openmrs.uitestframework.test.TestBase.startWebDriver(TestBase.java:127)
	at sun.reflect.GeneratedMethodAccessor6.invoke(Unknown Source)
	at sun.reflect.DelegatingMethodAccessorImpl.invoke(DelegatingMethodAccessorImpl.java:43)
	at java.lang.reflect.Method.invoke(Method.java:498)
	at org.junit.runners.model.FrameworkMethod$1.runReflectiveCall(FrameworkMethod.java:59)
	at org.junit.internal.runners.model.ReflectiveCallable.run(ReflectiveCallable.java:12)
(30 more lines...)
Collapse Failed EditDemographicTest editDemographicTest History
9 secs
java.lang.IllegalStateException: Delete request failed: https://qa-refapp.openmrs.org/openmrs/ws/rest/v1/patient/108139b0-d629-448b-b0d9-be6f91f9992b
	at org.openmrs.uitestframework.test.RestClient.delete(RestClient.java:62)
	at org.openmrs.uitestframework.test.RestClient.delete(RestClient.java:67)
	at org.openmrs.uitestframework.test.TestBase.deletePatient(TestBase.java:360)
	at org.openmrs.reference.EditDemographicTest.tearDown(EditDemographicTest.java:59)
	at sun.reflect.NativeMethodAccessorImpl.invoke0(Native Method)
	at sun.reflect.NativeMethodAccessorImpl.invoke(NativeMethodAccessorImpl.java:62)
	at sun.reflect.DelegatingMethodAccessorImpl.invoke(DelegatingMethodAccessorImpl.java:43)
(49 more lines...)
Collapse Failed EditProviderTest editProviderTest History
< 1 sec
java.lang.AssertionError: Test killed due to server failure
	at org.junit.Assert.fail(Assert.java:89)
	at org.openmrs.uitestframework.test.TestBase.startWebDriver(TestBase.java:127)
	at sun.reflect.GeneratedMethodAccessor6.invoke(Unknown Source)
	at sun.reflect.DelegatingMethodAccessorImpl.invoke(DelegatingMethodAccessorImpl.java:43)
	at java.lang.reflect.Method.invoke(Method.java:498)
	at org.junit.runners.model.FrameworkMethod$1.runReflectiveCall(FrameworkMethod.java:59)
	at org.junit.internal.runners.model.ReflectiveCallable.run(ReflectiveCallable.java:12)
(30 more lines...)
Collapse Failed EditServiceTest editServiceTest History
< 1 sec
java.lang.AssertionError: Test killed due to server failure
	at org.junit.Assert.fail(Assert.java:89)
	at org.openmrs.uitestframework.test.TestBase.startWebDriver(TestBase.java:127)
	at sun.reflect.GeneratedMethodAccessor6.invoke(Unknown Source)
	at sun.reflect.DelegatingMethodAccessorImpl.invoke(DelegatingMethodAccessorImpl.java:43)
	at java.lang.reflect.Method.invoke(Method.java:498)
	at org.junit.runners.model.FrameworkMethod$1.runReflectiveCall(FrameworkMethod.java:59)
	at org.junit.internal.runners.model.ReflectiveCallable.run(ReflectiveCallable.java:12)
(30 more lines...)
Collapse Failed EndVisitTest endVisitTest History
< 1 sec
java.lang.AssertionError: Test killed due to server failure
	at org.junit.Assert.fail(Assert.java:89)
	at org.openmrs.uitestframework.test.TestBase.startWebDriver(TestBase.java:127)
	at sun.reflect.GeneratedMethodAccessor6.invoke(Unknown Source)
	at sun.reflect.DelegatingMethodAccessorImpl.invoke(DelegatingMethodAccessorImpl.java:43)
	at java.lang.reflect.Method.invoke(Method.java:498)
	at org.junit.runners.model.FrameworkMethod$1.runReflectiveCall(FrameworkMethod.java:59)
	at org.junit.internal.runners.model.ReflectiveCallable.run(ReflectiveCallable.java:12)
(30 more lines...)
Collapse Failed FindPatientByNameTest findPatientByNameTest History
< 1 sec
java.lang.AssertionError: Test killed due to server failure
	at org.junit.Assert.fail(Assert.java:89)
	at org.openmrs.uitestframework.test.TestBase.startWebDriver(TestBase.java:127)
	at sun.reflect.GeneratedMethodAccessor6.invoke(Unknown Source)
	at sun.reflect.DelegatingMethodAccessorImpl.invoke(DelegatingMethodAccessorImpl.java:43)
	at java.lang.reflect.Method.invoke(Method.java:498)
	at org.junit.runners.model.FrameworkMethod$1.runReflectiveCall(FrameworkMethod.java:59)
	at org.junit.internal.runners.model.ReflectiveCallable.run(ReflectiveCallable.java:12)
(30 more lines...)
Collapse Failed FormTest addFormTest History
< 1 sec
java.lang.AssertionError: Test killed due to server failure
	at org.junit.Assert.fail(Assert.java:89)
	at org.openmrs.uitestframework.test.TestBase.startWebDriver(TestBase.java:127)
	at sun.reflect.GeneratedMethodAccessor6.invoke(Unknown Source)
	at sun.reflect.DelegatingMethodAccessorImpl.invoke(DelegatingMethodAccessorImpl.java:43)
	at java.lang.reflect.Method.invoke(Method.java:498)
	at org.junit.runners.model.FrameworkMethod$1.runReflectiveCall(FrameworkMethod.java:59)
	at org.junit.internal.runners.model.ReflectiveCallable.run(ReflectiveCallable.java:12)
(30 more lines...)
Collapse Failed FormTest deleteFormTest History
< 1 sec
java.lang.AssertionError: Test killed due to server failure
	at org.junit.Assert.fail(Assert.java:89)
	at org.openmrs.uitestframework.test.TestBase.startWebDriver(TestBase.java:127)
	at sun.reflect.NativeMethodAccessorImpl.invoke0(Native Method)
	at sun.reflect.NativeMethodAccessorImpl.invoke(NativeMethodAccessorImpl.java:62)
	at sun.reflect.DelegatingMethodAccessorImpl.invoke(DelegatingMethodAccessorImpl.java:43)
	at java.lang.reflect.Method.invoke(Method.java:498)
	at org.junit.runners.model.FrameworkMethod$1.runReflectiveCall(FrameworkMethod.java:59)
(31 more lines...)
Collapse Failed FormTest editFormTest History
< 1 sec
java.lang.AssertionError: Test killed due to server failure
	at org.junit.Assert.fail(Assert.java:89)
	at org.openmrs.uitestframework.test.TestBase.startWebDriver(TestBase.java:127)
	at sun.reflect.NativeMethodAccessorImpl.invoke0(Native Method)
	at sun.reflect.NativeMethodAccessorImpl.invoke(NativeMethodAccessorImpl.java:62)
	at sun.reflect.DelegatingMethodAccessorImpl.invoke(DelegatingMethodAccessorImpl.java:43)
	at java.lang.reflect.Method.invoke(Method.java:498)
	at org.junit.runners.model.FrameworkMethod$1.runReflectiveCall(FrameworkMethod.java:59)
(31 more lines...)
Collapse Failed FormTest initiateFormPresence History
< 1 sec
java.lang.AssertionError: Test killed due to server failure
	at org.junit.Assert.fail(Assert.java:89)
	at org.openmrs.uitestframework.test.TestBase.startWebDriver(TestBase.java:127)
	at sun.reflect.NativeMethodAccessorImpl.invoke0(Native Method)
	at sun.reflect.NativeMethodAccessorImpl.invoke(NativeMethodAccessorImpl.java:62)
	at sun.reflect.DelegatingMethodAccessorImpl.invoke(DelegatingMethodAccessorImpl.java:43)
	at java.lang.reflect.Method.invoke(Method.java:498)
	at org.junit.runners.model.FrameworkMethod$1.runReflectiveCall(FrameworkMethod.java:59)
(31 more lines...)
Collapse Failed LoginTest verifyClerkModulesAvailableOnHomePage History
< 1 sec
java.lang.AssertionError: Test killed due to server failure
	at org.junit.Assert.fail(Assert.java:89)
	at org.openmrs.uitestframework.test.TestBase.startWebDriver(TestBase.java:127)
	at sun.reflect.GeneratedMethodAccessor6.invoke(Unknown Source)
	at sun.reflect.DelegatingMethodAccessorImpl.invoke(DelegatingMethodAccessorImpl.java:43)
	at java.lang.reflect.Method.invoke(Method.java:498)
	at org.junit.runners.model.FrameworkMethod$1.runReflectiveCall(FrameworkMethod.java:59)
	at org.junit.internal.runners.model.ReflectiveCallable.run(ReflectiveCallable.java:12)
(30 more lines...)
Collapse Failed LoginTest verifyDoctorModulesAvailableOnHomePage History
< 1 sec
java.lang.AssertionError: Test killed due to server failure
	at org.junit.Assert.fail(Assert.java:89)
	at org.openmrs.uitestframework.test.TestBase.startWebDriver(TestBase.java:127)
	at sun.reflect.GeneratedMethodAccessor6.invoke(Unknown Source)
	at sun.reflect.DelegatingMethodAccessorImpl.invoke(DelegatingMethodAccessorImpl.java:43)
	at java.lang.reflect.Method.invoke(Method.java:498)
	at org.junit.runners.model.FrameworkMethod$1.runReflectiveCall(FrameworkMethod.java:59)
	at org.junit.internal.runners.model.ReflectiveCallable.run(ReflectiveCallable.java:12)
(30 more lines...)
Collapse Failed LoginTest verifyModulesAvailableOnHomePage History
< 1 sec
java.lang.AssertionError: Test killed due to server failure
	at org.junit.Assert.fail(Assert.java:89)
	at org.openmrs.uitestframework.test.TestBase.startWebDriver(TestBase.java:127)
	at sun.reflect.GeneratedMethodAccessor6.invoke(Unknown Source)
	at sun.reflect.DelegatingMethodAccessorImpl.invoke(DelegatingMethodAccessorImpl.java:43)
	at java.lang.reflect.Method.invoke(Method.java:498)
	at org.junit.runners.model.FrameworkMethod$1.runReflectiveCall(FrameworkMethod.java:59)
	at org.junit.internal.runners.model.ReflectiveCallable.run(ReflectiveCallable.java:12)
(30 more lines...)
Collapse Failed LoginTest verifyNurseModulesAvailableOnHomePage History
< 1 sec
java.lang.AssertionError: Test killed due to server failure
	at org.junit.Assert.fail(Assert.java:89)
	at org.openmrs.uitestframework.test.TestBase.startWebDriver(TestBase.java:127)
	at sun.reflect.GeneratedMethodAccessor6.invoke(Unknown Source)
	at sun.reflect.DelegatingMethodAccessorImpl.invoke(DelegatingMethodAccessorImpl.java:43)
	at java.lang.reflect.Method.invoke(Method.java:498)
	at org.junit.runners.model.FrameworkMethod$1.runReflectiveCall(FrameworkMethod.java:59)
	at org.junit.internal.runners.model.ReflectiveCallable.run(ReflectiveCallable.java:12)
(30 more lines...)
Collapse Failed LoginTest verifySysadminModulesAvailableOnHomePage History
< 1 sec
java.lang.AssertionError: Test killed due to server failure
	at org.junit.Assert.fail(Assert.java:89)
	at org.openmrs.uitestframework.test.TestBase.startWebDriver(TestBase.java:127)
	at sun.reflect.GeneratedMethodAccessor6.invoke(Unknown Source)
	at sun.reflect.DelegatingMethodAccessorImpl.invoke(DelegatingMethodAccessorImpl.java:43)
	at java.lang.reflect.Method.invoke(Method.java:498)
	at org.junit.runners.model.FrameworkMethod$1.runReflectiveCall(FrameworkMethod.java:59)
	at org.junit.internal.runners.model.ReflectiveCallable.run(ReflectiveCallable.java:12)
(30 more lines...)
Collapse Failed MergePatientTest mergePatientTest History
< 1 sec
java.lang.AssertionError: Test killed due to server failure
	at org.junit.Assert.fail(Assert.java:89)
	at org.openmrs.uitestframework.test.TestBase.startWebDriver(TestBase.java:127)
	at sun.reflect.GeneratedMethodAccessor6.invoke(Unknown Source)
	at sun.reflect.DelegatingMethodAccessorImpl.invoke(DelegatingMethodAccessorImpl.java:43)
	at java.lang.reflect.Method.invoke(Method.java:498)
	at org.junit.runners.model.FrameworkMethod$1.runReflectiveCall(FrameworkMethod.java:59)
	at org.junit.internal.runners.model.ReflectiveCallable.run(ReflectiveCallable.java:12)
(30 more lines...)
Collapse Failed MergeVisitsTest mergeVisitsTest History
< 1 sec
java.lang.AssertionError: Test killed due to server failure
	at org.junit.Assert.fail(Assert.java:89)
	at org.openmrs.uitestframework.test.TestBase.startWebDriver(TestBase.java:127)
	at sun.reflect.GeneratedMethodAccessor6.invoke(Unknown Source)
	at sun.reflect.DelegatingMethodAccessorImpl.invoke(DelegatingMethodAccessorImpl.java:43)
	at java.lang.reflect.Method.invoke(Method.java:498)
	at org.junit.runners.model.FrameworkMethod$1.runReflectiveCall(FrameworkMethod.java:59)
	at org.junit.internal.runners.model.ReflectiveCallable.run(ReflectiveCallable.java:12)
(30 more lines...)
Collapse Failed NamePatientAccentedLetterTest namePatientAccentedLetterTest History
< 1 sec
java.lang.AssertionError: Test killed due to server failure
	at org.junit.Assert.fail(Assert.java:89)
	at org.openmrs.uitestframework.test.TestBase.startWebDriver(TestBase.java:127)
	at sun.reflect.GeneratedMethodAccessor6.invoke(Unknown Source)
	at sun.reflect.DelegatingMethodAccessorImpl.invoke(DelegatingMethodAccessorImpl.java:43)
	at java.lang.reflect.Method.invoke(Method.java:498)
	at org.junit.runners.model.FrameworkMethod$1.runReflectiveCall(FrameworkMethod.java:59)
	at org.junit.internal.runners.model.ReflectiveCallable.run(ReflectiveCallable.java:12)
(30 more lines...)
Collapse Failed RecordMergeIssueTest recordMergeIssueTest History
< 1 sec
java.lang.AssertionError: Test killed due to server failure
	at org.junit.Assert.fail(Assert.java:89)
	at org.openmrs.uitestframework.test.TestBase.startWebDriver(TestBase.java:127)
	at sun.reflect.GeneratedMethodAccessor6.invoke(Unknown Source)
	at sun.reflect.DelegatingMethodAccessorImpl.invoke(DelegatingMethodAccessorImpl.java:43)
	at java.lang.reflect.Method.invoke(Method.java:498)
	at org.junit.runners.model.FrameworkMethod$1.runReflectiveCall(FrameworkMethod.java:59)
	at org.junit.internal.runners.model.ReflectiveCallable.run(ReflectiveCallable.java:12)
(30 more lines...)
Collapse Failed RegisterPatientTest registerPatientTest History
< 1 sec
java.lang.AssertionError: Test killed due to server failure
	at org.junit.Assert.fail(Assert.java:89)
	at org.openmrs.uitestframework.test.TestBase.startWebDriver(TestBase.java:127)
	at sun.reflect.GeneratedMethodAccessor6.invoke(Unknown Source)
	at sun.reflect.DelegatingMethodAccessorImpl.invoke(DelegatingMethodAccessorImpl.java:43)
	at java.lang.reflect.Method.invoke(Method.java:498)
	at org.junit.runners.model.FrameworkMethod$1.runReflectiveCall(FrameworkMethod.java:59)
	at org.junit.internal.runners.model.ReflectiveCallable.run(ReflectiveCallable.java:12)
(30 more lines...)
Collapse Failed RegisterUnidentifiedPatientTest registerUnidentifiedPatientTest History
< 1 sec
java.lang.AssertionError: Test killed due to server failure
	at org.junit.Assert.fail(Assert.java:89)
	at org.openmrs.uitestframework.test.TestBase.startWebDriver(TestBase.java:127)
	at sun.reflect.GeneratedMethodAccessor6.invoke(Unknown Source)
	at sun.reflect.DelegatingMethodAccessorImpl.invoke(DelegatingMethodAccessorImpl.java:43)
	at java.lang.reflect.Method.invoke(Method.java:498)
	at org.junit.runners.model.FrameworkMethod$1.runReflectiveCall(FrameworkMethod.java:59)
	at org.junit.internal.runners.model.ReflectiveCallable.run(ReflectiveCallable.java:12)
(30 more lines...)
Collapse Failed RetirePersonTest retirePersonTest History
< 1 sec
java.lang.AssertionError: Test killed due to server failure
	at org.junit.Assert.fail(Assert.java:89)
	at org.openmrs.uitestframework.test.TestBase.startWebDriver(TestBase.java:127)
	at sun.reflect.GeneratedMethodAccessor6.invoke(Unknown Source)
	at sun.reflect.DelegatingMethodAccessorImpl.invoke(DelegatingMethodAccessorImpl.java:43)
	at java.lang.reflect.Method.invoke(Method.java:498)
	at org.junit.runners.model.FrameworkMethod$1.runReflectiveCall(FrameworkMethod.java:59)
	at org.junit.internal.runners.model.ReflectiveCallable.run(ReflectiveCallable.java:12)
(30 more lines...)
Collapse Failed RetireProviderTest retireProviderTest History
< 1 sec
java.lang.AssertionError: Test killed due to server failure
	at org.junit.Assert.fail(Assert.java:89)
	at org.openmrs.uitestframework.test.TestBase.startWebDriver(TestBase.java:127)
	at sun.reflect.GeneratedMethodAccessor6.invoke(Unknown Source)
	at sun.reflect.DelegatingMethodAccessorImpl.invoke(DelegatingMethodAccessorImpl.java:43)
	at java.lang.reflect.Method.invoke(Method.java:498)
	at org.junit.runners.model.FrameworkMethod$1.runReflectiveCall(FrameworkMethod.java:59)
	at org.junit.internal.runners.model.ReflectiveCallable.run(ReflectiveCallable.java:12)
(30 more lines...)
Collapse Failed RetireVisitTypeTest retireVisitTypeTest History
< 1 sec
java.lang.AssertionError: Test killed due to server failure
	at org.junit.Assert.fail(Assert.java:89)
	at org.openmrs.uitestframework.test.TestBase.startWebDriver(TestBase.java:127)
	at sun.reflect.GeneratedMethodAccessor6.invoke(Unknown Source)
	at sun.reflect.DelegatingMethodAccessorImpl.invoke(DelegatingMethodAccessorImpl.java:43)
	at java.lang.reflect.Method.invoke(Method.java:498)
	at org.junit.runners.model.FrameworkMethod$1.runReflectiveCall(FrameworkMethod.java:59)
	at org.junit.internal.runners.model.ReflectiveCallable.run(ReflectiveCallable.java:12)
(30 more lines...)
Collapse Failed StartVisitTest startVisitTest History
< 1 sec
java.lang.AssertionError: Test killed due to server failure
	at org.junit.Assert.fail(Assert.java:89)
	at org.openmrs.uitestframework.test.TestBase.startWebDriver(TestBase.java:127)
	at sun.reflect.GeneratedMethodAccessor6.invoke(Unknown Source)
	at sun.reflect.DelegatingMethodAccessorImpl.invoke(DelegatingMethodAccessorImpl.java:43)
	at java.lang.reflect.Method.invoke(Method.java:498)
	at org.junit.runners.model.FrameworkMethod$1.runReflectiveCall(FrameworkMethod.java:59)
	at org.junit.internal.runners.model.ReflectiveCallable.run(ReflectiveCallable.java:12)
(30 more lines...)
Collapse Failed UsingBackButtonInMergePatientTest usingBackButtonInMergePatientTest History
< 1 sec
java.lang.AssertionError: Test killed due to server failure
	at org.junit.Assert.fail(Assert.java:89)
	at org.openmrs.uitestframework.test.TestBase.startWebDriver(TestBase.java:127)
	at sun.reflect.GeneratedMethodAccessor6.invoke(Unknown Source)
	at sun.reflect.DelegatingMethodAccessorImpl.invoke(DelegatingMethodAccessorImpl.java:43)
	at java.lang.reflect.Method.invoke(Method.java:498)
	at org.junit.runners.model.FrameworkMethod$1.runReflectiveCall(FrameworkMethod.java:59)
	at org.junit.internal.runners.model.ReflectiveCallable.run(ReflectiveCallable.java:12)
(30 more lines...)
Collapse Failed VisitNoteTest visitNoteTest History
< 1 sec
java.lang.AssertionError: Test killed due to server failure
	at org.junit.Assert.fail(Assert.java:89)
	at org.openmrs.uitestframework.test.TestBase.startWebDriver(TestBase.java:127)
	at sun.reflect.GeneratedMethodAccessor6.invoke(Unknown Source)
	at sun.reflect.DelegatingMethodAccessorImpl.invoke(DelegatingMethodAccessorImpl.java:43)
	at java.lang.reflect.Method.invoke(Method.java:498)
	at org.junit.runners.model.FrameworkMethod$1.runReflectiveCall(FrameworkMethod.java:59)
	at org.junit.internal.runners.model.ReflectiveCallable.run(ReflectiveCallable.java:12)
(30 more lines...)