UI tests for the reference application

Build: #593 failed

Job: Run QA UI Tests failed

Stages & jobs

  1. Ref App UI Testing

Job result summary

Completed
Duration
17 minutes
Agent
yak.openmrs.org
Revisions
Distribution
ae3593d6eed9b6b6b06e168759adbd34c881c007 ae3593d6eed9b6b6b06e168759adbd34c881c007
UI Test Framework
8838c8eeee749c044f9846bcb0a31a7065db1260 8838c8eeee749c044f9846bcb0a31a7065db1260
Total tests
58
Fixed in
#595 (Manual run by Kakumirizi Daud)

Tests

  • 58 tests in total
  • 2 tests failed
  • 2 failures are new
  • 15 minutes taken in total.
New test failures 2
Status Test Duration
Collapse Failed AddUserTest addUserTest History
2 mins
org.openqa.selenium.remote.UnreachableBrowserException: Error communicating with the remote browser. It may have died. Build info: version: '4.0.0-alpha-6', revision: '5f43a29cfc' System info: host: 'yak', ip: '127.0.0.1', os.name: 'Linux', os.arch: 'amd64', os.version: '4.4.0-210-generic', java.version: '1.8.0_292' Driver info: driver.version: RemoteWebDriver Capabilities {acceptInsecureCerts: false, browserName: chrome, browserVersion: 90.0.4430.72, chrome: {chromedriverVersion: 90.0.4430.24 (4c6d850f087da..., userDataDir: /tmp/.com.google.Chrome.tYLzcv}, goog:chromeOptions: {debuggerAddress: localhost:44358}, javascriptEnabled: true, networkConnectionEnabled: false, pageLoadStrategy: normal, platform: LINUX, platformName: LINUX, proxy: Proxy(), setWindowRect: true, strictFileInteractability: false, timeouts: {implicit: 0, pageLoad: 300000, script: 30000}, unhandledPromptBehavior: dismiss and notify, webauthn:extension:largeBlob: true, webauthn:virtualAuthenticators: true} Session ID: 635e6e33183f7eca4f1b860210cfe92a
org.openqa.selenium.remote.UnreachableBrowserException: Error communicating with the remote browser. It may have died.
Build info: version: '4.0.0-alpha-6', revision: '5f43a29cfc'
System info: host: 'yak', ip: '127.0.0.1', os.name: 'Linux', os.arch: 'amd64', os.version: '4.4.0-210-generic', java.version: '1.8.0_292'
Driver info: driver.version: RemoteWebDriver
Capabilities {acceptInsecureCerts: false, browserName: chrome, browserVersion: 90.0.4430.72, chrome: {chromedriverVersion: 90.0.4430.24 (4c6d850f087da..., userDataDir: /tmp/.com.google.Chrome.tYLzcv}, goog:chromeOptions: {debuggerAddress: localhost:44358}, javascriptEnabled: true, networkConnectionEnabled: false, pageLoadStrategy: normal, platform: LINUX, platformName: LINUX, proxy: Proxy(), setWindowRect: true, strictFileInteractability: false, timeouts: {implicit: 0, pageLoad: 300000, script: 30000}, unhandledPromptBehavior: dismiss and notify, webauthn:extension:largeBlob: true, webauthn:virtualAuthenticators: true}
Session ID: 635e6e33183f7eca4f1b860210cfe92a
	at org.openqa.selenium.remote.RemoteWebDriver.execute(RemoteWebDriver.java:603)
(35 more lines...)
Collapse Failed BookRequestAppointmentTest bookRequestAppointmentTest History
2 mins
org.openqa.selenium.remote.UnreachableBrowserException: Error communicating with the remote browser. It may have died. Build info: version: '4.0.0-alpha-6', revision: '5f43a29cfc' System info: host: 'yak', ip: '127.0.0.1', os.name: 'Linux', os.arch: 'amd64', os.version: '4.4.0-210-generic', java.version: '1.8.0_292' Driver info: driver.version: RemoteWebDriver Capabilities {acceptInsecureCerts: false, browserName: chrome, browserVersion: 90.0.4430.72, chrome: {chromedriverVersion: 90.0.4430.24 (4c6d850f087da..., userDataDir: /tmp/.com.google.Chrome.8glsXE}, goog:chromeOptions: {debuggerAddress: localhost:35571}, javascriptEnabled: true, networkConnectionEnabled: false, pageLoadStrategy: normal, platform: LINUX, platformName: LINUX, proxy: Proxy(), setWindowRect: true, strictFileInteractability: false, timeouts: {implicit: 0, pageLoad: 300000, script: 30000}, unhandledPromptBehavior: dismiss and notify, webauthn:extension:largeBlob: true, webauthn:virtualAuthenticators: true} Session ID: 6c3f2c1314a5f0534bb4f5df7f5a8882
org.openqa.selenium.remote.UnreachableBrowserException: Error communicating with the remote browser. It may have died.
Build info: version: '4.0.0-alpha-6', revision: '5f43a29cfc'
System info: host: 'yak', ip: '127.0.0.1', os.name: 'Linux', os.arch: 'amd64', os.version: '4.4.0-210-generic', java.version: '1.8.0_292'
Driver info: driver.version: RemoteWebDriver
Capabilities {acceptInsecureCerts: false, browserName: chrome, browserVersion: 90.0.4430.72, chrome: {chromedriverVersion: 90.0.4430.24 (4c6d850f087da..., userDataDir: /tmp/.com.google.Chrome.8glsXE}, goog:chromeOptions: {debuggerAddress: localhost:35571}, javascriptEnabled: true, networkConnectionEnabled: false, pageLoadStrategy: normal, platform: LINUX, platformName: LINUX, proxy: Proxy(), setWindowRect: true, strictFileInteractability: false, timeouts: {implicit: 0, pageLoad: 300000, script: 30000}, unhandledPromptBehavior: dismiss and notify, webauthn:extension:largeBlob: true, webauthn:virtualAuthenticators: true}
Session ID: 6c3f2c1314a5f0534bb4f5df7f5a8882
	at org.openqa.selenium.remote.RemoteWebDriver.execute(RemoteWebDriver.java:603)
(35 more lines...)