UI tests for the reference application

Build: #645 failed

Job: Run QA UI Tests failed

Stages & jobs

  1. Ref App UI Testing

Build log

The build generated 1,001 lines of output.The output is too long and has been truncated to the last 1,000 lines. Download or view full build log

12-Oct-2021 12:10:14 Remote agent on host yue.openmrs.org
12-Oct-2021 12:10:14 Build working directory is /home/bamboo-agent/bamboo-agent/xml-data/build-dir/REFAPP-UI-FRAMEWORK
12-Oct-2021 12:10:14 Executing build Reference Application - UI - Run QA UI Tests #645 (REFAPP-UI-FRAMEWORK-645)
12-Oct-2021 12:10:14 Starting task 'Checkout uitestframework' of type 'com.atlassian.bamboo.plugins.vcs:task.vcs.checkout'
12-Oct-2021 12:10:14 Build always requires a clean checkout
12-Oct-2021 12:10:14 Cleaning build directory '/home/bamboo-agent/bamboo-agent/xml-data/build-dir/REFAPP-UI-FRAMEWORK'
12-Oct-2021 12:10:14 Checking out into /home/bamboo-agent/bamboo-agent/xml-data/build-dir/REFAPP-UI-FRAMEWORK
12-Oct-2021 12:10:14 Updating source code to revision: 8838c8eeee749c044f9846bcb0a31a7065db1260
12-Oct-2021 12:10:14 Creating local git repository in '/home/bamboo-agent/bamboo-agent/xml-data/build-dir/REFAPP-UI-FRAMEWORK/.git'.
12-Oct-2021 12:10:14 Initialized empty Git repository in /home/bamboo-agent/bamboo-agent/xml-data/build-dir/REFAPP-UI-FRAMEWORK/.git/
12-Oct-2021 12:10:14 Fetching 'refs/heads/master' from 'git://github.com/openmrs/openmrs-contrib-uitestframework.git'.
12-Oct-2021 12:10:20 From git://github.com/openmrs/openmrs-contrib-uitestframework
12-Oct-2021 12:10:20 * [new branch]      master     -> master
12-Oct-2021 12:10:20 * [new tag]         1.0        -> 1.0
12-Oct-2021 12:10:20 * [new tag]         1.1        -> 1.1
12-Oct-2021 12:10:20 * [new tag]         1.2        -> 1.2
12-Oct-2021 12:10:20 * [new tag]         1.3        -> 1.3
12-Oct-2021 12:10:20 * [new tag]         1.4        -> 1.4
12-Oct-2021 12:10:20 * [new tag]         1.5        -> 1.5
12-Oct-2021 12:10:20 * [new tag]         1.5.1      -> 1.5.1
12-Oct-2021 12:10:20 * [new tag]         1.6        -> 1.6
12-Oct-2021 12:10:20 * [new tag]         1.7        -> 1.7
12-Oct-2021 12:10:20 * [new tag]         1.7.1      -> 1.7.1
12-Oct-2021 12:10:20 * [new tag]         1.7.2      -> 1.7.2
12-Oct-2021 12:10:20 * [new tag]         1.8        -> 1.8
12-Oct-2021 12:10:20 * [new tag]         2.0.0      -> 2.0.0
12-Oct-2021 12:10:20 * [new tag]         2.0.1      -> 2.0.1
12-Oct-2021 12:10:20 * [new tag]         2.1.0      -> 2.1.0
12-Oct-2021 12:10:20 * [new tag]         2.2.0      -> 2.2.0
12-Oct-2021 12:10:20 * [new tag]         2.3.0      -> 2.3.0
12-Oct-2021 12:10:20 * [new tag]         2.4.0      -> 2.4.0
12-Oct-2021 12:10:20 Checking out revision 8838c8eeee749c044f9846bcb0a31a7065db1260.
12-Oct-2021 12:10:20 Already on 'master'
12-Oct-2021 12:10:20 Updated source code to revision: 8838c8eeee749c044f9846bcb0a31a7065db1260
12-Oct-2021 12:10:20 Finished task 'Checkout uitestframework' with result: Success
12-Oct-2021 12:10:20 Running pre-build action: VCS Version Collector
12-Oct-2021 12:10:20 Running pre-build action: Sauce OnDemand Build Configurator
12-Oct-2021 12:10:20 Running pre-build action: Run Predator
12-Oct-2021 12:10:20 [PredatorPreBuildAction] Starting predator plugin, pre build agent cleaner
12-Oct-2021 12:10:20 [PredatorPreBuildAction] Running these commands: docker system prune -af; docker ps -q| xargs docker kill; docker ps -qa | xargs docker rm -f
12-Oct-2021 12:10:20 [PredatorPreBuildAction] Running command 'docker system prune -af'
12-Oct-2021 12:10:20 [PredatorPreBuildAction] Command 'docker system prune -af' completed with exit code 0
12-Oct-2021 12:10:20 [PredatorPreBuildAction] Running command 'docker ps -q| xargs docker kill'
12-Oct-2021 12:10:20 [PredatorPreBuildAction] Command 'docker ps -q| xargs docker kill' completed with exit code 125
12-Oct-2021 12:10:20 [PredatorPreBuildAction] Running command 'docker ps -qa | xargs docker rm -f'
12-Oct-2021 12:10:21 [PredatorPreBuildAction] Command 'docker ps -qa | xargs docker rm -f' completed with exit code 125
12-Oct-2021 12:10:21 [PredatorPreBuildAction] Identifying Bamboo agent process (or parent):  3815 java        2110 bamboo-age 3037Mb  852Mb 04:38:21 /usr/lib/jvm/java-8-ope
12-Oct-2021 12:10:21 [PredatorPreBuildAction] Identifying Bamboo agent process (or parent):  2110 wrapper        1 bamboo-age   22Mb    1Mb 01:00:16 /home/bamboo-agent/bamb
12-Oct-2021 12:10:21 [PredatorPreBuildAction] Identifying Bamboo agent process (or parent):     1 systemd        0 root        117Mb    4Mb 00:02:44 /sbin/init             
12-Oct-2021 12:10:21 [PredatorPreBuildAction] No processes found for (chromium|chrome|webdriver|mysql|java |mvn )
12-Oct-2021 12:10:21 [PredatorPreBuildAction] Initial free space: 5.651432 GB
12-Oct-2021 12:10:21 [PredatorPreBuildAction] Deleting folder /home/bamboo-agent/bamboo-agent/xml-data/build-dir/OCL-OCLAPI2-BO
12-Oct-2021 12:10:21 [PredatorPreBuildAction] Deleting folder /home/bamboo-agent/bamboo-agent/xml-data/build-dir/RA-RA-RTM
12-Oct-2021 12:10:21 [PredatorPreBuildAction] Deleting 3 snapshot folders from /home/bamboo-agent/.m2/repository
12-Oct-2021 12:10:21 [PredatorPreBuildAction] Maven snapshot disk freed: 0 GB
12-Oct-2021 12:10:22 [PredatorPreBuildAction] 0 empty artifacts were found and deleted by Predator
12-Oct-2021 12:10:22 [PredatorPreBuildAction] Maven stable disk freed: 0.0 GB, deleted 0 files
12-Oct-2021 12:10:22 [PredatorPreBuildAction] File /home/bamboo-agent/.npmrc does not exist.
12-Oct-2021 12:10:22 [PredatorPreBuildAction] File /home/bamboo-agent/.docker/config.json does not exist.
12-Oct-2021 12:10:22 [PredatorPreBuildAction] File /home/bamboo-agent/.OpenMRS/liquibaseUpdateLogs.txt does not exist.
12-Oct-2021 12:10:22 [PredatorPreBuildAction] Final free space: 5.9489937 GB
12-Oct-2021 12:10:22 [PredatorPreBuildAction] Done
12-Oct-2021 12:10:22 Starting task 'Build uitestframework' of type 'com.atlassian.bamboo.plugins.maven:task.builder.mvn3'
12-Oct-2021 12:10:22
Beginning to execute external process for build 'Reference Application - UI - Run QA UI Tests #645 (REFAPP-UI-FRAMEWORK-645)'
... running command line:
/usr/share/apache-maven-3.3.9/bin/mvn --batch-mode -Djava.io.tmpdir=/home/bamboo-agent/bamboo-agent/.agent_tmp/REFAPP-UI-FRAMEWORK clean install
... in: /home/bamboo-agent/bamboo-agent/xml-data/build-dir/REFAPP-UI-FRAMEWORK
... using extra environment variables:
bamboo_planRepository_1_branch=master
bamboo_capability_system_builder_grailsBuilder_Grails_2_3_7=/opt/grails
bamboo_planRepository_2_branch=master
bamboo_planRepository_1_branchDisplayName=master
bamboo_repository_revision_number=b4775f89e382e41fdec4e9554dd4de3e7c696b91
MAVEN2_HOME=/usr/share/apache-maven-3.3.9
bamboo_saucelabs_username=rkorytkowski
bamboo_repository_207388681_previous_revision_number=fc23e97df4c7d71d2bba71c1956c8702cb3d8113
bamboo_buildKey=REFAPP-UI-FRAMEWORK
bamboo_DISPLAY=10
bamboo_maven_release_version=2.8.0
bamboo_planRepository_2_branchDisplayName=master
bamboo_repository_207388681_name=Distribution
bamboo_shortJobName=Run QA UI Tests
bamboo_buildResultsUrl=https://ci.openmrs.org/browse/REFAPP-UI-FRAMEWORK-645
bamboo_planRepository_repositoryUrl=git://github.com/openmrs/openmrs-distro-referenceapplication.git
bamboo_agentId=189792258
bamboo_maven_development_version=
bamboo_capability_system_jdk_JDK_8=/usr/lib/jvm/java-8-openjdk-amd64
bamboo_planRepository_revision=b4775f89e382e41fdec4e9554dd4de3e7c696b91
bamboo_planRepository_previousRevision=fc23e97df4c7d71d2bba71c1956c8702cb3d8113
bamboo_capability_system_jdk_JDK_1_8_0_265=/usr/lib/jvm/java-1.8.0-openjdk-amd64/
bamboo_repository_branch_name=master
bamboo_dockerhub_username=openmrsci
bamboo_refapp_distro_scm=git@github.com:openmrs/openmrs-distro-referenceapplication.git
bamboo_repository_207388681_branch_name=master
JAVA_HOME=/usr/lib/jvm/java-1.8.0-openjdk-amd64/
bamboo_repository_207388680_branch_name=master
bamboo_repository_207388681_git_username=
bamboo_planRepository_branch=master
bamboo_repository_207388681_revision_number=b4775f89e382e41fdec4e9554dd4de3e7c696b91
bamboo_capability_system_jdk_JDK_1_8_0_275=/usr/lib/jvm/java-1.8.0-openjdk-amd64/
bamboo_capability_system_jdk_JDK_1_8_0_272=/usr/lib/jvm/java-1.8.0-openjdk-amd64/
bamboo_capability_system_jdk_JDK_11=/usr/lib/jvm/java-11-openjdk-amd64
bamboo_planRepository_1_type=gitv2
bamboo_planRepository_branchName=master
bamboo_saucelabs_password=********
bamboo_capability_system_jdk_JDK=/usr/lib/jvm/java-1.8.0-openjdk-amd64/
bamboo_mavenBuildGoals=clean install
bamboo_hg_cache_directory=/home/bamboo-agent/bamboo-agent/xml-data/build-dir/_hg-repositories-cache
bamboo_planRepository_1_username=
bamboo_planRepository_type=gitv2
bamboo_git_cache_directory=/home/bamboo-agent/bamboo-agent/xml-data/build-dir/_git-repositories-cache
bamboo_planRepository_2_branchName=master
useMavenReturnCode=false
bamboo_capability_system_builder_node_Node_js=/usr/bin/node
bamboo_travis_password=********
bamboo_capability_system_builder_mvn3_Maven_3=/usr/share/apache-maven-3.3.9
bamboo_tmp_directory=/home/bamboo-agent/bamboo-agent/temp
bamboo_planKey=REFAPP-UI
bamboo_capability_system_builder_command_nvm=nvm
bamboo_planRepository_username=
bamboo_capability_system_jdk_JDK_1_8_0_282=/usr/lib/jvm/java-1.8.0-openjdk-amd64/
bamboo_planRepository_1_branchName=master
bamboo_dockerhub_password=********
bamboo_resultsUrl=https://ci.openmrs.org/browse/REFAPP-UI-FRAMEWORK-645
bamboo_capability_system_builder_command_transifex=/usr/bin/tx
bamboo_jdbc_password=********
bamboo_build_working_directory=/home/bamboo-agent/bamboo-agent/xml-data/build-dir/REFAPP-UI-FRAMEWORK
bamboo_planRepository_1_name=Distribution
bamboo_capability_system_jdk_JDK_1_8_0_292=/usr/lib/jvm/java-1.8.0-openjdk-amd64/
bamboo_preparing_refapp_distro_release=false
bamboo_shortPlanName=UI
bamboo_planRepository_2_username=
bamboo_planRepository_name=Distribution
bamboo_docs_aws_secret_key=********
bamboo_buildNumber=645
bamboo_repository_207388680_git_username=
bamboo_repository_207388681_git_repositoryUrl=git://github.com/openmrs/openmrs-distro-referenceapplication.git
bamboo_planName=Reference Application - UI
bamboo_shortPlanKey=UI
bamboo_shortJobKey=FRAMEWORK
bamboo_planRepository_2_name=UI Test Framework
bamboo_buildTimeStamp=2021-10-12T12:10:14.054Z
bamboo_repository_previous_revision_number=fc23e97df4c7d71d2bba71c1956c8702cb3d8113
M2_HOME=/usr/share/apache-maven-3.3.9
bamboo_refapp_bamboo_build_number=
bamboo_repository_git_branch=master
bamboo_buildResultKey=REFAPP-UI-FRAMEWORK-645
bamboo_docs_aws_access_key=AKIAI7KMDL5KP2673G7A
bamboo_buildPlanName=Reference Application - UI - Run QA UI Tests
bamboo_openMRSVersion=2.1.3
bamboo_planRepository_1_revision=b4775f89e382e41fdec4e9554dd4de3e7c696b91
bamboo_repository_207388680_git_repositoryUrl=git://github.com/openmrs/openmrs-contrib-uitestframework.git
bamboo_repository_name=UI Test Framework
bamboo_capability_system_jdk_openjdk_8_jdk=/usr/lib/jvm/java-8-openjdk-amd64
bamboo_planRepository_2_previousRevision=8838c8eeee749c044f9846bcb0a31a7065db1260
bamboo_transifex_password=********
bamboo_repository_207388680_name=UI Test Framework
bamboo_capability_system_jdk_openjdk_11_jdk=/usr/lib/jvm/java-11-openjdk-amd64
bamboo_repository_207388680_previous_revision_number=8838c8eeee749c044f9846bcb0a31a7065db1260
bamboo_buildFailed=false
bamboo_capability_system_builder_grailsBuilder_Grails_2=/opt/grails
bamboo_capability_system_docker_executable=/usr/bin/docker
bamboo_capability_system_builder_command_Bash=/bin/bash
bamboo_agentWorkingDirectory=/home/bamboo-agent/bamboo-agent/xml-data/build-dir
bamboo_planRepository_2_revision=8838c8eeee749c044f9846bcb0a31a7065db1260
bamboo_capability_system_git_executable=/usr/bin/git
bamboo_repository_git_username=
bamboo_planRepository_1_previousRevision=fc23e97df4c7d71d2bba71c1956c8702cb3d8113
bamboo_planRepository_branchDisplayName=master
bamboo_planRepository_2_type=gitv2
bamboo_plan_storageTag=plan-207093778
bamboo_repository_207388680_git_branch=master
bamboo_planRepository_2_repositoryUrl=git://github.com/openmrs/openmrs-contrib-uitestframework.git
bamboo_repository_git_repositoryUrl=git://github.com/openmrs/openmrs-distro-referenceapplication.git
bamboo_transifex_username=api
bamboo_refapp_distro_dev_branch=master
bamboo_working_directory=/home/bamboo-agent/bamboo-agent/xml-data/build-dir/REFAPP-UI-FRAMEWORK
bamboo_planRepository_1_repositoryUrl=git://github.com/openmrs/openmrs-distro-referenceapplication.git
bamboo_capability_system_jdk_JDK_1_8=/usr/lib/jvm/java-1.8.0-openjdk-amd64/
bamboo_repository_207388681_git_branch=master
bamboo_repository_207388680_revision_number=8838c8eeee749c044f9846bcb0a31a7065db1260
PATH=/usr/lib/jvm/java-1.8.0-openjdk-amd64//bin:/home/bamboo-agent/.nvm/versions/node/v10.22.1/bin:/home/bamboo-agent/bin:/home/bamboo-agent/.local/bin:/usr/local/sbin:/usr/local/bin:/usr/sbin:/usr/bin:/sbin:/bin:/usr/games:/usr/local/games:/snap/bin:/opt/puppetlabs/bin
12-Oct-2021 12:10:23 [INFO] Scanning for projects...
12-Oct-2021 12:10:23 [WARNING]
12-Oct-2021 12:10:23 [WARNING] Some problems were encountered while building the effective model for org.openmrs.contrib:uitestframework:jar:2.5.0-SNAPSHOT
12-Oct-2021 12:10:23 [WARNING] 'build.plugins.plugin.version' for org.apache.maven.plugins:maven-compiler-plugin is missing. @ line 125, column 21
12-Oct-2021 12:10:23 [WARNING]
12-Oct-2021 12:10:23 [WARNING] It is highly recommended to fix these problems because they threaten the stability of your build.
12-Oct-2021 12:10:23 [WARNING]
12-Oct-2021 12:10:23 [WARNING] For this reason, future Maven versions might no longer support building such malformed projects.
12-Oct-2021 12:10:23 [WARNING]
12-Oct-2021 12:10:23 [INFO]                                                                         
12-Oct-2021 12:10:23 [INFO] ------------------------------------------------------------------------
12-Oct-2021 12:10:23 [INFO] Building UI Test Framework 2.5.0-SNAPSHOT
12-Oct-2021 12:10:23 [INFO] ------------------------------------------------------------------------
12-Oct-2021 12:10:27 [INFO]
12-Oct-2021 12:10:27 [INFO] --- maven-clean-plugin:2.5:clean (default-clean) @ uitestframework ---
12-Oct-2021 12:10:27 [INFO]
12-Oct-2021 12:10:27 [INFO] --- maven-resources-plugin:2.6:resources (default-resources) @ uitestframework ---
12-Oct-2021 12:10:27 [WARNING] Using platform encoding (UTF-8 actually) to copy filtered resources, i.e. build is platform dependent!
12-Oct-2021 12:10:27 [INFO] Copying 5 resources
12-Oct-2021 12:10:27 [INFO]
12-Oct-2021 12:10:27 [INFO] --- maven-compiler-plugin:3.1:compile (default-compile) @ uitestframework ---
12-Oct-2021 12:10:27 [INFO] Changes detected - recompiling the module!
12-Oct-2021 12:10:27 [WARNING] File encoding has not been set, using platform encoding UTF-8, i.e. build is platform dependent!
12-Oct-2021 12:10:27 [INFO] Compiling 9 source files to /home/bamboo-agent/bamboo-agent/xml-data/build-dir/REFAPP-UI-FRAMEWORK/target/classes
12-Oct-2021 12:10:34 [WARNING] /home/bamboo-agent/bamboo-agent/xml-data/build-dir/REFAPP-UI-FRAMEWORK/src/main/java/org/openmrs/uitestframework/page/Page.java: Some input files use or override a deprecated API.
12-Oct-2021 12:10:34 [WARNING] /home/bamboo-agent/bamboo-agent/xml-data/build-dir/REFAPP-UI-FRAMEWORK/src/main/java/org/openmrs/uitestframework/page/Page.java: Recompile with -Xlint:deprecation for details.
12-Oct-2021 12:10:34 [INFO]
12-Oct-2021 12:10:34 [INFO] --- maven-resources-plugin:2.6:testResources (default-testResources) @ uitestframework ---
12-Oct-2021 12:10:34 [WARNING] Using platform encoding (UTF-8 actually) to copy filtered resources, i.e. build is platform dependent!
12-Oct-2021 12:10:34 [INFO] skip non existing resourceDirectory /home/bamboo-agent/bamboo-agent/xml-data/build-dir/REFAPP-UI-FRAMEWORK/src/test/resources
12-Oct-2021 12:10:34 [INFO]
12-Oct-2021 12:10:34 [INFO] --- maven-compiler-plugin:3.1:testCompile (default-testCompile) @ uitestframework ---
12-Oct-2021 12:10:34 [INFO] No sources to compile
12-Oct-2021 12:10:34 [INFO]
12-Oct-2021 12:10:34 [INFO] --- maven-surefire-plugin:2.12.4:test (default-test) @ uitestframework ---
12-Oct-2021 12:10:36 [INFO] No tests to run.
12-Oct-2021 12:10:36 [INFO]
12-Oct-2021 12:10:36 [INFO] --- maven-jar-plugin:2.4:jar (default-jar) @ uitestframework ---
12-Oct-2021 12:10:36 [INFO] Building jar: /home/bamboo-agent/bamboo-agent/xml-data/build-dir/REFAPP-UI-FRAMEWORK/target/uitestframework-2.5.0-SNAPSHOT.jar
12-Oct-2021 12:10:38 [INFO]
12-Oct-2021 12:10:38 [INFO] --- maven-install-plugin:2.4:install (default-install) @ uitestframework ---
12-Oct-2021 12:10:38 [INFO] Installing /home/bamboo-agent/bamboo-agent/xml-data/build-dir/REFAPP-UI-FRAMEWORK/target/uitestframework-2.5.0-SNAPSHOT.jar to /home/bamboo-agent/.m2/repository/org/openmrs/contrib/uitestframework/2.5.0-SNAPSHOT/uitestframework-2.5.0-SNAPSHOT.jar
12-Oct-2021 12:10:38 [INFO] Installing /home/bamboo-agent/bamboo-agent/xml-data/build-dir/REFAPP-UI-FRAMEWORK/pom.xml to /home/bamboo-agent/.m2/repository/org/openmrs/contrib/uitestframework/2.5.0-SNAPSHOT/uitestframework-2.5.0-SNAPSHOT.pom
12-Oct-2021 12:10:38 [INFO] ------------------------------------------------------------------------
12-Oct-2021 12:10:38 [INFO] BUILD SUCCESS
12-Oct-2021 12:10:38 [INFO] ------------------------------------------------------------------------
12-Oct-2021 12:10:38 [INFO] Total time: 14.797 s
12-Oct-2021 12:10:38 [INFO] Finished at: 2021-10-12T12:10:38+00:00
12-Oct-2021 12:10:38 [INFO] Final Memory: 25M/246M
12-Oct-2021 12:10:38 [INFO] ------------------------------------------------------------------------
12-Oct-2021 12:10:38 Finished task 'Build uitestframework' with result: Success
12-Oct-2021 12:10:38 Starting task 'Checkout distribution' of type 'com.atlassian.bamboo.plugins.vcs:task.vcs.checkout'
12-Oct-2021 12:10:38 Build always requires a clean checkout
12-Oct-2021 12:10:38 Cleaning build directory '/home/bamboo-agent/bamboo-agent/xml-data/build-dir/REFAPP-UI-FRAMEWORK'
12-Oct-2021 12:10:38 Checking out into /home/bamboo-agent/bamboo-agent/xml-data/build-dir/REFAPP-UI-FRAMEWORK
12-Oct-2021 12:10:38 Updating source code to revision: b4775f89e382e41fdec4e9554dd4de3e7c696b91
12-Oct-2021 12:10:38 Enforcing full fetch as requested revision has not been found on the configured branch
12-Oct-2021 12:10:38 Creating local git repository in '/home/bamboo-agent/bamboo-agent/xml-data/build-dir/REFAPP-UI-FRAMEWORK/.git'.
12-Oct-2021 12:10:38 Initialized empty Git repository in /home/bamboo-agent/bamboo-agent/xml-data/build-dir/REFAPP-UI-FRAMEWORK/.git/
12-Oct-2021 12:10:38 Fetching 'refs/heads/*' from 'git://github.com/openmrs/openmrs-distro-referenceapplication.git'.
12-Oct-2021 12:10:40 From git://github.com/openmrs/openmrs-distro-referenceapplication
12-Oct-2021 12:10:40 * [new branch]      2.3.x      -> 2.3.x
12-Oct-2021 12:10:40 * [new branch]      2.6.x      -> 2.6.x
12-Oct-2021 12:10:40 * [new branch]      3.x        -> 3.x
12-Oct-2021 12:10:40 * [new branch]      3.x-npx-no-install -> 3.x-npx-no-install
12-Oct-2021 12:10:40 * [new branch]      master     -> master
12-Oct-2021 12:10:40 * [new branch]      msf        -> msf
12-Oct-2021 12:10:40 * [new branch]      next-weekday -> next-weekday
12-Oct-2021 12:10:40 * [new branch]      platform-2.1.x -> platform-2.1.x
12-Oct-2021 12:10:40 * [new branch]      release    -> release
12-Oct-2021 12:10:40 * [new branch]      revert-204-OCLM-50 -> revert-204-OCLM-50
12-Oct-2021 12:10:40 * [new branch]      revert-214-RA-1320 -> revert-214-RA-1320
12-Oct-2021 12:10:40 * [new branch]      revert-272-RA-1818 -> revert-272-RA-1818
12-Oct-2021 12:10:40 * [new branch]      revert-273-sherrif10 -> revert-273-sherrif10
12-Oct-2021 12:10:40 * [new branch]      revert-294-fhir -> revert-294-fhir
12-Oct-2021 12:10:40 * [new branch]      revert-334-RATEST-97 -> revert-334-RATEST-97
12-Oct-2021 12:10:40 * [new branch]      revert-344-RATEST-110 -> revert-344-RATEST-110
12-Oct-2021 12:10:40 * [new branch]      revert-345-RATEST-96 -> revert-345-RATEST-96
12-Oct-2021 12:10:40 * [new branch]      revert-385-RATEST-135 -> revert-385-RATEST-135
12-Oct-2021 12:10:40 * [new branch]      revert-399-RATEST-145 -> revert-399-RATEST-145
12-Oct-2021 12:10:40 * [new branch]      revert-410-RATEST-145 -> revert-410-RATEST-145
12-Oct-2021 12:10:40 * [new branch]      revert-423-RATEST-93 -> revert-423-RATEST-93
12-Oct-2021 12:10:40 * [new branch]      revert-429-RATEST-112 -> revert-429-RATEST-112
12-Oct-2021 12:10:40 * [new branch]      revert-442-RATEST-85 -> revert-442-RATEST-85
12-Oct-2021 12:10:40 * [new branch]      revert-448-RATEST-143 -> revert-448-RATEST-143
12-Oct-2021 12:10:40 * [new branch]      revert-449-RATEST-145 -> revert-449-RATEST-145
12-Oct-2021 12:10:40 * [new branch]      revert-454-RATEST-135 -> revert-454-RATEST-135
12-Oct-2021 12:10:40 * [new branch]      revert-479-RATEST-93 -> revert-479-RATEST-93
12-Oct-2021 12:10:40 * [new branch]      revert-523-FormTest -> revert-523-FormTest
12-Oct-2021 12:10:40 * [new branch]      revert-567-updateVersions -> revert-567-updateVersions
12-Oct-2021 12:10:40 * [new branch]      revert-571-updatingTheReleasedVersions -> revert-571-updatingTheReleasedVersions
12-Oct-2021 12:10:40 * [new branch]      samuelmale-patch-1 -> samuelmale-patch-1
12-Oct-2021 12:10:40 * [new branch]      samuelmale-patch-2 -> samuelmale-patch-2
12-Oct-2021 12:10:40 * [new branch]      samuelmale-patch-3 -> samuelmale-patch-3
12-Oct-2021 12:10:40 * [new branch]      uat        -> uat
12-Oct-2021 12:10:40 * [new tag]         2.0.1769   -> 2.0.1769
12-Oct-2021 12:10:40 * [new tag]         2.1        -> 2.1
12-Oct-2021 12:10:40 * [new tag]         2.10.0     -> 2.10.0
12-Oct-2021 12:10:40 * [new tag]         2.11.0     -> 2.11.0
12-Oct-2021 12:10:40 * [new tag]         2.2        -> 2.2
12-Oct-2021 12:10:40 * [new tag]         2.3        -> 2.3
12-Oct-2021 12:10:40 * [new tag]         2.3.1      -> 2.3.1
12-Oct-2021 12:10:40 * [new tag]         2.4        -> 2.4
12-Oct-2021 12:10:40 * [new tag]         2.5        -> 2.5
12-Oct-2021 12:10:40 * [new tag]         2.6.0      -> 2.6.0
12-Oct-2021 12:10:40 * [new tag]         2.6.1      -> 2.6.1
12-Oct-2021 12:10:40 * [new tag]         2.7.0      -> 2.7.0
12-Oct-2021 12:10:40 * [new tag]         2.8.0      -> 2.8.0
12-Oct-2021 12:10:40 * [new tag]         2.8.1      -> 2.8.1
12-Oct-2021 12:10:40 * [new tag]         2.9.0      -> 2.9.0
12-Oct-2021 12:10:40 * [new tag]         latest     -> latest
12-Oct-2021 12:10:40 Checking out revision b4775f89e382e41fdec4e9554dd4de3e7c696b91.
12-Oct-2021 12:10:40 Already on 'master'
12-Oct-2021 12:10:40 Updated source code to revision: b4775f89e382e41fdec4e9554dd4de3e7c696b91
12-Oct-2021 12:10:40 Finished task 'Checkout distribution' with result: Success
12-Oct-2021 12:10:40 Skipping execution of task 'deploy docker db and web containers' as it is disabled
12-Oct-2021 12:10:40 Starting task 'ensure refapp instance is app and prepare for testing' of type 'com.atlassian.bamboo.plugins.scripttask:task.builder.script'
12-Oct-2021 12:10:40
Beginning to execute external process for build 'Reference Application - UI - Run QA UI Tests #645 (REFAPP-UI-FRAMEWORK-645)'
... running command line:
/home/bamboo-agent/bamboo-agent/temp/REFAPP-UI-FRAMEWORK-645-ScriptBuildTask-3944847621624906758.sh
... in: /home/bamboo-agent/bamboo-agent/xml-data/build-dir/REFAPP-UI-FRAMEWORK
... using extra environment variables:
bamboo_planRepository_1_branch=master
bamboo_capability_system_builder_grailsBuilder_Grails_2_3_7=/opt/grails
bamboo_planRepository_2_branch=master
bamboo_planRepository_1_branchDisplayName=master
bamboo_repository_revision_number=b4775f89e382e41fdec4e9554dd4de3e7c696b91
bamboo_saucelabs_username=rkorytkowski
bamboo_repository_207388681_previous_revision_number=fc23e97df4c7d71d2bba71c1956c8702cb3d8113
bamboo_buildKey=REFAPP-UI-FRAMEWORK
bamboo_DISPLAY=10
bamboo_maven_release_version=2.8.0
bamboo_planRepository_2_branchDisplayName=master
bamboo_repository_207388681_name=Distribution
bamboo_shortJobName=Run QA UI Tests
bamboo_buildResultsUrl=https://ci.openmrs.org/browse/REFAPP-UI-FRAMEWORK-645
bamboo_planRepository_repositoryUrl=git://github.com/openmrs/openmrs-distro-referenceapplication.git
bamboo_agentId=189792258
bamboo_maven_development_version=
bamboo_capability_system_jdk_JDK_8=/usr/lib/jvm/java-8-openjdk-amd64
bamboo_planRepository_revision=b4775f89e382e41fdec4e9554dd4de3e7c696b91
bamboo_planRepository_previousRevision=fc23e97df4c7d71d2bba71c1956c8702cb3d8113
bamboo_capability_system_jdk_JDK_1_8_0_265=/usr/lib/jvm/java-1.8.0-openjdk-amd64/
bamboo_repository_branch_name=master
bamboo_dockerhub_username=openmrsci
bamboo_refapp_distro_scm=git@github.com:openmrs/openmrs-distro-referenceapplication.git
bamboo_repository_207388681_branch_name=master
bamboo_repository_207388680_branch_name=master
bamboo_repository_207388681_git_username=
bamboo_planRepository_branch=master
bamboo_repository_207388681_revision_number=b4775f89e382e41fdec4e9554dd4de3e7c696b91
bamboo_capability_system_jdk_JDK_1_8_0_275=/usr/lib/jvm/java-1.8.0-openjdk-amd64/
bamboo_capability_system_jdk_JDK_1_8_0_272=/usr/lib/jvm/java-1.8.0-openjdk-amd64/
bamboo_capability_system_jdk_JDK_11=/usr/lib/jvm/java-11-openjdk-amd64
bamboo_planRepository_1_type=gitv2
bamboo_planRepository_branchName=master
bamboo_saucelabs_password=********
bamboo_capability_system_jdk_JDK=/usr/lib/jvm/java-1.8.0-openjdk-amd64/
bamboo_mavenBuildGoals=clean install
bamboo_hg_cache_directory=/home/bamboo-agent/bamboo-agent/xml-data/build-dir/_hg-repositories-cache
bamboo_planRepository_1_username=
bamboo_planRepository_type=gitv2
bamboo_git_cache_directory=/home/bamboo-agent/bamboo-agent/xml-data/build-dir/_git-repositories-cache
bamboo_planRepository_2_branchName=master
bamboo_capability_system_builder_node_Node_js=/usr/bin/node
bamboo_build_commandline_com_atlassian_bamboo_plugins_maven_task_builder_mvn3_2=/usr/share/apache-maven-3.3.9/bin/mvn --batch-mode -Djava.io.tmpdir=/home/bamboo-agent/bamboo-agent/.agent_tmp/REFAPP-UI-FRAMEWORK clean install
bamboo_travis_password=********
bamboo_capability_system_builder_mvn3_Maven_3=/usr/share/apache-maven-3.3.9
bamboo_tmp_directory=/home/bamboo-agent/bamboo-agent/temp
bamboo_planKey=REFAPP-UI
bamboo_capability_system_builder_command_nvm=nvm
bamboo_planRepository_username=
bamboo_capability_system_jdk_JDK_1_8_0_282=/usr/lib/jvm/java-1.8.0-openjdk-amd64/
bamboo_planRepository_1_branchName=master
bamboo_dockerhub_password=********
bamboo_resultsUrl=https://ci.openmrs.org/browse/REFAPP-UI-FRAMEWORK-645
bamboo_capability_system_builder_command_transifex=/usr/bin/tx
bamboo_jdbc_password=********
bamboo_build_working_directory=/home/bamboo-agent/bamboo-agent/xml-data/build-dir/REFAPP-UI-FRAMEWORK
bamboo_planRepository_1_name=Distribution
bamboo_capability_system_jdk_JDK_1_8_0_292=/usr/lib/jvm/java-1.8.0-openjdk-amd64/
bamboo_preparing_refapp_distro_release=false
bamboo_shortPlanName=UI
bamboo_planRepository_2_username=
bamboo_planRepository_name=Distribution
bamboo_docs_aws_secret_key=********
bamboo_buildNumber=645
bamboo_repository_207388680_git_username=
bamboo_repository_207388681_git_repositoryUrl=git://github.com/openmrs/openmrs-distro-referenceapplication.git
bamboo_planName=Reference Application - UI
bamboo_shortPlanKey=UI
bamboo_shortJobKey=FRAMEWORK
bamboo_planRepository_2_name=UI Test Framework
bamboo_buildTimeStamp=2021-10-12T12:10:14.054Z
bamboo_repository_previous_revision_number=fc23e97df4c7d71d2bba71c1956c8702cb3d8113
bamboo_refapp_bamboo_build_number=
bamboo_repository_git_branch=master
bamboo_buildResultKey=REFAPP-UI-FRAMEWORK-645
bamboo_docs_aws_access_key=AKIAI7KMDL5KP2673G7A
bamboo_buildPlanName=Reference Application - UI - Run QA UI Tests
bamboo_openMRSVersion=2.1.3
bamboo_planRepository_1_revision=b4775f89e382e41fdec4e9554dd4de3e7c696b91
bamboo_repository_207388680_git_repositoryUrl=git://github.com/openmrs/openmrs-contrib-uitestframework.git
bamboo_repository_name=UI Test Framework
bamboo_capability_system_jdk_openjdk_8_jdk=/usr/lib/jvm/java-8-openjdk-amd64
bamboo_planRepository_2_previousRevision=8838c8eeee749c044f9846bcb0a31a7065db1260
bamboo_transifex_password=********
bamboo_repository_207388680_name=UI Test Framework
bamboo_capability_system_jdk_openjdk_11_jdk=/usr/lib/jvm/java-11-openjdk-amd64
bamboo_repository_207388680_previous_revision_number=8838c8eeee749c044f9846bcb0a31a7065db1260
bamboo_buildFailed=false
bamboo_capability_system_builder_grailsBuilder_Grails_2=/opt/grails
bamboo_capability_system_docker_executable=/usr/bin/docker
bamboo_capability_system_builder_command_Bash=/bin/bash
bamboo_agentWorkingDirectory=/home/bamboo-agent/bamboo-agent/xml-data/build-dir
bamboo_planRepository_2_revision=8838c8eeee749c044f9846bcb0a31a7065db1260
bamboo_capability_system_git_executable=/usr/bin/git
bamboo_repository_git_username=
bamboo_planRepository_1_previousRevision=fc23e97df4c7d71d2bba71c1956c8702cb3d8113
bamboo_planRepository_branchDisplayName=master
bamboo_planRepository_2_type=gitv2
bamboo_plan_storageTag=plan-207093778
bamboo_repository_207388680_git_branch=master
bamboo_planRepository_2_repositoryUrl=git://github.com/openmrs/openmrs-contrib-uitestframework.git
bamboo_repository_git_repositoryUrl=git://github.com/openmrs/openmrs-distro-referenceapplication.git
bamboo_transifex_username=api
bamboo_refapp_distro_dev_branch=master
bamboo_working_directory=/home/bamboo-agent/bamboo-agent/xml-data/build-dir/REFAPP-UI-FRAMEWORK
bamboo_planRepository_1_repositoryUrl=git://github.com/openmrs/openmrs-distro-referenceapplication.git
bamboo_capability_system_jdk_JDK_1_8=/usr/lib/jvm/java-1.8.0-openjdk-amd64/
bamboo_repository_207388681_git_branch=master
bamboo_repository_207388680_revision_number=8838c8eeee749c044f9846bcb0a31a7065db1260
12-Oct-2021 12:10:40 Finished task 'ensure refapp instance is app and prepare for testing' with result: Success
12-Oct-2021 12:10:40 Starting task 'Build distribution' of type 'com.atlassian.bamboo.plugins.maven:task.builder.mvn3'
12-Oct-2021 12:10:40
Beginning to execute external process for build 'Reference Application - UI - Run QA UI Tests #645 (REFAPP-UI-FRAMEWORK-645)'
... running command line:
/usr/share/apache-maven-3.3.9/bin/mvn --batch-mode -Djava.io.tmpdir=/home/bamboo-agent/bamboo-agent/.agent_tmp/REFAPP-UI-FRAMEWORK clean install -DskipTests=false -e
... in: /home/bamboo-agent/bamboo-agent/xml-data/build-dir/REFAPP-UI-FRAMEWORK
... using extra environment variables:
bamboo_planRepository_1_branch=master
bamboo_capability_system_builder_grailsBuilder_Grails_2_3_7=/opt/grails
bamboo_planRepository_2_branch=master
bamboo_planRepository_1_branchDisplayName=master
bamboo_repository_revision_number=b4775f89e382e41fdec4e9554dd4de3e7c696b91
MAVEN2_HOME=/usr/share/apache-maven-3.3.9
bamboo_saucelabs_username=rkorytkowski
bamboo_repository_207388681_previous_revision_number=fc23e97df4c7d71d2bba71c1956c8702cb3d8113
bamboo_buildKey=REFAPP-UI-FRAMEWORK
bamboo_DISPLAY=10
bamboo_maven_release_version=2.8.0
bamboo_planRepository_2_branchDisplayName=master
bamboo_repository_207388681_name=Distribution
bamboo_shortJobName=Run QA UI Tests
bamboo_buildResultsUrl=https://ci.openmrs.org/browse/REFAPP-UI-FRAMEWORK-645
bamboo_planRepository_repositoryUrl=git://github.com/openmrs/openmrs-distro-referenceapplication.git
bamboo_agentId=189792258
bamboo_maven_development_version=
bamboo_capability_system_jdk_JDK_8=/usr/lib/jvm/java-8-openjdk-amd64
bamboo_planRepository_revision=b4775f89e382e41fdec4e9554dd4de3e7c696b91
bamboo_planRepository_previousRevision=fc23e97df4c7d71d2bba71c1956c8702cb3d8113
bamboo_capability_system_jdk_JDK_1_8_0_265=/usr/lib/jvm/java-1.8.0-openjdk-amd64/
bamboo_repository_branch_name=master
bamboo_dockerhub_username=openmrsci
bamboo_refapp_distro_scm=git@github.com:openmrs/openmrs-distro-referenceapplication.git
bamboo_repository_207388681_branch_name=master
JAVA_HOME=/usr/lib/jvm/java-1.8.0-openjdk-amd64/
bamboo_repository_207388680_branch_name=master
bamboo_repository_207388681_git_username=
bamboo_planRepository_branch=master
bamboo_repository_207388681_revision_number=b4775f89e382e41fdec4e9554dd4de3e7c696b91
bamboo_capability_system_jdk_JDK_1_8_0_275=/usr/lib/jvm/java-1.8.0-openjdk-amd64/
bamboo_capability_system_jdk_JDK_1_8_0_272=/usr/lib/jvm/java-1.8.0-openjdk-amd64/
bamboo_capability_system_jdk_JDK_11=/usr/lib/jvm/java-11-openjdk-amd64
bamboo_planRepository_1_type=gitv2
bamboo_planRepository_branchName=master
bamboo_saucelabs_password=********
bamboo_capability_system_jdk_JDK=/usr/lib/jvm/java-1.8.0-openjdk-amd64/
bamboo_mavenBuildGoals=clean install
bamboo_hg_cache_directory=/home/bamboo-agent/bamboo-agent/xml-data/build-dir/_hg-repositories-cache
bamboo_planRepository_1_username=
bamboo_planRepository_type=gitv2
bamboo_git_cache_directory=/home/bamboo-agent/bamboo-agent/xml-data/build-dir/_git-repositories-cache
bamboo_planRepository_2_branchName=master
useMavenReturnCode=false
bamboo_capability_system_builder_node_Node_js=/usr/bin/node
bamboo_build_commandline_com_atlassian_bamboo_plugins_maven_task_builder_mvn3_2=/usr/share/apache-maven-3.3.9/bin/mvn --batch-mode -Djava.io.tmpdir=/home/bamboo-agent/bamboo-agent/.agent_tmp/REFAPP-UI-FRAMEWORK clean install
bamboo_travis_password=********
bamboo_capability_system_builder_mvn3_Maven_3=/usr/share/apache-maven-3.3.9
bamboo_tmp_directory=/home/bamboo-agent/bamboo-agent/temp
bamboo_planKey=REFAPP-UI
bamboo_capability_system_builder_command_nvm=nvm
bamboo_planRepository_username=
bamboo_capability_system_jdk_JDK_1_8_0_282=/usr/lib/jvm/java-1.8.0-openjdk-amd64/
bamboo_planRepository_1_branchName=master
bamboo_dockerhub_password=********
bamboo_resultsUrl=https://ci.openmrs.org/browse/REFAPP-UI-FRAMEWORK-645
bamboo_capability_system_builder_command_transifex=/usr/bin/tx
bamboo_jdbc_password=********
bamboo_build_working_directory=/home/bamboo-agent/bamboo-agent/xml-data/build-dir/REFAPP-UI-FRAMEWORK
bamboo_planRepository_1_name=Distribution
bamboo_capability_system_jdk_JDK_1_8_0_292=/usr/lib/jvm/java-1.8.0-openjdk-amd64/
bamboo_preparing_refapp_distro_release=false
bamboo_shortPlanName=UI
bamboo_planRepository_2_username=
bamboo_planRepository_name=Distribution
bamboo_docs_aws_secret_key=********
bamboo_buildNumber=645
bamboo_repository_207388680_git_username=
bamboo_repository_207388681_git_repositoryUrl=git://github.com/openmrs/openmrs-distro-referenceapplication.git
bamboo_planName=Reference Application - UI
bamboo_build_commandline_com_atlassian_bamboo_plugins_scripttask_task_builder_script_6=/home/bamboo-agent/bamboo-agent/temp/REFAPP-UI-FRAMEWORK-645-ScriptBuildTask-3944847621624906758.sh
bamboo_shortPlanKey=UI
bamboo_shortJobKey=FRAMEWORK
bamboo_planRepository_2_name=UI Test Framework
bamboo_buildTimeStamp=2021-10-12T12:10:14.054Z
bamboo_repository_previous_revision_number=fc23e97df4c7d71d2bba71c1956c8702cb3d8113
M2_HOME=/usr/share/apache-maven-3.3.9
bamboo_refapp_bamboo_build_number=
bamboo_repository_git_branch=master
bamboo_buildResultKey=REFAPP-UI-FRAMEWORK-645
bamboo_docs_aws_access_key=AKIAI7KMDL5KP2673G7A
bamboo_buildPlanName=Reference Application - UI - Run QA UI Tests
bamboo_openMRSVersion=2.1.3
bamboo_planRepository_1_revision=b4775f89e382e41fdec4e9554dd4de3e7c696b91
bamboo_repository_207388680_git_repositoryUrl=git://github.com/openmrs/openmrs-contrib-uitestframework.git
bamboo_repository_name=UI Test Framework
bamboo_capability_system_jdk_openjdk_8_jdk=/usr/lib/jvm/java-8-openjdk-amd64
bamboo_planRepository_2_previousRevision=8838c8eeee749c044f9846bcb0a31a7065db1260
bamboo_transifex_password=********
bamboo_repository_207388680_name=UI Test Framework
bamboo_capability_system_jdk_openjdk_11_jdk=/usr/lib/jvm/java-11-openjdk-amd64
bamboo_repository_207388680_previous_revision_number=8838c8eeee749c044f9846bcb0a31a7065db1260
bamboo_buildFailed=false
bamboo_capability_system_builder_grailsBuilder_Grails_2=/opt/grails
bamboo_capability_system_docker_executable=/usr/bin/docker
bamboo_capability_system_builder_command_Bash=/bin/bash
bamboo_agentWorkingDirectory=/home/bamboo-agent/bamboo-agent/xml-data/build-dir
bamboo_planRepository_2_revision=8838c8eeee749c044f9846bcb0a31a7065db1260
bamboo_capability_system_git_executable=/usr/bin/git
bamboo_repository_git_username=
bamboo_planRepository_1_previousRevision=fc23e97df4c7d71d2bba71c1956c8702cb3d8113
bamboo_planRepository_branchDisplayName=master
bamboo_planRepository_2_type=gitv2
bamboo_plan_storageTag=plan-207093778
bamboo_repository_207388680_git_branch=master
bamboo_planRepository_2_repositoryUrl=git://github.com/openmrs/openmrs-contrib-uitestframework.git
bamboo_repository_git_repositoryUrl=git://github.com/openmrs/openmrs-distro-referenceapplication.git
bamboo_transifex_username=api
bamboo_refapp_distro_dev_branch=master
bamboo_working_directory=/home/bamboo-agent/bamboo-agent/xml-data/build-dir/REFAPP-UI-FRAMEWORK
bamboo_planRepository_1_repositoryUrl=git://github.com/openmrs/openmrs-distro-referenceapplication.git
bamboo_capability_system_jdk_JDK_1_8=/usr/lib/jvm/java-1.8.0-openjdk-amd64/
bamboo_repository_207388681_git_branch=master
bamboo_repository_207388680_revision_number=8838c8eeee749c044f9846bcb0a31a7065db1260
PATH=/usr/lib/jvm/java-1.8.0-openjdk-amd64//bin:/home/bamboo-agent/.nvm/versions/node/v10.22.1/bin:/home/bamboo-agent/bin:/home/bamboo-agent/.local/bin:/usr/local/sbin:/usr/local/bin:/usr/sbin:/usr/bin:/sbin:/bin:/usr/games:/usr/local/games:/snap/bin:/opt/puppetlabs/bin
12-Oct-2021 12:10:42 [INFO] Error stacktraces are turned on.
12-Oct-2021 12:10:42 [INFO] Scanning for projects...
12-Oct-2021 12:10:42 [WARNING]
12-Oct-2021 12:10:42 [WARNING] Some problems were encountered while building the effective model for org.openmrs.distro:referenceapplication-ui-tests:jar:2.12.0-SNAPSHOT
12-Oct-2021 12:10:42 [WARNING] 'build.plugins.plugin.version' for org.apache.maven.plugins:maven-deploy-plugin is missing. @ line 88, column 21
12-Oct-2021 12:10:42 [WARNING]
12-Oct-2021 12:10:42 [WARNING] It is highly recommended to fix these problems because they threaten the stability of your build.
12-Oct-2021 12:10:42 [WARNING]
12-Oct-2021 12:10:42 [WARNING] For this reason, future Maven versions might no longer support building such malformed projects.
12-Oct-2021 12:10:42 [WARNING]
12-Oct-2021 12:10:42 [INFO] ------------------------------------------------------------------------
12-Oct-2021 12:10:42 [INFO] Reactor Build Order:
12-Oct-2021 12:10:42 [INFO]
12-Oct-2021 12:10:42 [INFO] Reference Application Distribution
12-Oct-2021 12:10:42 [INFO] Reference Application Distribution Package
12-Oct-2021 12:10:42 [INFO] Reference Application Distribution UI Tests
12-Oct-2021 12:10:42 [INFO]                                                                         
12-Oct-2021 12:10:42 [INFO] ------------------------------------------------------------------------
12-Oct-2021 12:10:42 [INFO] Building Reference Application Distribution 2.12.0-SNAPSHOT
12-Oct-2021 12:10:42 [INFO] ------------------------------------------------------------------------
12-Oct-2021 12:10:42 [INFO]
12-Oct-2021 12:10:42 [INFO] --- maven-clean-plugin:2.5:clean (default-clean) @ referenceapplication ---
12-Oct-2021 12:10:42 [INFO]
12-Oct-2021 12:10:42 [INFO] --- maven-install-plugin:2.4:install (default-install) @ referenceapplication ---
12-Oct-2021 12:10:42 [INFO] Installing /home/bamboo-agent/bamboo-agent/xml-data/build-dir/REFAPP-UI-FRAMEWORK/pom.xml to /home/bamboo-agent/.m2/repository/org/openmrs/distro/referenceapplication/2.12.0-SNAPSHOT/referenceapplication-2.12.0-SNAPSHOT.pom
12-Oct-2021 12:10:42 [INFO]                                                                         
12-Oct-2021 12:10:42 [INFO] ------------------------------------------------------------------------
12-Oct-2021 12:10:42 [INFO] Building Reference Application Distribution Package 2.12.0-SNAPSHOT
12-Oct-2021 12:10:42 [INFO] ------------------------------------------------------------------------
12-Oct-2021 12:10:45 [INFO]
12-Oct-2021 12:10:45 [INFO] --- maven-clean-plugin:2.5:clean (default-clean) @ referenceapplication-package ---
12-Oct-2021 12:10:45 [INFO]
12-Oct-2021 12:10:45 [INFO] --- maven-resources-plugin:2.6:resources (default-resources) @ referenceapplication-package ---
12-Oct-2021 12:10:46 [INFO] Using 'UTF-8' encoding to copy filtered resources.
12-Oct-2021 12:10:46 [INFO] Copying 1 resource
12-Oct-2021 12:10:46 [INFO] Copying 2 resources
12-Oct-2021 12:10:46 [INFO] skip non existing resourceDirectory /home/bamboo-agent/bamboo-agent/xml-data/build-dir/REFAPP-UI-FRAMEWORK/package/src/main/webapp
12-Oct-2021 12:10:46 [INFO]
12-Oct-2021 12:10:46 [INFO] --- openmrs-sdk-maven-plugin:4.0.0:build-distro (build-distro) @ referenceapplication-package ---
12-Oct-2021 12:10:54
12-Oct-2021 12:10:54 Downloading modules...
12-Oct-2021 12:10:54
12-Oct-2021 12:10:56 [INFO] Configured Artifact: org.openmrs.web:openmrs-webapp:2.4.0:war
12-Oct-2021 12:10:56 [INFO] Copying openmrs-webapp-2.4.0.war to /home/bamboo-agent/bamboo-agent/xml-data/build-dir/REFAPP-UI-FRAMEWORK/package/target/distro/web/openmrs-2.4.0.war
12-Oct-2021 12:10:59 file:/home/bamboo-agent/bamboo-agent/xml-data/build-dir/REFAPP-UI-FRAMEWORK/package/target/distro/web/openmrs-2.4.0.war
12-Oct-2021 12:10:59 target:/home/bamboo-agent/bamboo-agent/xml-data/build-dir/REFAPP-UI-FRAMEWORK/package/target/distro/web
12-Oct-2021 12:10:59 [INFO] Configured Artifact: org.openmrs.module:addresshierarchy-omod:2.14.2:jar
12-Oct-2021 12:10:59 [INFO] Configured Artifact: org.openmrs.module:legacyui-omod:1.8.4:jar
12-Oct-2021 12:10:59 [INFO] Configured Artifact: org.openmrs.module:openconceptlab-omod:1.2.9:jar
12-Oct-2021 12:10:59 [INFO] Configured Artifact: org.openmrs.module:metadatadeploy-omod:1.13.0:jar
12-Oct-2021 12:10:59 [INFO] Configured Artifact: org.openmrs.module:reportingrest-omod:1.12.0:jar
12-Oct-2021 12:10:59 [INFO] Configured Artifact: org.openmrs.module:owa-omod:1.13.0:jar
12-Oct-2021 12:10:59 [INFO] Configured Artifact: org.openmrs.module:fhir2-omod:1.2.2:jar
12-Oct-2021 12:10:59 [INFO] Configured Artifact: org.openmrs.module:serialization.xstream-omod:0.2.15:omod
12-Oct-2021 12:10:59 [INFO] Configured Artifact: org.openmrs.module:registrationapp-omod:1.24.0:jar
12-Oct-2021 12:10:59 [INFO] Configured Artifact: org.openmrs:event-omod:2.10.0:jar
12-Oct-2021 12:10:59 [INFO] Configured Artifact: org.openmrs.module:uilibrary-omod:2.0.7:jar
12-Oct-2021 12:10:59 [INFO] Configured Artifact: org.openmrs.module:htmlwidgets-omod:1.10.0:jar
12-Oct-2021 12:10:59 [INFO] Configured Artifact: org.openmrs.module:dataexchange-omod:1.3.7:jar
12-Oct-2021 12:10:59 [INFO] Configured Artifact: org.openmrs.module:appui-omod:1.14.0:jar
12-Oct-2021 12:10:59 [INFO] Configured Artifact: org.openmrs.module:allergyui-omod:1.8.4:jar
12-Oct-2021 12:10:59 [INFO] Configured Artifact: org.openmrs.module:providermanagement-omod:2.13.0:jar
12-Oct-2021 12:10:59 [INFO] Configured Artifact: org.openmrs.module:appointmentschedulingui-omod:1.12.0:jar
12-Oct-2021 12:10:59 [INFO] Configured Artifact: org.openmrs.module:attachments-omod:2.5.0:jar
12-Oct-2021 12:10:59 [INFO] Configured Artifact: org.openmrs.module:formentryapp-omod:1.4.2:jar
12-Oct-2021 12:10:59 [INFO] Configured Artifact: org.openmrs.module:idgen-omod:4.7.0:jar
12-Oct-2021 12:10:59 [INFO] Configured Artifact: org.openmrs.module:metadatamapping-omod:1.4.0:jar
12-Oct-2021 12:10:59 [INFO] Configured Artifact: org.openmrs.module:htmlformentryui-omod:2.0.0:jar
12-Oct-2021 12:10:59 [INFO] Configured Artifact: org.openmrs.module:referencedemodata-omod:1.4.7:jar
12-Oct-2021 12:10:59 [INFO] Configured Artifact: org.openmrs.module:emrapi-omod:1.32.0:jar
12-Oct-2021 12:10:59 [INFO] Configured Artifact: org.openmrs.module:referenceapplication-omod:2.13.0-SNAPSHOT:jar
12-Oct-2021 12:11:00 [INFO] Downloading: http://mavenrepo.openmrs.org/nexus/content/repositories/public/org/openmrs/module/referenceapplication-omod/2.13.0-SNAPSHOT/maven-metadata.xml
12-Oct-2021 12:11:00 [INFO] Downloaded: http://mavenrepo.openmrs.org/nexus/content/repositories/public/org/openmrs/module/referenceapplication-omod/2.13.0-SNAPSHOT/maven-metadata.xml (796 B at 0.8 KB/sec)
12-Oct-2021 12:11:01 [INFO] Downloading: http://mavenrepo.openmrs.org/nexus/content/repositories/public/org/openmrs/module/referenceapplication-omod/2.13.0-SNAPSHOT/referenceapplication-omod-2.13.0-20211012.120905-1.jar
12-Oct-2021 12:11:02 [INFO] Downloaded: http://mavenrepo.openmrs.org/nexus/content/repositories/public/org/openmrs/module/referenceapplication-omod/2.13.0-SNAPSHOT/referenceapplication-omod-2.13.0-20211012.120905-1.jar (1902 KB at 1062.7 KB/sec)
12-Oct-2021 12:11:02 [INFO] Configured Artifact: org.openmrs.module:htmlformentry-omod:4.1.0:jar
12-Oct-2021 12:11:02 [INFO] Configured Artifact: org.openmrs.module:appframework-omod:2.16.0:jar
12-Oct-2021 12:11:02 [INFO] Configured Artifact: org.openmrs.module:referencemetadata-omod:2.12.0:jar
12-Oct-2021 12:11:02 [INFO] Configured Artifact: org.openmrs.module:reportingui-omod:1.8.0:jar
12-Oct-2021 12:11:02 [INFO] Configured Artifact: org.openmrs.module:coreapps-omod:1.35.0:jar
12-Oct-2021 12:11:02 [INFO] Configured Artifact: org.openmrs.module:reportingcompatibility-omod:2.0.8:jar
12-Oct-2021 12:11:02 [INFO] Configured Artifact: org.openmrs.module:reporting-omod:1.23.0:jar
12-Oct-2021 12:11:02 [INFO] Configured Artifact: org.openmrs.module:adminui-omod:1.6.0:jar
12-Oct-2021 12:11:02 [INFO] Configured Artifact: org.openmrs.module:registrationcore-omod:1.11.0:jar
12-Oct-2021 12:11:02 [INFO] Configured Artifact: org.openmrs.module:appointmentscheduling-omod:1.16.0:jar
12-Oct-2021 12:11:02 [INFO] Configured Artifact: org.openmrs.module:atlas-omod:2.2.5:omod
12-Oct-2021 12:11:02 [INFO] Configured Artifact: org.openmrs.module:calculation-omod:1.3.0:jar
12-Oct-2021 12:11:02 [INFO] Configured Artifact: org.openmrs.module:webservices.rest-omod:2.32.0:jar
12-Oct-2021 12:11:02 [INFO] Configured Artifact: org.openmrs.module:spa-omod:1.0.8:jar
12-Oct-2021 12:11:02 [INFO] Configured Artifact: org.openmrs.module:uicommons-omod:2.19.0:jar
12-Oct-2021 12:11:02 [INFO] Configured Artifact: org.openmrs.module:uiframework-omod:3.22.0:jar
12-Oct-2021 12:11:02 [INFO] Configured Artifact: org.openmrs.module:metadatasharing-omod:1.8.0:jar
12-Oct-2021 12:11:02 [INFO] Copying addresshierarchy-omod-2.14.2.jar to /home/bamboo-agent/bamboo-agent/xml-data/build-dir/REFAPP-UI-FRAMEWORK/package/target/distro/web/modules/addresshierarchy-2.14.2.omod
12-Oct-2021 12:11:02 [INFO] Copying legacyui-omod-1.8.4.jar to /home/bamboo-agent/bamboo-agent/xml-data/build-dir/REFAPP-UI-FRAMEWORK/package/target/distro/web/modules/legacyui-1.8.4.omod
12-Oct-2021 12:11:03 [INFO] Copying openconceptlab-omod-1.2.9.jar to /home/bamboo-agent/bamboo-agent/xml-data/build-dir/REFAPP-UI-FRAMEWORK/package/target/distro/web/modules/openconceptlab-1.2.9.omod
12-Oct-2021 12:11:03 [INFO] Copying metadatadeploy-omod-1.13.0.jar to /home/bamboo-agent/bamboo-agent/xml-data/build-dir/REFAPP-UI-FRAMEWORK/package/target/distro/web/modules/metadatadeploy-1.13.0.omod
12-Oct-2021 12:11:03 [INFO] Copying reportingrest-omod-1.12.0.jar to /home/bamboo-agent/bamboo-agent/xml-data/build-dir/REFAPP-UI-FRAMEWORK/package/target/distro/web/modules/reportingrest-1.12.0.omod
12-Oct-2021 12:11:03 [INFO] Copying owa-omod-1.13.0.jar to /home/bamboo-agent/bamboo-agent/xml-data/build-dir/REFAPP-UI-FRAMEWORK/package/target/distro/web/modules/owa-1.13.0.omod
12-Oct-2021 12:11:03 [INFO] Copying fhir2-omod-1.2.2.jar to /home/bamboo-agent/bamboo-agent/xml-data/build-dir/REFAPP-UI-FRAMEWORK/package/target/distro/web/modules/fhir2-1.2.2.omod
12-Oct-2021 12:11:04 [INFO] Copying serialization.xstream-omod-0.2.15.omod to /home/bamboo-agent/bamboo-agent/xml-data/build-dir/REFAPP-UI-FRAMEWORK/package/target/distro/web/modules/serialization.xstream-0.2.15.omod
12-Oct-2021 12:11:04 [INFO] Copying registrationapp-omod-1.24.0.jar to /home/bamboo-agent/bamboo-agent/xml-data/build-dir/REFAPP-UI-FRAMEWORK/package/target/distro/web/modules/registrationapp-1.24.0.omod
12-Oct-2021 12:11:04 [INFO] Copying event-omod-2.10.0.jar to /home/bamboo-agent/bamboo-agent/xml-data/build-dir/REFAPP-UI-FRAMEWORK/package/target/distro/web/modules/event-2.10.0.omod
12-Oct-2021 12:11:04 [INFO] Copying uilibrary-omod-2.0.7.jar to /home/bamboo-agent/bamboo-agent/xml-data/build-dir/REFAPP-UI-FRAMEWORK/package/target/distro/web/modules/uilibrary-2.0.7.omod
12-Oct-2021 12:11:04 [INFO] Copying htmlwidgets-omod-1.10.0.jar to /home/bamboo-agent/bamboo-agent/xml-data/build-dir/REFAPP-UI-FRAMEWORK/package/target/distro/web/modules/htmlwidgets-1.10.0.omod
12-Oct-2021 12:11:04 [INFO] Copying dataexchange-omod-1.3.7.jar to /home/bamboo-agent/bamboo-agent/xml-data/build-dir/REFAPP-UI-FRAMEWORK/package/target/distro/web/modules/dataexchange-1.3.7.omod
12-Oct-2021 12:11:04 [INFO] Copying appui-omod-1.14.0.jar to /home/bamboo-agent/bamboo-agent/xml-data/build-dir/REFAPP-UI-FRAMEWORK/package/target/distro/web/modules/appui-1.14.0.omod
12-Oct-2021 12:11:04 [INFO] Copying allergyui-omod-1.8.4.jar to /home/bamboo-agent/bamboo-agent/xml-data/build-dir/REFAPP-UI-FRAMEWORK/package/target/distro/web/modules/allergyui-1.8.4.omod
12-Oct-2021 12:11:04 [INFO] Copying providermanagement-omod-2.13.0.jar to /home/bamboo-agent/bamboo-agent/xml-data/build-dir/REFAPP-UI-FRAMEWORK/package/target/distro/web/modules/providermanagement-2.13.0.omod
12-Oct-2021 12:11:04 [INFO] Copying appointmentschedulingui-omod-1.12.0.jar to /home/bamboo-agent/bamboo-agent/xml-data/build-dir/REFAPP-UI-FRAMEWORK/package/target/distro/web/modules/appointmentschedulingui-1.12.0.omod
12-Oct-2021 12:11:04 [INFO] Copying attachments-omod-2.5.0.jar to /home/bamboo-agent/bamboo-agent/xml-data/build-dir/REFAPP-UI-FRAMEWORK/package/target/distro/web/modules/attachments-2.5.0.omod
12-Oct-2021 12:11:04 [INFO] Copying formentryapp-omod-1.4.2.jar to /home/bamboo-agent/bamboo-agent/xml-data/build-dir/REFAPP-UI-FRAMEWORK/package/target/distro/web/modules/formentryapp-1.4.2.omod
12-Oct-2021 12:11:04 [INFO] Copying idgen-omod-4.7.0.jar to /home/bamboo-agent/bamboo-agent/xml-data/build-dir/REFAPP-UI-FRAMEWORK/package/target/distro/web/modules/idgen-4.7.0.omod
12-Oct-2021 12:11:04 [INFO] Copying metadatamapping-omod-1.4.0.jar to /home/bamboo-agent/bamboo-agent/xml-data/build-dir/REFAPP-UI-FRAMEWORK/package/target/distro/web/modules/metadatamapping-1.4.0.omod
12-Oct-2021 12:11:05 [INFO] Copying htmlformentryui-omod-2.0.0.jar to /home/bamboo-agent/bamboo-agent/xml-data/build-dir/REFAPP-UI-FRAMEWORK/package/target/distro/web/modules/htmlformentryui-2.0.0.omod
12-Oct-2021 12:11:05 [INFO] Copying referencedemodata-omod-1.4.7.jar to /home/bamboo-agent/bamboo-agent/xml-data/build-dir/REFAPP-UI-FRAMEWORK/package/target/distro/web/modules/referencedemodata-1.4.7.omod
12-Oct-2021 12:11:05 [INFO] Copying emrapi-omod-1.32.0.jar to /home/bamboo-agent/bamboo-agent/xml-data/build-dir/REFAPP-UI-FRAMEWORK/package/target/distro/web/modules/emrapi-1.32.0.omod
12-Oct-2021 12:11:05 [INFO] Copying referenceapplication-omod-2.13.0-SNAPSHOT.jar to /home/bamboo-agent/bamboo-agent/xml-data/build-dir/REFAPP-UI-FRAMEWORK/package/target/distro/web/modules/referenceapplication-2.13.0-SNAPSHOT.omod
12-Oct-2021 12:11:05 [INFO] Copying htmlformentry-omod-4.1.0.jar to /home/bamboo-agent/bamboo-agent/xml-data/build-dir/REFAPP-UI-FRAMEWORK/package/target/distro/web/modules/htmlformentry-4.1.0.omod
12-Oct-2021 12:11:05 [INFO] Copying appframework-omod-2.16.0.jar to /home/bamboo-agent/bamboo-agent/xml-data/build-dir/REFAPP-UI-FRAMEWORK/package/target/distro/web/modules/appframework-2.16.0.omod
12-Oct-2021 12:11:05 [INFO] Copying referencemetadata-omod-2.12.0.jar to /home/bamboo-agent/bamboo-agent/xml-data/build-dir/REFAPP-UI-FRAMEWORK/package/target/distro/web/modules/referencemetadata-2.12.0.omod
12-Oct-2021 12:11:05 [INFO] Copying reportingui-omod-1.8.0.jar to /home/bamboo-agent/bamboo-agent/xml-data/build-dir/REFAPP-UI-FRAMEWORK/package/target/distro/web/modules/reportingui-1.8.0.omod
12-Oct-2021 12:11:05 [INFO] Copying coreapps-omod-1.35.0.jar to /home/bamboo-agent/bamboo-agent/xml-data/build-dir/REFAPP-UI-FRAMEWORK/package/target/distro/web/modules/coreapps-1.35.0.omod
12-Oct-2021 12:11:05 [INFO] Copying reportingcompatibility-omod-2.0.8.jar to /home/bamboo-agent/bamboo-agent/xml-data/build-dir/REFAPP-UI-FRAMEWORK/package/target/distro/web/modules/reportingcompatibility-2.0.8.omod
12-Oct-2021 12:11:05 [INFO] Copying reporting-omod-1.23.0.jar to /home/bamboo-agent/bamboo-agent/xml-data/build-dir/REFAPP-UI-FRAMEWORK/package/target/distro/web/modules/reporting-1.23.0.omod
12-Oct-2021 12:11:06 [INFO] Copying adminui-omod-1.6.0.jar to /home/bamboo-agent/bamboo-agent/xml-data/build-dir/REFAPP-UI-FRAMEWORK/package/target/distro/web/modules/adminui-1.6.0.omod
12-Oct-2021 12:11:06 [INFO] Copying registrationcore-omod-1.11.0.jar to /home/bamboo-agent/bamboo-agent/xml-data/build-dir/REFAPP-UI-FRAMEWORK/package/target/distro/web/modules/registrationcore-1.11.0.omod
12-Oct-2021 12:11:06 [INFO] Copying appointmentscheduling-omod-1.16.0.jar to /home/bamboo-agent/bamboo-agent/xml-data/build-dir/REFAPP-UI-FRAMEWORK/package/target/distro/web/modules/appointmentscheduling-1.16.0.omod
12-Oct-2021 12:11:06 [INFO] Copying atlas-omod-2.2.5.omod to /home/bamboo-agent/bamboo-agent/xml-data/build-dir/REFAPP-UI-FRAMEWORK/package/target/distro/web/modules/atlas-2.2.5.omod
12-Oct-2021 12:11:06 [INFO] Copying calculation-omod-1.3.0.jar to /home/bamboo-agent/bamboo-agent/xml-data/build-dir/REFAPP-UI-FRAMEWORK/package/target/distro/web/modules/calculation-1.3.0.omod
12-Oct-2021 12:11:06 [INFO] Copying webservices.rest-omod-2.32.0.jar to /home/bamboo-agent/bamboo-agent/xml-data/build-dir/REFAPP-UI-FRAMEWORK/package/target/distro/web/modules/webservices.rest-2.32.0.omod
12-Oct-2021 12:11:06 [INFO] Copying spa-omod-1.0.8.jar to /home/bamboo-agent/bamboo-agent/xml-data/build-dir/REFAPP-UI-FRAMEWORK/package/target/distro/web/modules/spa-1.0.8.omod
12-Oct-2021 12:11:06 [INFO] Copying uicommons-omod-2.19.0.jar to /home/bamboo-agent/bamboo-agent/xml-data/build-dir/REFAPP-UI-FRAMEWORK/package/target/distro/web/modules/uicommons-2.19.0.omod
12-Oct-2021 12:11:06 [INFO] Copying uiframework-omod-3.22.0.jar to /home/bamboo-agent/bamboo-agent/xml-data/build-dir/REFAPP-UI-FRAMEWORK/package/target/distro/web/modules/uiframework-3.22.0.omod
12-Oct-2021 12:11:07 [INFO] Copying metadatasharing-omod-1.8.0.jar to /home/bamboo-agent/bamboo-agent/xml-data/build-dir/REFAPP-UI-FRAMEWORK/package/target/distro/web/modules/metadatasharing-1.8.0.omod
12-Oct-2021 12:11:07
12-Oct-2021 12:11:07 Downloading OWAs...
12-Oct-2021 12:11:07
12-Oct-2021 12:11:07
12-Oct-2021 12:11:07 Downloading OWA: org.openmrs.owa:openmrs-owa-sysadmin:1.2
12-Oct-2021 12:11:07 [INFO] Configured Artifact: org.openmrs.owa:sysadmin:1.2:zip
12-Oct-2021 12:11:07 [INFO] Copying sysadmin-1.2.zip to /home/bamboo-agent/bamboo-agent/xml-data/build-dir/REFAPP-UI-FRAMEWORK/package/target/distro/web/owa/sysadmin-1.2.zip
12-Oct-2021 12:11:07
12-Oct-2021 12:11:07 Creating Docker Compose configuration...
12-Oct-2021 12:11:07
12-Oct-2021 12:11:08
12-Oct-2021 12:11:08 The 'referenceapplication' distribution created! To start up the server run 'docker-compose up' from /home/bamboo-agent/bamboo-agent/xml-data/build-dir/REFAPP-UI-FRAMEWORK/package/target/distro
12-Oct-2021 12:11:08
12-Oct-2021 12:11:08 [INFO]
12-Oct-2021 12:11:08 [INFO] --- openmrs-sdk-maven-plugin:4.0.0:build-distro (build-bundled-distro) @ referenceapplication-package ---
12-Oct-2021 12:11:08
12-Oct-2021 12:11:08 Downloading modules...
12-Oct-2021 12:11:08
12-Oct-2021 12:11:08 [INFO] Configured Artifact: org.openmrs.web:openmrs-webapp:2.4.0:war
12-Oct-2021 12:11:08 [INFO] Copying openmrs-webapp-2.4.0.war to /home/bamboo-agent/bamboo-agent/xml-data/build-dir/REFAPP-UI-FRAMEWORK/package/target/bundled-distro/web/openmrs-2.4.0.war
12-Oct-2021 12:11:08 file:/home/bamboo-agent/bamboo-agent/xml-data/build-dir/REFAPP-UI-FRAMEWORK/package/target/bundled-distro/web/openmrs-2.4.0.war
12-Oct-2021 12:11:08 target:/home/bamboo-agent/bamboo-agent/xml-data/build-dir/REFAPP-UI-FRAMEWORK/package/target/bundled-distro/web
12-Oct-2021 12:11:08 [INFO] Configured Artifact: org.openmrs.module:addresshierarchy-omod:2.14.2:jar
12-Oct-2021 12:11:08 [INFO] Configured Artifact: org.openmrs.module:legacyui-omod:1.8.4:jar
12-Oct-2021 12:11:08 [INFO] Configured Artifact: org.openmrs.module:openconceptlab-omod:1.2.9:jar
12-Oct-2021 12:11:08 [INFO] Configured Artifact: org.openmrs.module:metadatadeploy-omod:1.13.0:jar
12-Oct-2021 12:11:08 [INFO] Configured Artifact: org.openmrs.module:reportingrest-omod:1.12.0:jar
12-Oct-2021 12:11:08 [INFO] Configured Artifact: org.openmrs.module:owa-omod:1.13.0:jar
12-Oct-2021 12:11:08 [INFO] Configured Artifact: org.openmrs.module:fhir2-omod:1.2.2:jar
12-Oct-2021 12:11:08 [INFO] Configured Artifact: org.openmrs.module:serialization.xstream-omod:0.2.15:omod
12-Oct-2021 12:11:08 [INFO] Configured Artifact: org.openmrs.module:registrationapp-omod:1.24.0:jar
12-Oct-2021 12:11:08 [INFO] Configured Artifact: org.openmrs:event-omod:2.10.0:jar
12-Oct-2021 12:11:08 [INFO] Configured Artifact: org.openmrs.module:uilibrary-omod:2.0.7:jar
12-Oct-2021 12:11:08 [INFO] Configured Artifact: org.openmrs.module:htmlwidgets-omod:1.10.0:jar
12-Oct-2021 12:11:08 [INFO] Configured Artifact: org.openmrs.module:dataexchange-omod:1.3.7:jar
12-Oct-2021 12:11:08 [INFO] Configured Artifact: org.openmrs.module:appui-omod:1.14.0:jar
12-Oct-2021 12:11:08 [INFO] Configured Artifact: org.openmrs.module:allergyui-omod:1.8.4:jar
12-Oct-2021 12:11:08 [INFO] Configured Artifact: org.openmrs.module:providermanagement-omod:2.13.0:jar
12-Oct-2021 12:11:08 [INFO] Configured Artifact: org.openmrs.module:appointmentschedulingui-omod:1.12.0:jar
12-Oct-2021 12:11:08 [INFO] Configured Artifact: org.openmrs.module:attachments-omod:2.5.0:jar
12-Oct-2021 12:11:08 [INFO] Configured Artifact: org.openmrs.module:formentryapp-omod:1.4.2:jar
12-Oct-2021 12:11:08 [INFO] Configured Artifact: org.openmrs.module:idgen-omod:4.7.0:jar
12-Oct-2021 12:11:08 [INFO] Configured Artifact: org.openmrs.module:metadatamapping-omod:1.4.0:jar
12-Oct-2021 12:11:08 [INFO] Configured Artifact: org.openmrs.module:htmlformentryui-omod:2.0.0:jar
12-Oct-2021 12:11:08 [INFO] Configured Artifact: org.openmrs.module:referencedemodata-omod:1.4.7:jar
12-Oct-2021 12:11:08 [INFO] Configured Artifact: org.openmrs.module:emrapi-omod:1.32.0:jar
12-Oct-2021 12:11:08 [INFO] Configured Artifact: org.openmrs.module:referenceapplication-omod:2.13.0-SNAPSHOT:jar
12-Oct-2021 12:11:08 [INFO] Configured Artifact: org.openmrs.module:htmlformentry-omod:4.1.0:jar
12-Oct-2021 12:11:08 [INFO] Configured Artifact: org.openmrs.module:appframework-omod:2.16.0:jar
12-Oct-2021 12:11:08 [INFO] Configured Artifact: org.openmrs.module:referencemetadata-omod:2.12.0:jar
12-Oct-2021 12:11:08 [INFO] Configured Artifact: org.openmrs.module:reportingui-omod:1.8.0:jar
12-Oct-2021 12:11:08 [INFO] Configured Artifact: org.openmrs.module:coreapps-omod:1.35.0:jar
12-Oct-2021 12:11:08 [INFO] Configured Artifact: org.openmrs.module:reportingcompatibility-omod:2.0.8:jar
12-Oct-2021 12:11:08 [INFO] Configured Artifact: org.openmrs.module:reporting-omod:1.23.0:jar
12-Oct-2021 12:11:08 [INFO] Configured Artifact: org.openmrs.module:adminui-omod:1.6.0:jar
12-Oct-2021 12:11:08 [INFO] Configured Artifact: org.openmrs.module:registrationcore-omod:1.11.0:jar
12-Oct-2021 12:11:08 [INFO] Configured Artifact: org.openmrs.module:appointmentscheduling-omod:1.16.0:jar
12-Oct-2021 12:11:08 [INFO] Configured Artifact: org.openmrs.module:atlas-omod:2.2.5:omod
12-Oct-2021 12:11:08 [INFO] Configured Artifact: org.openmrs.module:calculation-omod:1.3.0:jar
12-Oct-2021 12:11:08 [INFO] Configured Artifact: org.openmrs.module:webservices.rest-omod:2.32.0:jar
12-Oct-2021 12:11:08 [INFO] Configured Artifact: org.openmrs.module:spa-omod:1.0.8:jar
12-Oct-2021 12:11:08 [INFO] Configured Artifact: org.openmrs.module:uicommons-omod:2.19.0:jar
12-Oct-2021 12:11:08 [INFO] Configured Artifact: org.openmrs.module:uiframework-omod:3.22.0:jar
12-Oct-2021 12:11:08 [INFO] Configured Artifact: org.openmrs.module:metadatasharing-omod:1.8.0:jar
12-Oct-2021 12:11:08 [INFO] Copying addresshierarchy-omod-2.14.2.jar to /home/bamboo-agent/bamboo-agent/xml-data/build-dir/REFAPP-UI-FRAMEWORK/package/target/bundled-distro/web/WEB-INF/bundledModules/addresshierarchy-2.14.2.omod
12-Oct-2021 12:11:08 [INFO] Copying legacyui-omod-1.8.4.jar to /home/bamboo-agent/bamboo-agent/xml-data/build-dir/REFAPP-UI-FRAMEWORK/package/target/bundled-distro/web/WEB-INF/bundledModules/legacyui-1.8.4.omod
12-Oct-2021 12:11:08 [INFO] Copying openconceptlab-omod-1.2.9.jar to /home/bamboo-agent/bamboo-agent/xml-data/build-dir/REFAPP-UI-FRAMEWORK/package/target/bundled-distro/web/WEB-INF/bundledModules/openconceptlab-1.2.9.omod
12-Oct-2021 12:11:08 [INFO] Copying metadatadeploy-omod-1.13.0.jar to /home/bamboo-agent/bamboo-agent/xml-data/build-dir/REFAPP-UI-FRAMEWORK/package/target/bundled-distro/web/WEB-INF/bundledModules/metadatadeploy-1.13.0.omod
12-Oct-2021 12:11:08 [INFO] Copying reportingrest-omod-1.12.0.jar to /home/bamboo-agent/bamboo-agent/xml-data/build-dir/REFAPP-UI-FRAMEWORK/package/target/bundled-distro/web/WEB-INF/bundledModules/reportingrest-1.12.0.omod
12-Oct-2021 12:11:08 [INFO] Copying owa-omod-1.13.0.jar to /home/bamboo-agent/bamboo-agent/xml-data/build-dir/REFAPP-UI-FRAMEWORK/package/target/bundled-distro/web/WEB-INF/bundledModules/owa-1.13.0.omod
12-Oct-2021 12:11:08 [INFO] Copying fhir2-omod-1.2.2.jar to /home/bamboo-agent/bamboo-agent/xml-data/build-dir/REFAPP-UI-FRAMEWORK/package/target/bundled-distro/web/WEB-INF/bundledModules/fhir2-1.2.2.omod
12-Oct-2021 12:11:08 [INFO] Copying serialization.xstream-omod-0.2.15.omod to /home/bamboo-agent/bamboo-agent/xml-data/build-dir/REFAPP-UI-FRAMEWORK/package/target/bundled-distro/web/WEB-INF/bundledModules/serialization.xstream-0.2.15.omod
12-Oct-2021 12:11:08 [INFO] Copying registrationapp-omod-1.24.0.jar to /home/bamboo-agent/bamboo-agent/xml-data/build-dir/REFAPP-UI-FRAMEWORK/package/target/bundled-distro/web/WEB-INF/bundledModules/registrationapp-1.24.0.omod
12-Oct-2021 12:11:08 [INFO] Copying event-omod-2.10.0.jar to /home/bamboo-agent/bamboo-agent/xml-data/build-dir/REFAPP-UI-FRAMEWORK/package/target/bundled-distro/web/WEB-INF/bundledModules/event-2.10.0.omod
12-Oct-2021 12:11:08 [INFO] Copying uilibrary-omod-2.0.7.jar to /home/bamboo-agent/bamboo-agent/xml-data/build-dir/REFAPP-UI-FRAMEWORK/package/target/bundled-distro/web/WEB-INF/bundledModules/uilibrary-2.0.7.omod
12-Oct-2021 12:11:08 [INFO] Copying htmlwidgets-omod-1.10.0.jar to /home/bamboo-agent/bamboo-agent/xml-data/build-dir/REFAPP-UI-FRAMEWORK/package/target/bundled-distro/web/WEB-INF/bundledModules/htmlwidgets-1.10.0.omod
12-Oct-2021 12:11:08 [INFO] Copying dataexchange-omod-1.3.7.jar to /home/bamboo-agent/bamboo-agent/xml-data/build-dir/REFAPP-UI-FRAMEWORK/package/target/bundled-distro/web/WEB-INF/bundledModules/dataexchange-1.3.7.omod
12-Oct-2021 12:11:08 [INFO] Copying appui-omod-1.14.0.jar to /home/bamboo-agent/bamboo-agent/xml-data/build-dir/REFAPP-UI-FRAMEWORK/package/target/bundled-distro/web/WEB-INF/bundledModules/appui-1.14.0.omod
12-Oct-2021 12:11:08 [INFO] Copying allergyui-omod-1.8.4.jar to /home/bamboo-agent/bamboo-agent/xml-data/build-dir/REFAPP-UI-FRAMEWORK/package/target/bundled-distro/web/WEB-INF/bundledModules/allergyui-1.8.4.omod
12-Oct-2021 12:11:08 [INFO] Copying providermanagement-omod-2.13.0.jar to /home/bamboo-agent/bamboo-agent/xml-data/build-dir/REFAPP-UI-FRAMEWORK/package/target/bundled-distro/web/WEB-INF/bundledModules/providermanagement-2.13.0.omod
12-Oct-2021 12:11:08 [INFO] Copying appointmentschedulingui-omod-1.12.0.jar to /home/bamboo-agent/bamboo-agent/xml-data/build-dir/REFAPP-UI-FRAMEWORK/package/target/bundled-distro/web/WEB-INF/bundledModules/appointmentschedulingui-1.12.0.omod
12-Oct-2021 12:11:08 [INFO] Copying attachments-omod-2.5.0.jar to /home/bamboo-agent/bamboo-agent/xml-data/build-dir/REFAPP-UI-FRAMEWORK/package/target/bundled-distro/web/WEB-INF/bundledModules/attachments-2.5.0.omod
12-Oct-2021 12:11:08 [INFO] Copying formentryapp-omod-1.4.2.jar to /home/bamboo-agent/bamboo-agent/xml-data/build-dir/REFAPP-UI-FRAMEWORK/package/target/bundled-distro/web/WEB-INF/bundledModules/formentryapp-1.4.2.omod
12-Oct-2021 12:11:08 [INFO] Copying idgen-omod-4.7.0.jar to /home/bamboo-agent/bamboo-agent/xml-data/build-dir/REFAPP-UI-FRAMEWORK/package/target/bundled-distro/web/WEB-INF/bundledModules/idgen-4.7.0.omod
12-Oct-2021 12:11:08 [INFO] Copying metadatamapping-omod-1.4.0.jar to /home/bamboo-agent/bamboo-agent/xml-data/build-dir/REFAPP-UI-FRAMEWORK/package/target/bundled-distro/web/WEB-INF/bundledModules/metadatamapping-1.4.0.omod
12-Oct-2021 12:11:08 [INFO] Copying htmlformentryui-omod-2.0.0.jar to /home/bamboo-agent/bamboo-agent/xml-data/build-dir/REFAPP-UI-FRAMEWORK/package/target/bundled-distro/web/WEB-INF/bundledModules/htmlformentryui-2.0.0.omod
12-Oct-2021 12:11:08 [INFO] Copying referencedemodata-omod-1.4.7.jar to /home/bamboo-agent/bamboo-agent/xml-data/build-dir/REFAPP-UI-FRAMEWORK/package/target/bundled-distro/web/WEB-INF/bundledModules/referencedemodata-1.4.7.omod
12-Oct-2021 12:11:08 [INFO] Copying emrapi-omod-1.32.0.jar to /home/bamboo-agent/bamboo-agent/xml-data/build-dir/REFAPP-UI-FRAMEWORK/package/target/bundled-distro/web/WEB-INF/bundledModules/emrapi-1.32.0.omod
12-Oct-2021 12:11:08 [INFO] Copying referenceapplication-omod-2.13.0-SNAPSHOT.jar to /home/bamboo-agent/bamboo-agent/xml-data/build-dir/REFAPP-UI-FRAMEWORK/package/target/bundled-distro/web/WEB-INF/bundledModules/referenceapplication-2.13.0-SNAPSHOT.omod
12-Oct-2021 12:11:08 [INFO] Copying htmlformentry-omod-4.1.0.jar to /home/bamboo-agent/bamboo-agent/xml-data/build-dir/REFAPP-UI-FRAMEWORK/package/target/bundled-distro/web/WEB-INF/bundledModules/htmlformentry-4.1.0.omod
12-Oct-2021 12:11:08 [INFO] Copying appframework-omod-2.16.0.jar to /home/bamboo-agent/bamboo-agent/xml-data/build-dir/REFAPP-UI-FRAMEWORK/package/target/bundled-distro/web/WEB-INF/bundledModules/appframework-2.16.0.omod
12-Oct-2021 12:11:08 [INFO] Copying referencemetadata-omod-2.12.0.jar to /home/bamboo-agent/bamboo-agent/xml-data/build-dir/REFAPP-UI-FRAMEWORK/package/target/bundled-distro/web/WEB-INF/bundledModules/referencemetadata-2.12.0.omod
12-Oct-2021 12:11:08 [INFO] Copying reportingui-omod-1.8.0.jar to /home/bamboo-agent/bamboo-agent/xml-data/build-dir/REFAPP-UI-FRAMEWORK/package/target/bundled-distro/web/WEB-INF/bundledModules/reportingui-1.8.0.omod
12-Oct-2021 12:11:08 [INFO] Copying coreapps-omod-1.35.0.jar to /home/bamboo-agent/bamboo-agent/xml-data/build-dir/REFAPP-UI-FRAMEWORK/package/target/bundled-distro/web/WEB-INF/bundledModules/coreapps-1.35.0.omod
12-Oct-2021 12:11:08 [INFO] Copying reportingcompatibility-omod-2.0.8.jar to /home/bamboo-agent/bamboo-agent/xml-data/build-dir/REFAPP-UI-FRAMEWORK/package/target/bundled-distro/web/WEB-INF/bundledModules/reportingcompatibility-2.0.8.omod
12-Oct-2021 12:11:08 [INFO] Copying reporting-omod-1.23.0.jar to /home/bamboo-agent/bamboo-agent/xml-data/build-dir/REFAPP-UI-FRAMEWORK/package/target/bundled-distro/web/WEB-INF/bundledModules/reporting-1.23.0.omod
12-Oct-2021 12:11:08 [INFO] Copying adminui-omod-1.6.0.jar to /home/bamboo-agent/bamboo-agent/xml-data/build-dir/REFAPP-UI-FRAMEWORK/package/target/bundled-distro/web/WEB-INF/bundledModules/adminui-1.6.0.omod
12-Oct-2021 12:11:08 [INFO] Copying registrationcore-omod-1.11.0.jar to /home/bamboo-agent/bamboo-agent/xml-data/build-dir/REFAPP-UI-FRAMEWORK/package/target/bundled-distro/web/WEB-INF/bundledModules/registrationcore-1.11.0.omod
12-Oct-2021 12:11:08 [INFO] Copying appointmentscheduling-omod-1.16.0.jar to /home/bamboo-agent/bamboo-agent/xml-data/build-dir/REFAPP-UI-FRAMEWORK/package/target/bundled-distro/web/WEB-INF/bundledModules/appointmentscheduling-1.16.0.omod
12-Oct-2021 12:11:09 [INFO] Copying atlas-omod-2.2.5.omod to /home/bamboo-agent/bamboo-agent/xml-data/build-dir/REFAPP-UI-FRAMEWORK/package/target/bundled-distro/web/WEB-INF/bundledModules/atlas-2.2.5.omod
12-Oct-2021 12:11:09 [INFO] Copying calculation-omod-1.3.0.jar to /home/bamboo-agent/bamboo-agent/xml-data/build-dir/REFAPP-UI-FRAMEWORK/package/target/bundled-distro/web/WEB-INF/bundledModules/calculation-1.3.0.omod
12-Oct-2021 12:11:09 [INFO] Copying webservices.rest-omod-2.32.0.jar to /home/bamboo-agent/bamboo-agent/xml-data/build-dir/REFAPP-UI-FRAMEWORK/package/target/bundled-distro/web/WEB-INF/bundledModules/webservices.rest-2.32.0.omod
12-Oct-2021 12:11:09 [INFO] Copying spa-omod-1.0.8.jar to /home/bamboo-agent/bamboo-agent/xml-data/build-dir/REFAPP-UI-FRAMEWORK/package/target/bundled-distro/web/WEB-INF/bundledModules/spa-1.0.8.omod
12-Oct-2021 12:11:09 [INFO] Copying uicommons-omod-2.19.0.jar to /home/bamboo-agent/bamboo-agent/xml-data/build-dir/REFAPP-UI-FRAMEWORK/package/target/bundled-distro/web/WEB-INF/bundledModules/uicommons-2.19.0.omod
12-Oct-2021 12:11:09 [INFO] Copying uiframework-omod-3.22.0.jar to /home/bamboo-agent/bamboo-agent/xml-data/build-dir/REFAPP-UI-FRAMEWORK/package/target/bundled-distro/web/WEB-INF/bundledModules/uiframework-3.22.0.omod
12-Oct-2021 12:11:09 [INFO] Copying metadatasharing-omod-1.8.0.jar to /home/bamboo-agent/bamboo-agent/xml-data/build-dir/REFAPP-UI-FRAMEWORK/package/target/bundled-distro/web/WEB-INF/bundledModules/metadatasharing-1.8.0.omod
12-Oct-2021 12:11:09
12-Oct-2021 12:11:09 Downloading OWAs...
12-Oct-2021 12:11:09
12-Oct-2021 12:11:09
12-Oct-2021 12:11:09 Downloading OWA: org.openmrs.owa:openmrs-owa-sysadmin:1.2
12-Oct-2021 12:11:09 [INFO] Configured Artifact: org.openmrs.owa:sysadmin:1.2:zip
12-Oct-2021 12:11:09 [INFO] Copying sysadmin-1.2.zip to /home/bamboo-agent/bamboo-agent/xml-data/build-dir/REFAPP-UI-FRAMEWORK/package/target/bundled-distro/web/WEB-INF/bundledOwas/sysadmin-1.2.zip
12-Oct-2021 12:11:10
12-Oct-2021 12:11:10 Creating Docker Compose configuration...
12-Oct-2021 12:11:10
12-Oct-2021 12:11:11
12-Oct-2021 12:11:11 The 'referenceapplication' distribution created! To start up the server run 'docker-compose up' from /home/bamboo-agent/bamboo-agent/xml-data/build-dir/REFAPP-UI-FRAMEWORK/package/target/bundled-distro
12-Oct-2021 12:11:11
12-Oct-2021 12:11:11 [INFO]
12-Oct-2021 12:11:11 [INFO] --- maven-compiler-plugin:3.1:compile (default-compile) @ referenceapplication-package ---
12-Oct-2021 12:11:11 [INFO] No sources to compile
12-Oct-2021 12:11:11 [INFO]
12-Oct-2021 12:11:11 [INFO] --- maven-resources-plugin:2.6:testResources (default-testResources) @ referenceapplication-package ---
12-Oct-2021 12:11:11 [INFO] Using 'UTF-8' encoding to copy filtered resources.
12-Oct-2021 12:11:11 [INFO] skip non existing resourceDirectory /home/bamboo-agent/bamboo-agent/xml-data/build-dir/REFAPP-UI-FRAMEWORK/package/src/test/resources
12-Oct-2021 12:11:11 [INFO] skip non existing resourceDirectory /home/bamboo-agent/bamboo-agent/xml-data/build-dir/REFAPP-UI-FRAMEWORK/package/src/test/resources
12-Oct-2021 12:11:11 [INFO]
12-Oct-2021 12:11:11 [INFO] --- maven-compiler-plugin:3.1:testCompile (default-testCompile) @ referenceapplication-package ---
12-Oct-2021 12:11:11 [INFO] No sources to compile
12-Oct-2021 12:11:11 [INFO]
12-Oct-2021 12:11:11 [INFO] --- maven-surefire-plugin:2.12:test (default-test) @ referenceapplication-package ---
12-Oct-2021 12:11:12 [INFO] No tests to run.
12-Oct-2021 12:11:12 [INFO] Surefire report directory: /home/bamboo-agent/bamboo-agent/xml-data/build-dir/REFAPP-UI-FRAMEWORK/package/target/surefire-reports
12-Oct-2021 12:11:12
12-Oct-2021 12:11:12 -------------------------------------------------------
12-Oct-2021 12:11:12 T E S T S
12-Oct-2021 12:11:12 -------------------------------------------------------
12-Oct-2021 12:11:17
12-Oct-2021 12:11:17 Results :
12-Oct-2021 12:11:17
12-Oct-2021 12:11:17 Tests run: 0, Failures: 0, Errors: 0, Skipped: 0
12-Oct-2021 12:11:17
12-Oct-2021 12:11:17 [INFO]
12-Oct-2021 12:11:17 [INFO] --- maven-jar-plugin:2.4:jar (default-jar) @ referenceapplication-package ---
12-Oct-2021 12:11:17 [INFO] Building jar: /home/bamboo-agent/bamboo-agent/xml-data/build-dir/REFAPP-UI-FRAMEWORK/package/target/referenceapplication-package-2.12.0-SNAPSHOT.jar
12-Oct-2021 12:11:17 [INFO]
12-Oct-2021 12:11:17 [INFO] --- maven-assembly-plugin:2.3:single (make-assembly) @ referenceapplication-package ---
12-Oct-2021 12:11:18 [INFO] Reading assembly descriptor: /home/bamboo-agent/bamboo-agent/xml-data/build-dir/REFAPP-UI-FRAMEWORK/package/src/main/assembly/assembly.xml
12-Oct-2021 12:11:18 [INFO] Building zip: /home/bamboo-agent/bamboo-agent/xml-data/build-dir/REFAPP-UI-FRAMEWORK/package/target/referenceapplication-package-2.12.0-SNAPSHOT-addons.zip
12-Oct-2021 12:11:22 [INFO]
12-Oct-2021 12:11:22 [INFO] --- build-helper-maven-plugin:3.0.0:attach-artifact (attach-artifacts) @ referenceapplication-package ---
12-Oct-2021 12:11:23 [INFO]
12-Oct-2021 12:11:23 [INFO] --- maven-jar-plugin:2.4:test-jar (default) @ referenceapplication-package ---
12-Oct-2021 12:11:23 [WARNING] JAR will be empty - no content was marked for inclusion!
12-Oct-2021 12:11:23 [INFO] Building jar: /home/bamboo-agent/bamboo-agent/xml-data/build-dir/REFAPP-UI-FRAMEWORK/package/target/referenceapplication-package-2.12.0-SNAPSHOT-tests.jar
12-Oct-2021 12:11:23 [INFO]
12-Oct-2021 12:11:23 [INFO] --- maven-install-plugin:2.4:install (default-install) @ referenceapplication-package ---
12-Oct-2021 12:11:23 [INFO] Installing /home/bamboo-agent/bamboo-agent/xml-data/build-dir/REFAPP-UI-FRAMEWORK/package/target/referenceapplication-package-2.12.0-SNAPSHOT.jar to /home/bamboo-agent/.m2/repository/org/openmrs/distro/referenceapplication-package/2.12.0-SNAPSHOT/referenceapplication-package-2.12.0-SNAPSHOT.jar
12-Oct-2021 12:11:23 [INFO] Installing /home/bamboo-agent/bamboo-agent/xml-data/build-dir/REFAPP-UI-FRAMEWORK/package/pom.xml to /home/bamboo-agent/.m2/repository/org/openmrs/distro/referenceapplication-package/2.12.0-SNAPSHOT/referenceapplication-package-2.12.0-SNAPSHOT.pom
12-Oct-2021 12:11:23 [INFO] Installing /home/bamboo-agent/bamboo-agent/xml-data/build-dir/REFAPP-UI-FRAMEWORK/package/target/referenceapplication-package-2.12.0-SNAPSHOT-addons.zip to /home/bamboo-agent/.m2/repository/org/openmrs/distro/referenceapplication-package/2.12.0-SNAPSHOT/referenceapplication-package-2.12.0-SNAPSHOT-addons.zip
12-Oct-2021 12:11:24 [INFO] Installing /home/bamboo-agent/bamboo-agent/xml-data/build-dir/REFAPP-UI-FRAMEWORK/package/target/bundled-distro/web/openmrs.war to /home/bamboo-agent/.m2/repository/org/openmrs/distro/referenceapplication-package/2.12.0-SNAPSHOT/referenceapplication-package-2.12.0-SNAPSHOT.war
12-Oct-2021 12:11:24 [INFO] Installing /home/bamboo-agent/bamboo-agent/xml-data/build-dir/REFAPP-UI-FRAMEWORK/package/target/referenceapplication-package-2.12.0-SNAPSHOT-tests.jar to /home/bamboo-agent/.m2/repository/org/openmrs/distro/referenceapplication-package/2.12.0-SNAPSHOT/referenceapplication-package-2.12.0-SNAPSHOT-tests.jar
12-Oct-2021 12:11:24 [INFO]                                                                         
12-Oct-2021 12:11:24 [INFO] ------------------------------------------------------------------------
12-Oct-2021 12:11:24 [INFO] Building Reference Application Distribution UI Tests 2.12.0-SNAPSHOT
12-Oct-2021 12:11:24 [INFO] ------------------------------------------------------------------------
12-Oct-2021 12:11:25 [INFO]
12-Oct-2021 12:11:25 [INFO] --- maven-clean-plugin:2.5:clean (default-clean) @ referenceapplication-ui-tests ---
12-Oct-2021 12:11:25 [INFO]
12-Oct-2021 12:11:25 [INFO] --- maven-resources-plugin:2.6:resources (default-resources) @ referenceapplication-ui-tests ---
12-Oct-2021 12:11:25 [INFO] Using 'UTF-8' encoding to copy filtered resources.
12-Oct-2021 12:11:25 [INFO] skip non existing resourceDirectory /home/bamboo-agent/bamboo-agent/xml-data/build-dir/REFAPP-UI-FRAMEWORK/ui-tests/src/main/resources
12-Oct-2021 12:11:25 [INFO]
12-Oct-2021 12:11:25 [INFO] --- maven-compiler-plugin:3.1:compile (default-compile) @ referenceapplication-ui-tests ---
12-Oct-2021 12:11:25 [INFO] No sources to compile
12-Oct-2021 12:11:25 [INFO]
12-Oct-2021 12:11:25 [INFO] --- maven-resources-plugin:2.6:testResources (default-testResources) @ referenceapplication-ui-tests ---
12-Oct-2021 12:11:25 [INFO] Using 'UTF-8' encoding to copy filtered resources.
12-Oct-2021 12:11:25 [INFO] Copying 2 resources
12-Oct-2021 12:11:25 [INFO] Copying 2 resources
12-Oct-2021 12:11:25 [INFO]
12-Oct-2021 12:11:25 [INFO] --- maven-compiler-plugin:3.1:testCompile (default-testCompile) @ referenceapplication-ui-tests ---
12-Oct-2021 12:11:25 [INFO] Changes detected - recompiling the module!
12-Oct-2021 12:11:25 [INFO] Compiling 120 source files to /home/bamboo-agent/bamboo-agent/xml-data/build-dir/REFAPP-UI-FRAMEWORK/ui-tests/target/test-classes
12-Oct-2021 12:11:28 [WARNING] /home/bamboo-agent/bamboo-agent/xml-data/build-dir/REFAPP-UI-FRAMEWORK/ui-tests/src/test/java/org/openmrs/reference/AddDeleteLocationTest.java: Some input files use or override a deprecated API.
12-Oct-2021 12:11:28 [WARNING] /home/bamboo-agent/bamboo-agent/xml-data/build-dir/REFAPP-UI-FRAMEWORK/ui-tests/src/test/java/org/openmrs/reference/AddDeleteLocationTest.java: Recompile with -Xlint:deprecation for details.
12-Oct-2021 12:11:28 [WARNING] /home/bamboo-agent/bamboo-agent/xml-data/build-dir/REFAPP-UI-FRAMEWORK/ui-tests/src/test/java/org/openmrs/reference/AddRolesToUserTest.java: /home/bamboo-agent/bamboo-agent/xml-data/build-dir/REFAPP-UI-FRAMEWORK/ui-tests/src/test/java/org/openmrs/reference/AddRolesToUserTest.java uses unchecked or unsafe operations.
12-Oct-2021 12:11:28 [WARNING] /home/bamboo-agent/bamboo-agent/xml-data/build-dir/REFAPP-UI-FRAMEWORK/ui-tests/src/test/java/org/openmrs/reference/AddRolesToUserTest.java: Recompile with -Xlint:unchecked for details.
12-Oct-2021 12:11:28 [INFO]
12-Oct-2021 12:11:28 [INFO] --- maven-antrun-plugin:1.8:run (make-mac-chromedriver-executable) @ referenceapplication-ui-tests ---
12-Oct-2021 12:11:28 [INFO] Executing tasks
12-Oct-2021 12:11:28
12-Oct-2021 12:11:28 main:
12-Oct-2021 12:11:28 [INFO] An Ant BuildException has occured: /home/bamboo-agent/bamboo-agent/xml-data/build-dir/REFAPP-UI-FRAMEWORK/ui-tests/target/test-classes/chromedriver/mac does not exist.
12-Oct-2021 12:11:28 around Ant part ...<chmod file="target/test-classes/chromedriver/mac/chromedriver" perm="755"/>... @ 4:79 in /home/bamboo-agent/bamboo-agent/xml-data/build-dir/REFAPP-UI-FRAMEWORK/ui-tests/target/antrun/build-main.xml
12-Oct-2021 12:11:28 /home/bamboo-agent/bamboo-agent/xml-data/build-dir/REFAPP-UI-FRAMEWORK/ui-tests/target/antrun/build-main.xml:4: /home/bamboo-agent/bamboo-agent/xml-data/build-dir/REFAPP-UI-FRAMEWORK/ui-tests/target/test-classes/chromedriver/mac does not exist.
12-Oct-2021 12:11:28         at org.apache.tools.ant.types.AbstractFileSet.getDirectoryScanner(AbstractFileSet.java:484)
12-Oct-2021 12:11:28         at org.apache.tools.ant.taskdefs.ExecuteOn.runExec(ExecuteOn.java:369)
12-Oct-2021 12:11:28         at org.apache.tools.ant.taskdefs.ExecTask.execute(ExecTask.java:495)
12-Oct-2021 12:11:28         at org.apache.tools.ant.taskdefs.Chmod.execute(Chmod.java:181)
12-Oct-2021 12:11:28         at org.apache.tools.ant.UnknownElement.execute(UnknownElement.java:292)
12-Oct-2021 12:11:28         at sun.reflect.NativeMethodAccessorImpl.invoke0(Native Method)
12-Oct-2021 12:11:28         at sun.reflect.NativeMethodAccessorImpl.invoke(NativeMethodAccessorImpl.java:62)
12-Oct-2021 12:11:28         at sun.reflect.DelegatingMethodAccessorImpl.invoke(DelegatingMethodAccessorImpl.java:43)
12-Oct-2021 12:11:28         at java.lang.reflect.Method.invoke(Method.java:498)
12-Oct-2021 12:11:28         at org.apache.tools.ant.dispatch.DispatchUtils.execute(DispatchUtils.java:106)
12-Oct-2021 12:11:28         at org.apache.tools.ant.Task.perform(Task.java:348)
12-Oct-2021 12:11:28         at org.apache.tools.ant.Target.execute(Target.java:435)
12-Oct-2021 12:11:28         at org.apache.tools.ant.Target.performTasks(Target.java:456)
12-Oct-2021 12:11:28         at org.apache.tools.ant.Project.executeSortedTargets(Project.java:1393)
12-Oct-2021 12:11:28         at org.apache.tools.ant.Project.executeTarget(Project.java:1364)
12-Oct-2021 12:11:28         at org.apache.maven.plugin.antrun.AntRunMojo.execute(AntRunMojo.java:313)
12-Oct-2021 12:11:28         at org.apache.maven.plugin.DefaultBuildPluginManager.executeMojo(DefaultBuildPluginManager.java:134)
12-Oct-2021 12:11:28         at org.apache.maven.lifecycle.internal.MojoExecutor.execute(MojoExecutor.java:207)
12-Oct-2021 12:11:28         at org.apache.maven.lifecycle.internal.MojoExecutor.execute(MojoExecutor.java:153)
12-Oct-2021 12:11:28         at org.apache.maven.lifecycle.internal.MojoExecutor.execute(MojoExecutor.java:145)
12-Oct-2021 12:11:28         at org.apache.maven.lifecycle.internal.LifecycleModuleBuilder.buildProject(LifecycleModuleBuilder.java:116)
12-Oct-2021 12:11:28         at org.apache.maven.lifecycle.internal.LifecycleModuleBuilder.buildProject(LifecycleModuleBuilder.java:80)
12-Oct-2021 12:11:28         at org.apache.maven.lifecycle.internal.builder.singlethreaded.SingleThreadedBuilder.build(SingleThreadedBuilder.java:51)
12-Oct-2021 12:11:28         at org.apache.maven.lifecycle.internal.LifecycleStarter.execute(LifecycleStarter.java:128)
12-Oct-2021 12:11:28         at org.apache.maven.DefaultMaven.doExecute(DefaultMaven.java:307)
12-Oct-2021 12:11:28         at org.apache.maven.DefaultMaven.doExecute(DefaultMaven.java:193)
12-Oct-2021 12:11:28         at org.apache.maven.DefaultMaven.execute(DefaultMaven.java:106)
12-Oct-2021 12:11:28         at org.apache.maven.cli.MavenCli.execute(MavenCli.java:863)
12-Oct-2021 12:11:28         at org.apache.maven.cli.MavenCli.doMain(MavenCli.java:288)
12-Oct-2021 12:11:28         at org.apache.maven.cli.MavenCli.main(MavenCli.java:199)
12-Oct-2021 12:11:28         at sun.reflect.NativeMethodAccessorImpl.invoke0(Native Method)
12-Oct-2021 12:11:28         at sun.reflect.NativeMethodAccessorImpl.invoke(NativeMethodAccessorImpl.java:62)
12-Oct-2021 12:11:28         at sun.reflect.DelegatingMethodAccessorImpl.invoke(DelegatingMethodAccessorImpl.java:43)
12-Oct-2021 12:11:28         at java.lang.reflect.Method.invoke(Method.java:498)
12-Oct-2021 12:11:28         at org.codehaus.plexus.classworlds.launcher.Launcher.launchEnhanced(Launcher.java:289)
12-Oct-2021 12:11:28         at org.codehaus.plexus.classworlds.launcher.Launcher.launch(Launcher.java:229)
12-Oct-2021 12:11:28         at org.codehaus.plexus.classworlds.launcher.Launcher.mainWithExitCode(Launcher.java:415)
12-Oct-2021 12:11:28         at org.codehaus.plexus.classworlds.launcher.Launcher.main(Launcher.java:356)
12-Oct-2021 12:11:28 [INFO]
12-Oct-2021 12:11:28 [INFO] --- maven-antrun-plugin:1.8:run (make-linux-chromedriver-executable) @ referenceapplication-ui-tests ---
12-Oct-2021 12:11:29 [INFO] Executing tasks
12-Oct-2021 12:11:29
12-Oct-2021 12:11:29 main:
12-Oct-2021 12:11:29 [INFO] Executed tasks
12-Oct-2021 12:11:29 [INFO]
12-Oct-2021 12:11:29 [INFO] --- maven-antrun-plugin:1.8:run (make-mac-firefoxdriver-executable) @ referenceapplication-ui-tests ---
12-Oct-2021 12:11:29 [INFO] Executing tasks
12-Oct-2021 12:11:29
12-Oct-2021 12:11:29 main:
12-Oct-2021 12:11:29 [INFO] An Ant BuildException has occured: /home/bamboo-agent/bamboo-agent/xml-data/build-dir/REFAPP-UI-FRAMEWORK/ui-tests/target/test-classes/firefoxdriver/mac does not exist.
12-Oct-2021 12:11:29 around Ant part ...<chmod file="target/test-classes/firefoxdriver/mac/geckodriver" perm="755"/>... @ 4:79 in /home/bamboo-agent/bamboo-agent/xml-data/build-dir/REFAPP-UI-FRAMEWORK/ui-tests/target/antrun/build-main.xml
12-Oct-2021 12:11:29 /home/bamboo-agent/bamboo-agent/xml-data/build-dir/REFAPP-UI-FRAMEWORK/ui-tests/target/antrun/build-main.xml:4: /home/bamboo-agent/bamboo-agent/xml-data/build-dir/REFAPP-UI-FRAMEWORK/ui-tests/target/test-classes/firefoxdriver/mac does not exist.
12-Oct-2021 12:11:29         at org.apache.tools.ant.types.AbstractFileSet.getDirectoryScanner(AbstractFileSet.java:484)
12-Oct-2021 12:11:29         at org.apache.tools.ant.taskdefs.ExecuteOn.runExec(ExecuteOn.java:369)
12-Oct-2021 12:11:29         at org.apache.tools.ant.taskdefs.ExecTask.execute(ExecTask.java:495)
12-Oct-2021 12:11:29         at org.apache.tools.ant.taskdefs.Chmod.execute(Chmod.java:181)
12-Oct-2021 12:11:29         at org.apache.tools.ant.UnknownElement.execute(UnknownElement.java:292)
12-Oct-2021 12:11:29         at sun.reflect.NativeMethodAccessorImpl.invoke0(Native Method)
12-Oct-2021 12:11:29         at sun.reflect.NativeMethodAccessorImpl.invoke(NativeMethodAccessorImpl.java:62)
12-Oct-2021 12:11:29         at sun.reflect.DelegatingMethodAccessorImpl.invoke(DelegatingMethodAccessorImpl.java:43)
12-Oct-2021 12:11:29         at java.lang.reflect.Method.invoke(Method.java:498)
12-Oct-2021 12:11:29         at org.apache.tools.ant.dispatch.DispatchUtils.execute(DispatchUtils.java:106)
12-Oct-2021 12:11:29         at org.apache.tools.ant.Task.perform(Task.java:348)
12-Oct-2021 12:11:29         at org.apache.tools.ant.Target.execute(Target.java:435)
12-Oct-2021 12:11:29         at org.apache.tools.ant.Target.performTasks(Target.java:456)
12-Oct-2021 12:11:29         at org.apache.tools.ant.Project.executeSortedTargets(Project.java:1393)
12-Oct-2021 12:11:29         at org.apache.tools.ant.Project.executeTarget(Project.java:1364)
12-Oct-2021 12:11:29         at org.apache.maven.plugin.antrun.AntRunMojo.execute(AntRunMojo.java:313)
12-Oct-2021 12:11:29         at org.apache.maven.plugin.DefaultBuildPluginManager.executeMojo(DefaultBuildPluginManager.java:134)
12-Oct-2021 12:11:29         at org.apache.maven.lifecycle.internal.MojoExecutor.execute(MojoExecutor.java:207)
12-Oct-2021 12:11:29         at org.apache.maven.lifecycle.internal.MojoExecutor.execute(MojoExecutor.java:153)
12-Oct-2021 12:11:29         at org.apache.maven.lifecycle.internal.MojoExecutor.execute(MojoExecutor.java:145)
12-Oct-2021 12:11:29         at org.apache.maven.lifecycle.internal.LifecycleModuleBuilder.buildProject(LifecycleModuleBuilder.java:116)
12-Oct-2021 12:11:29         at org.apache.maven.lifecycle.internal.LifecycleModuleBuilder.buildProject(LifecycleModuleBuilder.java:80)
12-Oct-2021 12:11:29         at org.apache.maven.lifecycle.internal.builder.singlethreaded.SingleThreadedBuilder.build(SingleThreadedBuilder.java:51)
12-Oct-2021 12:11:29         at org.apache.maven.lifecycle.internal.LifecycleStarter.execute(LifecycleStarter.java:128)
12-Oct-2021 12:11:29         at org.apache.maven.DefaultMaven.doExecute(DefaultMaven.java:307)
12-Oct-2021 12:11:29         at org.apache.maven.DefaultMaven.doExecute(DefaultMaven.java:193)
12-Oct-2021 12:11:29         at org.apache.maven.DefaultMaven.execute(DefaultMaven.java:106)
12-Oct-2021 12:11:29         at org.apache.maven.cli.MavenCli.execute(MavenCli.java:863)
12-Oct-2021 12:11:29         at org.apache.maven.cli.MavenCli.doMain(MavenCli.java:288)
12-Oct-2021 12:11:29         at org.apache.maven.cli.MavenCli.main(MavenCli.java:199)
12-Oct-2021 12:11:29         at sun.reflect.NativeMethodAccessorImpl.invoke0(Native Method)
12-Oct-2021 12:11:29         at sun.reflect.NativeMethodAccessorImpl.invoke(NativeMethodAccessorImpl.java:62)
12-Oct-2021 12:11:29         at sun.reflect.DelegatingMethodAccessorImpl.invoke(DelegatingMethodAccessorImpl.java:43)
12-Oct-2021 12:11:29         at java.lang.reflect.Method.invoke(Method.java:498)
12-Oct-2021 12:11:29         at org.codehaus.plexus.classworlds.launcher.Launcher.launchEnhanced(Launcher.java:289)
12-Oct-2021 12:11:29         at org.codehaus.plexus.classworlds.launcher.Launcher.launch(Launcher.java:229)
12-Oct-2021 12:11:29         at org.codehaus.plexus.classworlds.launcher.Launcher.mainWithExitCode(Launcher.java:415)
12-Oct-2021 12:11:29         at org.codehaus.plexus.classworlds.launcher.Launcher.main(Launcher.java:356)
12-Oct-2021 12:11:29 [INFO]
12-Oct-2021 12:11:29 [INFO] --- maven-antrun-plugin:1.8:run (make-linux-firefoxdriver-executable) @ referenceapplication-ui-tests ---
12-Oct-2021 12:11:29 [INFO] Executing tasks
12-Oct-2021 12:11:29
12-Oct-2021 12:11:29 main:
12-Oct-2021 12:11:29 [INFO] Executed tasks
12-Oct-2021 12:11:29 [INFO]
12-Oct-2021 12:11:29 [INFO] --- maven-surefire-plugin:2.12:test (default-test) @ referenceapplication-ui-tests ---
12-Oct-2021 12:11:29 [INFO] Surefire report directory: /home/bamboo-agent/bamboo-agent/xml-data/build-dir/REFAPP-UI-FRAMEWORK/ui-tests/target/surefire-reports
12-Oct-2021 12:11:29
12-Oct-2021 12:11:29 -------------------------------------------------------
12-Oct-2021 12:11:29 T E S T S
12-Oct-2021 12:11:29 -------------------------------------------------------
12-Oct-2021 12:11:29 Running org.openmrs.reference.UnidentifiedPatientKeyboardTest
12-Oct-2021 12:11:29 Running locally...
12-Oct-2021 12:11:35 Starting ChromeDriver 90.0.4430.24 (4c6d850f087da467d926e8eddb76550aed655991-refs/branch-heads/4430@{#429}) on port 8121
12-Oct-2021 12:11:35 Only local connections are allowed.
12-Oct-2021 12:11:35 Please see https://chromedriver.chromium.org/security-considerations for suggestions on keeping ChromeDriver safe.
12-Oct-2021 12:11:35 ChromeDriver was started successfully.
12-Oct-2021 12:11:50 Oct 12, 2021 12:11:50 PM org.openqa.selenium.remote.ProtocolHandshake createSession
12-Oct-2021 12:11:50 INFO: Detected dialect: W3C
12-Oct-2021 12:12:07 Tests run: 1, Failures: 0, Errors: 0, Skipped: 0, Time elapsed: 37.938 sec
12-Oct-2021 12:12:07 Running org.openmrs.reference.DeleteAllergyTest
12-Oct-2021 12:12:07 Running locally...
12-Oct-2021 12:12:07 Starting ChromeDriver 90.0.4430.24 (4c6d850f087da467d926e8eddb76550aed655991-refs/branch-heads/4430@{#429}) on port 19666
12-Oct-2021 12:12:07 Only local connections are allowed.
12-Oct-2021 12:12:07 Please see https://chromedriver.chromium.org/security-considerations for suggestions on keeping ChromeDriver safe.
12-Oct-2021 12:12:07 ChromeDriver was started successfully.
12-Oct-2021 12:12:08 Oct 12, 2021 12:12:08 PM org.openqa.selenium.remote.ProtocolHandshake createSession
12-Oct-2021 12:12:08 INFO: Detected dialect: W3C
12-Oct-2021 12:12:22 Tests run: 1, Failures: 0, Errors: 0, Skipped: 0, Time elapsed: 14.583 sec
12-Oct-2021 12:12:22 Running org.openmrs.reference.SearchActiveVisitsTest
12-Oct-2021 12:12:22 Running locally...
12-Oct-2021 12:12:22 Starting ChromeDriver 90.0.4430.24 (4c6d850f087da467d926e8eddb76550aed655991-refs/branch-heads/4430@{#429}) on port 29653
12-Oct-2021 12:12:22 Only local connections are allowed.
12-Oct-2021 12:12:22 Please see https://chromedriver.chromium.org/security-considerations for suggestions on keeping ChromeDriver safe.
12-Oct-2021 12:12:22 ChromeDriver was started successfully.
12-Oct-2021 12:12:22 Oct 12, 2021 12:12:22 PM org.openqa.selenium.remote.ProtocolHandshake createSession
12-Oct-2021 12:12:22 INFO: Detected dialect: W3C
12-Oct-2021 12:12:28 Tests run: 1, Failures: 0, Errors: 0, Skipped: 0, Time elapsed: 6.343 sec
12-Oct-2021 12:12:28 Running org.openmrs.reference.AddVisitTypeTest
12-Oct-2021 12:12:28 Running locally...
12-Oct-2021 12:12:28 Starting ChromeDriver 90.0.4430.24 (4c6d850f087da467d926e8eddb76550aed655991-refs/branch-heads/4430@{#429}) on port 19879
12-Oct-2021 12:12:28 Only local connections are allowed.
12-Oct-2021 12:12:28 Please see https://chromedriver.chromium.org/security-considerations for suggestions on keeping ChromeDriver safe.
12-Oct-2021 12:12:28 ChromeDriver was started successfully.
12-Oct-2021 12:12:29 Oct 12, 2021 12:12:29 PM org.openqa.selenium.remote.ProtocolHandshake createSession
12-Oct-2021 12:12:29 INFO: Detected dialect: W3C
12-Oct-2021 12:12:45 Tests run: 1, Failures: 0, Errors: 0, Skipped: 0, Time elapsed: 17.164 sec
12-Oct-2021 12:12:45 Running org.openmrs.reference.FindPatientRecordTest
12-Oct-2021 12:12:45 Running locally...
12-Oct-2021 12:12:45 Starting ChromeDriver 90.0.4430.24 (4c6d850f087da467d926e8eddb76550aed655991-refs/branch-heads/4430@{#429}) on port 6259
12-Oct-2021 12:12:45 Only local connections are allowed.
12-Oct-2021 12:12:45 Please see https://chromedriver.chromium.org/security-considerations for suggestions on keeping ChromeDriver safe.
12-Oct-2021 12:12:45 ChromeDriver was started successfully.
12-Oct-2021 12:12:46 Oct 12, 2021 12:12:46 PM org.openqa.selenium.remote.ProtocolHandshake createSession
12-Oct-2021 12:12:46 INFO: Detected dialect: W3C
12-Oct-2021 12:12:51 Tests run: 1, Failures: 0, Errors: 0, Skipped: 0, Time elapsed: 5.659 sec
12-Oct-2021 12:12:51 Running org.openmrs.reference.EditPersonTest
12-Oct-2021 12:12:51 Running locally...
12-Oct-2021 12:12:51 Starting ChromeDriver 90.0.4430.24 (4c6d850f087da467d926e8eddb76550aed655991-refs/branch-heads/4430@{#429}) on port 9303
12-Oct-2021 12:12:51 Only local connections are allowed.
12-Oct-2021 12:12:51 Please see https://chromedriver.chromium.org/security-considerations for suggestions on keeping ChromeDriver safe.
12-Oct-2021 12:12:51 ChromeDriver was started successfully.
12-Oct-2021 12:12:52 Oct 12, 2021 12:12:52 PM org.openqa.selenium.remote.ProtocolHandshake createSession
12-Oct-2021 12:12:52 INFO: Detected dialect: W3C
12-Oct-2021 12:13:06 Tests run: 1, Failures: 0, Errors: 0, Skipped: 0, Time elapsed: 15.096 sec
12-Oct-2021 12:13:06 Running org.openmrs.reference.RetireLocationTest
12-Oct-2021 12:13:06 Running locally...
12-Oct-2021 12:13:06 Starting ChromeDriver 90.0.4430.24 (4c6d850f087da467d926e8eddb76550aed655991-refs/branch-heads/4430@{#429}) on port 24668
12-Oct-2021 12:13:06 Only local connections are allowed.
12-Oct-2021 12:13:06 Please see https://chromedriver.chromium.org/security-considerations for suggestions on keeping ChromeDriver safe.
12-Oct-2021 12:13:06 ChromeDriver was started successfully.
12-Oct-2021 12:13:07 Oct 12, 2021 12:13:07 PM org.openqa.selenium.remote.ProtocolHandshake createSession
12-Oct-2021 12:13:07 INFO: Detected dialect: W3C
12-Oct-2021 12:13:10 Tests run: 1, Failures: 0, Errors: 0, Skipped: 0, Time elapsed: 3.922 sec
12-Oct-2021 12:13:10 Running org.openmrs.reference.XSSOnPhoneNumberFieldTest
12-Oct-2021 12:13:10 Running locally...
12-Oct-2021 12:13:10 Starting ChromeDriver 90.0.4430.24 (4c6d850f087da467d926e8eddb76550aed655991-refs/branch-heads/4430@{#429}) on port 6073
12-Oct-2021 12:13:10 Only local connections are allowed.
12-Oct-2021 12:13:10 Please see https://chromedriver.chromium.org/security-considerations for suggestions on keeping ChromeDriver safe.
12-Oct-2021 12:13:10 ChromeDriver was started successfully.
12-Oct-2021 12:13:10 Oct 12, 2021 12:13:10 PM org.openqa.selenium.remote.ProtocolHandshake createSession
12-Oct-2021 12:13:10 INFO: Detected dialect: W3C
12-Oct-2021 12:13:22 Tests run: 1, Failures: 0, Errors: 0, Skipped: 0, Time elapsed: 12.362 sec
12-Oct-2021 12:13:22 Running org.openmrs.reference.TransferToWardServiceTest
12-Oct-2021 12:13:22 Running locally...
12-Oct-2021 12:13:23 Starting ChromeDriver 90.0.4430.24 (4c6d850f087da467d926e8eddb76550aed655991-refs/branch-heads/4430@{#429}) on port 17128
12-Oct-2021 12:13:23 Only local connections are allowed.
12-Oct-2021 12:13:23 Please see https://chromedriver.chromium.org/security-considerations for suggestions on keeping ChromeDriver safe.
12-Oct-2021 12:13:23 ChromeDriver was started successfully.
12-Oct-2021 12:13:23 Oct 12, 2021 12:13:23 PM org.openqa.selenium.remote.ProtocolHandshake createSession
12-Oct-2021 12:13:23 INFO: Detected dialect: W3C
12-Oct-2021 12:15:30 Tests run: 3, Failures: 0, Errors: 3, Skipped: 0, Time elapsed: 127.395 sec <<< FAILURE!
12-Oct-2021 12:15:30 Running org.openmrs.reference.EditVisitTypeTest
12-Oct-2021 12:15:30 Running locally...
12-Oct-2021 12:15:30 Starting ChromeDriver 90.0.4430.24 (4c6d850f087da467d926e8eddb76550aed655991-refs/branch-heads/4430@{#429}) on port 5964
12-Oct-2021 12:15:30 Only local connections are allowed.
12-Oct-2021 12:15:30 Please see https://chromedriver.chromium.org/security-considerations for suggestions on keeping ChromeDriver safe.
12-Oct-2021 12:15:30 ChromeDriver was started successfully.
12-Oct-2021 12:15:30 Oct 12, 2021 12:15:30 PM org.openqa.selenium.remote.ProtocolHandshake createSession
12-Oct-2021 12:15:30 INFO: Detected dialect: W3C
12-Oct-2021 12:17:31 Failed to login in EditVisitTypeTest.editVisitTypeTest, trying again...
12-Oct-2021 12:18:46 Test killed due to server failure in EditVisitTypeTest.editVisitTypeTest
12-Oct-2021 12:18:46 org.openmrs.uitestframework.page.exception.PageRejectedException: Page url https://qa-refapp.openmrs.org/openmrs/index.htm?lang= contains 'index.htm', which is not allowed
12-Oct-2021 12:18:46         at org.openmrs.uitestframework.page.Page.waitForPage(Page.java:124)
12-Oct-2021 12:18:46         at org.openmrs.uitestframework.test.TestBase.goToLoginPage(TestBase.java:249)
12-Oct-2021 12:18:46         at org.openmrs.uitestframework.test.TestBase.login(TestBase.java:231)
12-Oct-2021 12:18:46         at org.openmrs.uitestframework.test.TestBase.launchBrowser(TestBase.java:191)
12-Oct-2021 12:18:46         at org.openmrs.uitestframework.test.TestBase.startWebDriver(TestBase.java:130)
12-Oct-2021 12:18:46         at sun.reflect.NativeMethodAccessorImpl.invoke0(Native Method)
12-Oct-2021 12:18:46         at sun.reflect.NativeMethodAccessorImpl.invoke(NativeMethodAccessorImpl.java:62)
12-Oct-2021 12:18:46         at sun.reflect.DelegatingMethodAccessorImpl.invoke(DelegatingMethodAccessorImpl.java:43)
12-Oct-2021 12:18:46         at java.lang.reflect.Method.invoke(Method.java:498)
12-Oct-2021 12:18:46         at org.junit.runners.model.FrameworkMethod$1.runReflectiveCall(FrameworkMethod.java:59)
12-Oct-2021 12:18:46         at org.junit.internal.runners.model.ReflectiveCallable.run(ReflectiveCallable.java:12)
12-Oct-2021 12:18:46         at org.junit.runners.model.FrameworkMethod.invokeExplosively(FrameworkMethod.java:56)
12-Oct-2021 12:18:46         at org.junit.internal.runners.statements.RunBefores.invokeMethod(RunBefores.java:33)
12-Oct-2021 12:18:46         at org.junit.internal.runners.statements.RunBefores.evaluate(RunBefores.java:24)
12-Oct-2021 12:18:46         at org.junit.internal.runners.statements.RunAfters.evaluate(RunAfters.java:27)
12-Oct-2021 12:18:46         at org.junit.rules.TestWatcher$1.evaluate(TestWatcher.java:61)
12-Oct-2021 12:18:46         at org.junit.rules.TestWatcher$1.evaluate(TestWatcher.java:61)
12-Oct-2021 12:18:46         at org.junit.runners.ParentRunner$3.evaluate(ParentRunner.java:306)
12-Oct-2021 12:18:46         at org.junit.runners.BlockJUnit4ClassRunner$1.evaluate(BlockJUnit4ClassRunner.java:100)
12-Oct-2021 12:18:46         at org.junit.runners.ParentRunner.runLeaf(ParentRunner.java:366)
12-Oct-2021 12:18:46         at org.junit.runners.BlockJUnit4ClassRunner.runChild(BlockJUnit4ClassRunner.java:103)
12-Oct-2021 12:18:46         at org.junit.runners.BlockJUnit4ClassRunner.runChild(BlockJUnit4ClassRunner.java:63)
12-Oct-2021 12:18:46         at org.junit.runners.ParentRunner$4.run(ParentRunner.java:331)
12-Oct-2021 12:18:46         at org.junit.runners.ParentRunner$1.schedule(ParentRunner.java:79)
12-Oct-2021 12:18:46         at org.junit.runners.ParentRunner.runChildren(ParentRunner.java:329)
12-Oct-2021 12:18:46         at org.junit.runners.ParentRunner.access$100(ParentRunner.java:66)
12-Oct-2021 12:18:46         at org.junit.runners.ParentRunner$2.evaluate(ParentRunner.java:293)
12-Oct-2021 12:18:46         at org.junit.runners.ParentRunner$3.evaluate(ParentRunner.java:306)
12-Oct-2021 12:18:46         at org.junit.runners.ParentRunner.run(ParentRunner.java:413)
12-Oct-2021 12:18:46         at org.apache.maven.surefire.junit4.JUnit4Provider.execute(JUnit4Provider.java:236)
12-Oct-2021 12:18:46         at org.apache.maven.surefire.junit4.JUnit4Provider.executeTestSet(JUnit4Provider.java:134)
12-Oct-2021 12:18:46         at org.apache.maven.surefire.junit4.JUnit4Provider.invoke(JUnit4Provider.java:113)
12-Oct-2021 12:18:46         at sun.reflect.NativeMethodAccessorImpl.invoke0(Native Method)
12-Oct-2021 12:18:46         at sun.reflect.NativeMethodAccessorImpl.invoke(NativeMethodAccessorImpl.java:62)
12-Oct-2021 12:18:46         at sun.reflect.DelegatingMethodAccessorImpl.invoke(DelegatingMethodAccessorImpl.java:43)
12-Oct-2021 12:18:46         at java.lang.reflect.Method.invoke(Method.java:498)
12-Oct-2021 12:18:46         at org.apache.maven.surefire.util.ReflectionUtils.invokeMethodWithArray(ReflectionUtils.java:189)
12-Oct-2021 12:18:46         at org.apache.maven.surefire.booter.ProviderFactory$ProviderProxy.invoke(ProviderFactory.java:165)
12-Oct-2021 12:18:46         at org.apache.maven.surefire.booter.ProviderFactory.invokeProvider(ProviderFactory.java:85)
12-Oct-2021 12:18:46         at org.apache.maven.surefire.booter.ForkedBooter.runSuitesInProcess(ForkedBooter.java:103)
12-Oct-2021 12:18:46         at org.apache.maven.surefire.booter.ForkedBooter.main(ForkedBooter.java:74)
12-Oct-2021 12:18:47 Tests run: 3, Failures: 1, Errors: 2, Skipped: 0, Time elapsed: 196.792 sec <<< FAILURE!
12-Oct-2021 12:18:47 Running org.openmrs.reference.ComeBackToApplicationAfterLogoutTest
12-Oct-2021 12:18:47 Tests run: 1, Failures: 1, Errors: 0, Skipped: 0, Time elapsed: 0.003 sec <<< FAILURE!
12-Oct-2021 12:18:47 Running org.openmrs.reference.EditDemographicTest
12-Oct-2021 12:18:47 Tests run: 1, Failures: 1, Errors: 0, Skipped: 0, Time elapsed: 0.001 sec <<< FAILURE!
12-Oct-2021 12:18:47 Running org.openmrs.reference.DeleteVisitTypeTest
12-Oct-2021 12:18:47 Tests run: 2, Failures: 1, Errors: 1, Skipped: 0, Time elapsed: 0.082 sec <<< FAILURE!
12-Oct-2021 12:18:47 Running org.openmrs.reference.FormTest
12-Oct-2021 12:18:47 Tests run: 8, Failures: 4, Errors: 4, Skipped: 0, Time elapsed: 0.045 sec <<< FAILURE!
12-Oct-2021 12:18:47 Running org.openmrs.reference.RegisterUnidentifiedPatientTest
12-Oct-2021 12:18:47 Tests run: 2, Failures: 1, Errors: 1, Skipped: 0, Time elapsed: 0.001 sec <<< FAILURE!
12-Oct-2021 12:18:47 Running org.openmrs.reference.AddPatientAppointmentTest
12-Oct-2021 12:18:47 Tests run: 1, Failures: 1, Errors: 0, Skipped: 0, Time elapsed: 0.001 sec <<< FAILURE!
12-Oct-2021 12:18:47 Running org.openmrs.reference.AdmitExitInpatientTest
12-Oct-2021 12:18:47 Tests run: 1, Failures: 1, Errors: 0, Skipped: 0, Time elapsed: 0.002 sec <<< FAILURE!
12-Oct-2021 12:18:47 Running org.openmrs.reference.DeleteRequestAppointmentTest
12-Oct-2021 12:18:47 Tests run: 1, Failures: 1, Errors: 0, Skipped: 0, Time elapsed: 0.004 sec <<< FAILURE!
12-Oct-2021 12:18:47 Running org.openmrs.reference.EditAllergyTest
12-Oct-2021 12:18:47 Tests run: 1, Failures: 1, Errors: 0, Skipped: 0, Time elapsed: 0.003 sec <<< FAILURE!
12-Oct-2021 12:18:47 Running org.openmrs.reference.VisitNoteTest
12-Oct-2021 12:18:47 Tests run: 1, Failures: 1, Errors: 0, Skipped: 0, Time elapsed: 0 sec <<< FAILURE!
12-Oct-2021 12:18:47 Running org.openmrs.reference.CreatePersonTest
12-Oct-2021 12:18:47 Tests run: 1, Failures: 1, Errors: 0, Skipped: 0, Time elapsed: 0 sec <<< FAILURE!
12-Oct-2021 12:18:47 Running org.openmrs.reference.FindPatientByNameTest
12-Oct-2021 12:18:47 Tests run: 2, Failures: 1, Errors: 1, Skipped: 0, Time elapsed: 0.001 sec <<< FAILURE!
12-Oct-2021 12:18:47 Running org.openmrs.reference.AddUserTest
12-Oct-2021 12:18:47 Tests run: 1, Failures: 1, Errors: 0, Skipped: 0, Time elapsed: 0 sec <<< FAILURE!
12-Oct-2021 12:18:47 Running org.openmrs.reference.AddProviderTest
12-Oct-2021 12:18:47 Tests run: 2, Failures: 1, Errors: 1, Skipped: 0, Time elapsed: 0.066 sec <<< FAILURE!
12-Oct-2021 12:18:47 Running org.openmrs.reference.AddPastVisitTest
12-Oct-2021 12:18:47 Tests run: 1, Failures: 1, Errors: 0, Skipped: 0, Time elapsed: 0.002 sec <<< FAILURE!
12-Oct-2021 12:18:47 Running org.openmrs.reference.RecordMergeIssueTest
12-Oct-2021 12:18:47 Tests run: 2, Failures: 1, Errors: 1, Skipped: 0, Time elapsed: 0.025 sec <<< FAILURE!
12-Oct-2021 12:18:47 Running org.openmrs.reference.CaptureVitalsTest
12-Oct-2021 12:18:47 Tests run: 1, Failures: 1, Errors: 0, Skipped: 0, Time elapsed: 0.006 sec <<< FAILURE!
12-Oct-2021 12:18:47 Running org.openmrs.reference.NamePatientAccentedLetterTest
12-Oct-2021 12:18:47 Tests run: 2, Failures: 1, Errors: 1, Skipped: 0, Time elapsed: 0.003 sec <<< FAILURE!
12-Oct-2021 12:18:47 Running org.openmrs.reference.RetirePersonTest
12-Oct-2021 12:18:47 Tests run: 2, Failures: 1, Errors: 1, Skipped: 0, Time elapsed: 0.078 sec <<< FAILURE!
12-Oct-2021 12:18:47 Running org.openmrs.reference.EndVisitTest
12-Oct-2021 12:18:47 Tests run: 1, Failures: 1, Errors: 0, Skipped: 0, Time elapsed: 0.001 sec <<< FAILURE!
12-Oct-2021 12:18:47 Running org.openmrs.reference.DeleteAppointmentBlockTest
12-Oct-2021 12:18:47 Tests run: 1, Failures: 1, Errors: 0, Skipped: 0, Time elapsed: 0.034 sec <<< FAILURE!
12-Oct-2021 12:18:47 Running org.openmrs.reference.BookRequestAppointmentTest
12-Oct-2021 12:18:47 Tests run: 1, Failures: 1, Errors: 0, Skipped: 0, Time elapsed: 0.001 sec <<< FAILURE!
12-Oct-2021 12:18:47 Running org.openmrs.reference.AddDeleteServiceTest
12-Oct-2021 12:18:47 Tests run: 1, Failures: 1, Errors: 0, Skipped: 0, Time elapsed: 0 sec <<< FAILURE!
12-Oct-2021 12:18:47 Running org.openmrs.reference.AddEditAppointmentBlockTest
12-Oct-2021 12:18:47 Tests run: 1, Failures: 1, Errors: 0, Skipped: 0, Time elapsed: 0.001 sec <<< FAILURE!
12-Oct-2021 12:18:47 Running org.openmrs.reference.RetireProviderTest
12-Oct-2021 12:18:47 Tests run: 2, Failures: 1, Errors: 1, Skipped: 0, Time elapsed: 0.061 sec <<< FAILURE!
12-Oct-2021 12:18:47 Running org.openmrs.reference.MergePatientTest
12-Oct-2021 12:18:47 Tests run: 1, Failures: 1, Errors: 0, Skipped: 0, Time elapsed: 0 sec <<< FAILURE!
12-Oct-2021 12:18:47 Running org.openmrs.reference.AddDeleteLocationTest
12-Oct-2021 12:18:47 Tests run: 2, Failures: 1, Errors: 1, Skipped: 0, Time elapsed: 0.089 sec <<< FAILURE!
12-Oct-2021 12:18:47 Running org.openmrs.reference.DuplicatePatientRegisterTest
12-Oct-2021 12:18:47 Tests run: 2, Failures: 1, Errors: 1, Skipped: 0, Time elapsed: 0.009 sec <<< FAILURE!
12-Oct-2021 12:18:47 Running org.openmrs.reference.UsingBackButtonInMergePatientTest
12-Oct-2021 12:18:47 Tests run: 2, Failures: 1, Errors: 1, Skipped: 0, Time elapsed: 0.005 sec <<< FAILURE!
12-Oct-2021 12:18:47 Running org.openmrs.reference.AddDiagnosisToVisitNoteTest
12-Oct-2021 12:18:47 Tests run: 1, Failures: 1, Errors: 0, Skipped: 0, Time elapsed: 0.002 sec <<< FAILURE!
12-Oct-2021 12:18:47 Running org.openmrs.reference.MergeVisitsTest
12-Oct-2021 12:18:47 Tests run: 2, Failures: 1, Errors: 1, Skipped: 0, Time elapsed: 0.005 sec <<< FAILURE!
12-Oct-2021 12:18:47 Running org.openmrs.reference.EditServiceTest
12-Oct-2021 12:18:47 Tests run: 1, Failures: 1, Errors: 0, Skipped: 0, Time elapsed: 0.003 sec <<< FAILURE!
12-Oct-2021 12:18:47 Running org.openmrs.reference.AddNewAllergyTest
12-Oct-2021 12:18:47 Tests run: 1, Failures: 1, Errors: 0, Skipped: 0, Time elapsed: 0 sec <<< FAILURE!
12-Oct-2021 12:18:47 Running org.openmrs.reference.LoginTest
12-Oct-2021 12:18:47 Tests run: 5, Failures: 5, Errors: 0, Skipped: 0, Time elapsed: 0.004 sec <<< FAILURE!
12-Oct-2021 12:18:47 Running org.openmrs.reference.DeleteProviderTest
12-Oct-2021 12:18:47 Tests run: 2, Failures: 1, Errors: 1, Skipped: 0, Time elapsed: 0.076 sec <<< FAILURE!
12-Oct-2021 12:18:47 Running org.openmrs.reference.RegisterPatientTest
12-Oct-2021 12:18:47 Tests run: 2, Failures: 1, Errors: 1, Skipped: 0, Time elapsed: 0.006 sec <<< FAILURE!
12-Oct-2021 12:18:47 Running org.openmrs.reference.ContactInfoTest
12-Oct-2021 12:18:47 Tests run: 1, Failures: 1, Errors: 0, Skipped: 0, Time elapsed: 0 sec <<< FAILURE!
12-Oct-2021 12:18:47 Running org.openmrs.reference.StartVisitTest
12-Oct-2021 12:18:47 Tests run: 1, Failures: 1, Errors: 0, Skipped: 0, Time elapsed: 0 sec <<< FAILURE!
12-Oct-2021 12:18:47 Running org.openmrs.reference.DeletePersonTest
12-Oct-2021 12:18:47 Tests run: 2, Failures: 1, Errors: 1, Skipped: 0, Time elapsed: 0.064 sec <<< FAILURE!
12-Oct-2021 12:18:47 Running org.openmrs.reference.EditProviderTest
12-Oct-2021 12:18:48 Tests run: 2, Failures: 1, Errors: 1, Skipped: 0, Time elapsed: 0.061 sec <<< FAILURE!
12-Oct-2021 12:18:48 Running org.openmrs.reference.RetireVisitTypeTest
12-Oct-2021 12:18:48 Tests run: 2, Failures: 1, Errors: 1, Skipped: 0, Time elapsed: 0.068 sec <<< FAILURE!
12-Oct-2021 12:18:48
12-Oct-2021 12:18:48 Results :
12-Oct-2021 12:18:48
12-Oct-2021 12:18:48 Failed tests:   editVisitTypeTest(org.openmrs.reference.EditVisitTypeTest): Test killed due to server failure
12-Oct-2021 12:18:48   comeBackToApplicationAfterLogoutTest(org.openmrs.reference.ComeBackToApplicationAfterLogoutTest): Test killed due to server failure
12-Oct-2021 12:18:48   editDemographicTest(org.openmrs.reference.EditDemographicTest): Test killed due to server failure
12-Oct-2021 12:18:48   deleteVisitTypeTest(org.openmrs.reference.DeleteVisitTypeTest): Test killed due to server failure
12-Oct-2021 12:18:48   deleteFormTest(org.openmrs.reference.FormTest): Test killed due to server failure
12-Oct-2021 12:18:48   editFormTest(org.openmrs.reference.FormTest): Test killed due to server failure
12-Oct-2021 12:18:48   initiateFormPresence(org.openmrs.reference.FormTest): Test killed due to server failure
12-Oct-2021 12:18:48   addFormTest(org.openmrs.reference.FormTest): Test killed due to server failure
12-Oct-2021 12:18:48   registerUnidentifiedPatientTest(org.openmrs.reference.RegisterUnidentifiedPatientTest): Test killed due to server failure
12-Oct-2021 12:18:48   addPatientAppointmentTest(org.openmrs.reference.AddPatientAppointmentTest): Test killed due to server failure
12-Oct-2021 12:18:48   admitExitInpatientTest(org.openmrs.reference.AdmitExitInpatientTest): Test killed due to server failure
12-Oct-2021 12:18:48   deleteRequestAppointmentTest(org.openmrs.reference.DeleteRequestAppointmentTest): Test killed due to server failure
12-Oct-2021 12:18:48   editAllergyTest(org.openmrs.reference.EditAllergyTest): Test killed due to server failure
12-Oct-2021 12:18:48   visitNoteTest(org.openmrs.reference.VisitNoteTest): Test killed due to server failure
12-Oct-2021 12:18:48   createPersonTest(org.openmrs.reference.CreatePersonTest): Test killed due to server failure
12-Oct-2021 12:18:48   findPatientByNameTest(org.openmrs.reference.FindPatientByNameTest): Test killed due to server failure
12-Oct-2021 12:18:48   addUserTest(org.openmrs.reference.AddUserTest): Test killed due to server failure
12-Oct-2021 12:18:48   addProviderTest(org.openmrs.reference.AddProviderTest): Test killed due to server failure
12-Oct-2021 12:18:48   addPastVisitTest(org.openmrs.reference.AddPastVisitTest): Test killed due to server failure
12-Oct-2021 12:18:48   recordMergeIssueTest(org.openmrs.reference.RecordMergeIssueTest): Test killed due to server failure
12-Oct-2021 12:18:48   captureVitalsTest(org.openmrs.reference.CaptureVitalsTest): Test killed due to server failure
12-Oct-2021 12:18:48   namePatientAccentedLetterTest(org.openmrs.reference.NamePatientAccentedLetterTest): Test killed due to server failure
12-Oct-2021 12:18:48   retirePersonTest(org.openmrs.reference.RetirePersonTest): Test killed due to server failure
12-Oct-2021 12:18:48   endVisitTest(org.openmrs.reference.EndVisitTest): Test killed due to server failure
12-Oct-2021 12:18:48   deleteAppointmentBlockTest(org.openmrs.reference.DeleteAppointmentBlockTest): Test killed due to server failure
12-Oct-2021 12:18:48   bookRequestAppointmentTest(org.openmrs.reference.BookRequestAppointmentTest): Test killed due to server failure
12-Oct-2021 12:18:48   addDeleteServiceTest(org.openmrs.reference.AddDeleteServiceTest): Test killed due to server failure
12-Oct-2021 12:18:48   addEditAppointmentBlockTest(org.openmrs.reference.AddEditAppointmentBlockTest): Test killed due to server failure
12-Oct-2021 12:18:48   retireProviderTest(org.openmrs.reference.RetireProviderTest): Test killed due to server failure
12-Oct-2021 12:18:48   mergePatientTest(org.openmrs.reference.MergePatientTest): Test killed due to server failure
12-Oct-2021 12:18:48   addLocationTest(org.openmrs.reference.AddDeleteLocationTest): Test killed due to server failure
12-Oct-2021 12:18:48   duplicatePatientRegisterTest(org.openmrs.reference.DuplicatePatientRegisterTest): Test killed due to server failure
12-Oct-2021 12:18:48   usingBackButtonInMergePatientTest(org.openmrs.reference.UsingBackButtonInMergePatientTest): Test killed due to server failure
12-Oct-2021 12:18:48   addDiagnosisToVisitNoteTest(org.openmrs.reference.AddDiagnosisToVisitNoteTest): Test killed due to server failure
12-Oct-2021 12:18:48   mergeVisitsTest(org.openmrs.reference.MergeVisitsTest): Test killed due to server failure
12-Oct-2021 12:18:48   editServiceTest(org.openmrs.reference.EditServiceTest): Test killed due to server failure
12-Oct-2021 12:18:48   addNewAllergyTest(org.openmrs.reference.AddNewAllergyTest): Test killed due to server failure
12-Oct-2021 12:18:48   verifyNurseModulesAvailableOnHomePage(org.openmrs.reference.LoginTest): Test killed due to server failure
12-Oct-2021 12:18:48   verifyModulesAvailableOnHomePage(org.openmrs.reference.LoginTest): Test killed due to server failure
12-Oct-2021 12:18:48   verifySysadminModulesAvailableOnHomePage(org.openmrs.reference.LoginTest): Test killed due to server failure
12-Oct-2021 12:18:48   verifyClerkModulesAvailableOnHomePage(org.openmrs.reference.LoginTest): Test killed due to server failure
12-Oct-2021 12:18:48   verifyDoctorModulesAvailableOnHomePage(org.openmrs.reference.LoginTest): Test killed due to server failure
12-Oct-2021 12:18:48   deleteProviderTest(org.openmrs.reference.DeleteProviderTest): Test killed due to server failure
12-Oct-2021 12:18:48   registerPatientTest(org.openmrs.reference.RegisterPatientTest): Test killed due to server failure
12-Oct-2021 12:18:48   contactInfoTest(org.openmrs.reference.ContactInfoTest): Test killed due to server failure
12-Oct-2021 12:18:48   startVisitTest(org.openmrs.reference.StartVisitTest): Test killed due to server failure
12-Oct-2021 12:18:48   deletePersonTest(org.openmrs.reference.DeletePersonTest): Test killed due to server failure
12-Oct-2021 12:18:48   editProviderTest(org.openmrs.reference.EditProviderTest): Test killed due to server failure
12-Oct-2021 12:18:48   retireVisitTypeTest(org.openmrs.reference.RetireVisitTypeTest): Test killed due to server failure
12-Oct-2021 12:18:48
12-Oct-2021 12:18:48 Tests in error:
12-Oct-2021 12:18:48   transferToWardServiceTest(org.openmrs.reference.TransferToWardServiceTest): Error communicating with the remote browser. It may have died.(..)
12-Oct-2021 12:18:48   transferToWardServiceTest(org.openmrs.reference.TransferToWardServiceTest): Delete request failed: https://qa-refapp.openmrs.org/openmrs/ws/rest/v1/patient/15f8fdf7-bf9c-4500-b8f6-309ec4a54374
12-Oct-2021 12:18:48   transferToWardServiceTest(org.openmrs.reference.TransferToWardServiceTest): Session ID is null. Using WebDriver after calling quit()?(..)
12-Oct-2021 12:18:48   editVisitTypeTest(org.openmrs.reference.EditVisitTypeTest): Delete request failed: https://qa-refapp.openmrs.org/openmrs/ws/rest/v1/visittype/null?purge=true
12-Oct-2021 12:18:48   editVisitTypeTest(org.openmrs.reference.EditVisitTypeTest): Session ID is null. Using WebDriver after calling quit()?(..)
12-Oct-2021 12:18:48   deleteVisitTypeTest(org.openmrs.reference.DeleteVisitTypeTest): Delete request failed: https://qa-refapp.openmrs.org/openmrs/ws/rest/v1/visittype/null?purge=true
12-Oct-2021 12:18:48   deleteFormTest(org.openmrs.reference.FormTest)
12-Oct-2021 12:18:48   editFormTest(org.openmrs.reference.FormTest)
12-Oct-2021 12:18:48   initiateFormPresence(org.openmrs.reference.FormTest)
12-Oct-2021 12:18:48   addFormTest(org.openmrs.reference.FormTest)
12-Oct-2021 12:18:48   registerUnidentifiedPatientTest(org.openmrs.reference.RegisterUnidentifiedPatientTest)
12-Oct-2021 12:18:48   findPatientByNameTest(org.openmrs.reference.FindPatientByNameTest)
12-Oct-2021 12:18:48   addProviderTest(org.openmrs.reference.AddProviderTest): Delete request failed: https://qa-refapp.openmrs.org/openmrs/ws/rest/v1/person/null?purge=true
12-Oct-2021 12:18:48   recordMergeIssueTest(org.openmrs.reference.RecordMergeIssueTest)
12-Oct-2021 12:18:48   namePatientAccentedLetterTest(org.openmrs.reference.NamePatientAccentedLetterTest)
12-Oct-2021 12:18:48   retirePersonTest(org.openmrs.reference.RetirePersonTest): Delete request failed: https://qa-refapp.openmrs.org/openmrs/ws/rest/v1/person/null?purge=true
12-Oct-2021 12:18:48   retireProviderTest(org.openmrs.reference.RetireProviderTest): Delete request failed: https://qa-refapp.openmrs.org/openmrs/ws/rest/v1/provider/null?purge=true
12-Oct-2021 12:18:48   addLocationTest(org.openmrs.reference.AddDeleteLocationTest): Delete request failed: https://qa-refapp.openmrs.org/openmrs/ws/rest/v1//locationtag/null?purge=true
12-Oct-2021 12:18:48   duplicatePatientRegisterTest(org.openmrs.reference.DuplicatePatientRegisterTest)
12-Oct-2021 12:18:48   usingBackButtonInMergePatientTest(org.openmrs.reference.UsingBackButtonInMergePatientTest)
12-Oct-2021 12:18:48   mergeVisitsTest(org.openmrs.reference.MergeVisitsTest)
12-Oct-2021 12:18:48   deleteProviderTest(org.openmrs.reference.DeleteProviderTest): Delete request failed: https://qa-refapp.openmrs.org/openmrs/ws/rest/v1/provider/null?purge=true
12-Oct-2021 12:18:48   registerPatientTest(org.openmrs.reference.RegisterPatientTest)
12-Oct-2021 12:18:48   deletePersonTest(org.openmrs.reference.DeletePersonTest): Delete request failed: https://qa-refapp.openmrs.org/openmrs/ws/rest/v1/person/null?purge=true
12-Oct-2021 12:18:48   editProviderTest(org.openmrs.reference.EditProviderTest): Delete request failed: https://qa-refapp.openmrs.org/openmrs/ws/rest/v1/provider/null?purge=true
12-Oct-2021 12:18:48   retireVisitTypeTest(org.openmrs.reference.RetireVisitTypeTest): Delete request failed: https://qa-refapp.openmrs.org/openmrs/ws/rest/v1/visittype/null?purge=true
12-Oct-2021 12:18:48
12-Oct-2021 12:18:48 Tests run: 83, Failures: 49, Errors: 26, Skipped: 0
12-Oct-2021 12:18:48
12-Oct-2021 12:18:48 [INFO] ------------------------------------------------------------------------
12-Oct-2021 12:18:48 [INFO] Reactor Summary:
12-Oct-2021 12:18:48 [INFO]
12-Oct-2021 12:18:48 [INFO] Reference Application Distribution ................. SUCCESS [  0.295 s]
12-Oct-2021 12:18:48 [INFO] Reference Application Distribution Package ......... SUCCESS [ 41.989 s]
12-Oct-2021 12:18:48 [INFO] Reference Application Distribution UI Tests ........ FAILURE [07:23 min]
12-Oct-2021 12:18:48 [INFO] ------------------------------------------------------------------------
12-Oct-2021 12:18:48 [INFO] BUILD FAILURE
12-Oct-2021 12:18:48 [INFO] ------------------------------------------------------------------------
12-Oct-2021 12:18:48 [INFO] Total time: 08:06 min
12-Oct-2021 12:18:48 [INFO] Finished at: 2021-10-12T12:18:48+00:00
12-Oct-2021 12:18:49 [INFO] Final Memory: 63M/387M
12-Oct-2021 12:18:49 [INFO] ------------------------------------------------------------------------
12-Oct-2021 12:18:49 [ERROR] Failed to execute goal org.apache.maven.plugins:maven-surefire-plugin:2.12:test (default-test) on project referenceapplication-ui-tests: There are test failures.
12-Oct-2021 12:18:49 [ERROR]
12-Oct-2021 12:18:49 [ERROR] Please refer to /home/bamboo-agent/bamboo-agent/xml-data/build-dir/REFAPP-UI-FRAMEWORK/ui-tests/target/surefire-reports for the individual test results.
12-Oct-2021 12:18:49 [ERROR] -> [Help 1]
12-Oct-2021 12:18:49 org.apache.maven.lifecycle.LifecycleExecutionException: Failed to execute goal org.apache.maven.plugins:maven-surefire-plugin:2.12:test (default-test) on project referenceapplication-ui-tests: There are test failures.
12-Oct-2021 12:18:49
12-Oct-2021 12:18:49 Please refer to /home/bamboo-agent/bamboo-agent/xml-data/build-dir/REFAPP-UI-FRAMEWORK/ui-tests/target/surefire-reports for the individual test results.
12-Oct-2021 12:18:49         at org.apache.maven.lifecycle.internal.MojoExecutor.execute(MojoExecutor.java:212)
12-Oct-2021 12:18:49         at org.apache.maven.lifecycle.internal.MojoExecutor.execute(MojoExecutor.java:153)
12-Oct-2021 12:18:49         at org.apache.maven.lifecycle.internal.MojoExecutor.execute(MojoExecutor.java:145)
12-Oct-2021 12:18:49         at org.apache.maven.lifecycle.internal.LifecycleModuleBuilder.buildProject(LifecycleModuleBuilder.java:116)
12-Oct-2021 12:18:49         at org.apache.maven.lifecycle.internal.LifecycleModuleBuilder.buildProject(LifecycleModuleBuilder.java:80)
12-Oct-2021 12:18:49         at org.apache.maven.lifecycle.internal.builder.singlethreaded.SingleThreadedBuilder.build(SingleThreadedBuilder.java:51)
12-Oct-2021 12:18:49         at org.apache.maven.lifecycle.internal.LifecycleStarter.execute(LifecycleStarter.java:128)
12-Oct-2021 12:18:49         at org.apache.maven.DefaultMaven.doExecute(DefaultMaven.java:307)
12-Oct-2021 12:18:49         at org.apache.maven.DefaultMaven.doExecute(DefaultMaven.java:193)
12-Oct-2021 12:18:49         at org.apache.maven.DefaultMaven.execute(DefaultMaven.java:106)
12-Oct-2021 12:18:49         at org.apache.maven.cli.MavenCli.execute(MavenCli.java:863)
12-Oct-2021 12:18:49         at org.apache.maven.cli.MavenCli.doMain(MavenCli.java:288)
12-Oct-2021 12:18:49         at org.apache.maven.cli.MavenCli.main(MavenCli.java:199)
12-Oct-2021 12:18:49         at sun.reflect.NativeMethodAccessorImpl.invoke0(Native Method)
12-Oct-2021 12:18:49         at sun.reflect.NativeMethodAccessorImpl.invoke(NativeMethodAccessorImpl.java:62)
12-Oct-2021 12:18:49         at sun.reflect.DelegatingMethodAccessorImpl.invoke(DelegatingMethodAccessorImpl.java:43)
12-Oct-2021 12:18:49         at java.lang.reflect.Method.invoke(Method.java:498)
12-Oct-2021 12:18:49         at org.codehaus.plexus.classworlds.launcher.Launcher.launchEnhanced(Launcher.java:289)
12-Oct-2021 12:18:49         at org.codehaus.plexus.classworlds.launcher.Launcher.launch(Launcher.java:229)
12-Oct-2021 12:18:49         at org.codehaus.plexus.classworlds.launcher.Launcher.mainWithExitCode(Launcher.java:415)
12-Oct-2021 12:18:49         at org.codehaus.plexus.classworlds.launcher.Launcher.main(Launcher.java:356)
12-Oct-2021 12:18:49 Caused by: org.apache.maven.plugin.MojoFailureException: There are test failures.
12-Oct-2021 12:18:49
12-Oct-2021 12:18:49 Please refer to /home/bamboo-agent/bamboo-agent/xml-data/build-dir/REFAPP-UI-FRAMEWORK/ui-tests/target/surefire-reports for the individual test results.
12-Oct-2021 12:18:49         at org.apache.maven.plugin.surefire.SurefireHelper.reportExecution(SurefireHelper.java:83)
12-Oct-2021 12:18:49         at org.apache.maven.plugin.surefire.SurefirePlugin.writeSummary(SurefirePlugin.java:673)
12-Oct-2021 12:18:49         at org.apache.maven.plugin.surefire.SurefirePlugin.handleSummary(SurefirePlugin.java:647)
12-Oct-2021 12:18:49         at org.apache.maven.plugin.surefire.AbstractSurefireMojo.executeAfterPreconditionsChecked(AbstractSurefireMojo.java:137)
12-Oct-2021 12:18:49         at org.apache.maven.plugin.surefire.AbstractSurefireMojo.execute(AbstractSurefireMojo.java:98)
12-Oct-2021 12:18:49         at org.apache.maven.plugin.DefaultBuildPluginManager.executeMojo(DefaultBuildPluginManager.java:134)
12-Oct-2021 12:18:49         at org.apache.maven.lifecycle.internal.MojoExecutor.execute(MojoExecutor.java:207)
12-Oct-2021 12:18:49         ... 20 more
12-Oct-2021 12:18:49 [ERROR]
12-Oct-2021 12:18:49 [ERROR] Re-run Maven using the -X switch to enable full debug logging.
12-Oct-2021 12:18:49 [ERROR]
12-Oct-2021 12:18:49 [ERROR] For more information about the errors and possible solutions, please read the following articles:
12-Oct-2021 12:18:49 [ERROR] [Help 1] http://cwiki.apache.org/confluence/display/MAVEN/MojoFailureException
12-Oct-2021 12:18:49 [ERROR]
12-Oct-2021 12:18:49 [ERROR] After correcting the problems, you can resume the build with the command
12-Oct-2021 12:18:49 [ERROR]   mvn <goals> -rf :referenceapplication-ui-tests
12-Oct-2021 12:18:49 Failing task since return code of [/usr/share/apache-maven-3.3.9/bin/mvn --batch-mode -Djava.io.tmpdir=/home/bamboo-agent/bamboo-agent/.agent_tmp/REFAPP-UI-FRAMEWORK clean install -DskipTests=false -e] was 1 while expected 0
12-Oct-2021 12:18:49 Parsing test results under /home/bamboo-agent/bamboo-agent/xml-data/build-dir/REFAPP-UI-FRAMEWORK...
12-Oct-2021 12:18:50 Finished task 'Build distribution' with result: Failed
12-Oct-2021 12:18:50 Running post build plugin 'Docker Container Cleanup'
12-Oct-2021 12:18:50 Running post build plugin 'NCover Results Collector'
12-Oct-2021 12:18:50 Running post build plugin 'Clover Results Collector'
12-Oct-2021 12:18:50 Running post build plugin 'Sauce OnDemand Post Runner'
12-Oct-2021 12:18:50 Running post build plugin 'npm Cache Cleanup'
12-Oct-2021 12:18:50 Running post build plugin 'Artifact Copier'
12-Oct-2021 12:18:50 Finalising the build...
12-Oct-2021 12:18:50 Stopping timer.
12-Oct-2021 12:18:50 Build REFAPP-UI-FRAMEWORK-645 completed.
12-Oct-2021 12:18:50 Running on server: post build plugin 'NCover Results Collector'
12-Oct-2021 12:18:50 Running on server: post build plugin 'Build Hanging Detection Configuration'
12-Oct-2021 12:18:50 Running on server: post build plugin 'Clover Delta Calculator'
12-Oct-2021 12:18:50 Running on server: post build plugin 'Maven Dependencies Postprocessor'
12-Oct-2021 12:18:50 All post build plugins have finished
12-Oct-2021 12:18:50 Generating build results summary...
12-Oct-2021 12:18:50 Saving build results to disk...
12-Oct-2021 12:18:50 Logging substituted variables...
12-Oct-2021 12:18:50 Indexing build results...
12-Oct-2021 12:18:50 Finished building REFAPP-UI-FRAMEWORK-645.