UI tests for the reference application

Build: #646 failed

Job: Run QA UI Tests failed

Stages & jobs

  1. Ref App UI Testing

Build log

The build generated 2,848 lines of output.The output is too long and has been truncated to the last 1,000 lines. Download or view full build log

12-Oct-2021 12:50:51 Failed to login in UnidentifiedPatientKeyboardTest.unidentifiedPatientKeyboardTest, trying again...
12-Oct-2021 12:50:51 Failed to login in UnidentifiedPatientKeyboardTest.unidentifiedPatientKeyboardTest, trying again...
12-Oct-2021 12:50:51 Failed to login in UnidentifiedPatientKeyboardTest.unidentifiedPatientKeyboardTest, trying again...
12-Oct-2021 12:50:51 Failed to login in UnidentifiedPatientKeyboardTest.unidentifiedPatientKeyboardTest, trying again...
12-Oct-2021 12:50:51 Failed to login in UnidentifiedPatientKeyboardTest.unidentifiedPatientKeyboardTest, trying again...
12-Oct-2021 12:50:51 Failed to login in UnidentifiedPatientKeyboardTest.unidentifiedPatientKeyboardTest, trying again...
12-Oct-2021 12:50:51 Failed to login in UnidentifiedPatientKeyboardTest.unidentifiedPatientKeyboardTest, trying again...
12-Oct-2021 12:50:51 Failed to login in UnidentifiedPatientKeyboardTest.unidentifiedPatientKeyboardTest, trying again...
12-Oct-2021 12:50:51 Failed to login in UnidentifiedPatientKeyboardTest.unidentifiedPatientKeyboardTest, trying again...
12-Oct-2021 12:50:51 Failed to login in UnidentifiedPatientKeyboardTest.unidentifiedPatientKeyboardTest, trying again...
12-Oct-2021 12:50:51 Failed to login in UnidentifiedPatientKeyboardTest.unidentifiedPatientKeyboardTest, trying again...
12-Oct-2021 12:50:51 Failed to login in UnidentifiedPatientKeyboardTest.unidentifiedPatientKeyboardTest, trying again...
12-Oct-2021 12:50:51 Failed to login in UnidentifiedPatientKeyboardTest.unidentifiedPatientKeyboardTest, trying again...
12-Oct-2021 12:50:51 Failed to login in UnidentifiedPatientKeyboardTest.unidentifiedPatientKeyboardTest, trying again...
12-Oct-2021 12:50:51 Failed to login in UnidentifiedPatientKeyboardTest.unidentifiedPatientKeyboardTest, trying again...
12-Oct-2021 12:50:51 Failed to login in UnidentifiedPatientKeyboardTest.unidentifiedPatientKeyboardTest, trying again...
12-Oct-2021 12:50:51 Failed to login in UnidentifiedPatientKeyboardTest.unidentifiedPatientKeyboardTest, trying again...
12-Oct-2021 12:50:51 Failed to login in UnidentifiedPatientKeyboardTest.unidentifiedPatientKeyboardTest, trying again...
12-Oct-2021 12:50:51 Failed to login in UnidentifiedPatientKeyboardTest.unidentifiedPatientKeyboardTest, trying again...
12-Oct-2021 12:50:51 Failed to login in UnidentifiedPatientKeyboardTest.unidentifiedPatientKeyboardTest, trying again...
12-Oct-2021 12:50:51 Failed to login in UnidentifiedPatientKeyboardTest.unidentifiedPatientKeyboardTest, trying again...
12-Oct-2021 12:50:51 Failed to login in UnidentifiedPatientKeyboardTest.unidentifiedPatientKeyboardTest, trying again...
12-Oct-2021 12:50:51 Failed to login in UnidentifiedPatientKeyboardTest.unidentifiedPatientKeyboardTest, trying again...
12-Oct-2021 12:50:52 Failed to login in UnidentifiedPatientKeyboardTest.unidentifiedPatientKeyboardTest, trying again...
12-Oct-2021 12:50:52 Failed to login in UnidentifiedPatientKeyboardTest.unidentifiedPatientKeyboardTest, trying again...
12-Oct-2021 12:50:52 Failed to login in UnidentifiedPatientKeyboardTest.unidentifiedPatientKeyboardTest, trying again...
12-Oct-2021 12:50:52 Failed to login in UnidentifiedPatientKeyboardTest.unidentifiedPatientKeyboardTest, trying again...
12-Oct-2021 12:50:52 Failed to login in UnidentifiedPatientKeyboardTest.unidentifiedPatientKeyboardTest, trying again...
12-Oct-2021 12:50:52 Failed to login in UnidentifiedPatientKeyboardTest.unidentifiedPatientKeyboardTest, trying again...
12-Oct-2021 12:50:52 Failed to login in UnidentifiedPatientKeyboardTest.unidentifiedPatientKeyboardTest, trying again...
12-Oct-2021 12:50:52 Failed to login in UnidentifiedPatientKeyboardTest.unidentifiedPatientKeyboardTest, trying again...
12-Oct-2021 12:50:52 Failed to login in UnidentifiedPatientKeyboardTest.unidentifiedPatientKeyboardTest, trying again...
12-Oct-2021 12:50:52 Failed to login in UnidentifiedPatientKeyboardTest.unidentifiedPatientKeyboardTest, trying again...
12-Oct-2021 12:50:52 Failed to login in UnidentifiedPatientKeyboardTest.unidentifiedPatientKeyboardTest, trying again...
12-Oct-2021 12:50:52 Failed to login in UnidentifiedPatientKeyboardTest.unidentifiedPatientKeyboardTest, trying again...
12-Oct-2021 12:50:52 Failed to login in UnidentifiedPatientKeyboardTest.unidentifiedPatientKeyboardTest, trying again...
12-Oct-2021 12:50:52 Failed to login in UnidentifiedPatientKeyboardTest.unidentifiedPatientKeyboardTest, trying again...
12-Oct-2021 12:50:52 Failed to login in UnidentifiedPatientKeyboardTest.unidentifiedPatientKeyboardTest, trying again...
12-Oct-2021 12:50:52 Failed to login in UnidentifiedPatientKeyboardTest.unidentifiedPatientKeyboardTest, trying again...
12-Oct-2021 12:50:52 Failed to login in UnidentifiedPatientKeyboardTest.unidentifiedPatientKeyboardTest, trying again...
12-Oct-2021 12:50:52 Failed to login in UnidentifiedPatientKeyboardTest.unidentifiedPatientKeyboardTest, trying again...
12-Oct-2021 12:50:52 Failed to login in UnidentifiedPatientKeyboardTest.unidentifiedPatientKeyboardTest, trying again...
12-Oct-2021 12:50:52 Failed to login in UnidentifiedPatientKeyboardTest.unidentifiedPatientKeyboardTest, trying again...
12-Oct-2021 12:50:52 Failed to login in UnidentifiedPatientKeyboardTest.unidentifiedPatientKeyboardTest, trying again...
12-Oct-2021 12:50:52 Failed to login in UnidentifiedPatientKeyboardTest.unidentifiedPatientKeyboardTest, trying again...
12-Oct-2021 12:50:53 Failed to login in UnidentifiedPatientKeyboardTest.unidentifiedPatientKeyboardTest, trying again...
12-Oct-2021 12:50:53 Failed to login in UnidentifiedPatientKeyboardTest.unidentifiedPatientKeyboardTest, trying again...
12-Oct-2021 12:50:53 Failed to login in UnidentifiedPatientKeyboardTest.unidentifiedPatientKeyboardTest, trying again...
12-Oct-2021 12:50:53 Failed to login in UnidentifiedPatientKeyboardTest.unidentifiedPatientKeyboardTest, trying again...
12-Oct-2021 12:50:53 Failed to login in UnidentifiedPatientKeyboardTest.unidentifiedPatientKeyboardTest, trying again...
12-Oct-2021 12:50:53 Failed to login in UnidentifiedPatientKeyboardTest.unidentifiedPatientKeyboardTest, trying again...
12-Oct-2021 12:50:53 Failed to login in UnidentifiedPatientKeyboardTest.unidentifiedPatientKeyboardTest, trying again...
12-Oct-2021 12:50:53 Failed to login in UnidentifiedPatientKeyboardTest.unidentifiedPatientKeyboardTest, trying again...
12-Oct-2021 12:50:53 Failed to login in UnidentifiedPatientKeyboardTest.unidentifiedPatientKeyboardTest, trying again...
12-Oct-2021 12:50:53 Failed to login in UnidentifiedPatientKeyboardTest.unidentifiedPatientKeyboardTest, trying again...
12-Oct-2021 12:50:53 Failed to login in UnidentifiedPatientKeyboardTest.unidentifiedPatientKeyboardTest, trying again...
12-Oct-2021 12:50:53 Failed to login in UnidentifiedPatientKeyboardTest.unidentifiedPatientKeyboardTest, trying again...
12-Oct-2021 12:50:53 Failed to login in UnidentifiedPatientKeyboardTest.unidentifiedPatientKeyboardTest, trying again...
12-Oct-2021 12:50:53 Failed to login in UnidentifiedPatientKeyboardTest.unidentifiedPatientKeyboardTest, trying again...
12-Oct-2021 12:50:53 Failed to login in UnidentifiedPatientKeyboardTest.unidentifiedPatientKeyboardTest, trying again...
12-Oct-2021 12:50:53 Failed to login in UnidentifiedPatientKeyboardTest.unidentifiedPatientKeyboardTest, trying again...
12-Oct-2021 12:50:53 Failed to login in UnidentifiedPatientKeyboardTest.unidentifiedPatientKeyboardTest, trying again...
12-Oct-2021 12:50:53 Failed to login in UnidentifiedPatientKeyboardTest.unidentifiedPatientKeyboardTest, trying again...
12-Oct-2021 12:50:53 Failed to login in UnidentifiedPatientKeyboardTest.unidentifiedPatientKeyboardTest, trying again...
12-Oct-2021 12:50:53 Failed to login in UnidentifiedPatientKeyboardTest.unidentifiedPatientKeyboardTest, trying again...
12-Oct-2021 12:50:53 Failed to login in UnidentifiedPatientKeyboardTest.unidentifiedPatientKeyboardTest, trying again...
12-Oct-2021 12:50:53 Failed to login in UnidentifiedPatientKeyboardTest.unidentifiedPatientKeyboardTest, trying again...
12-Oct-2021 12:50:53 Failed to login in UnidentifiedPatientKeyboardTest.unidentifiedPatientKeyboardTest, trying again...
12-Oct-2021 12:50:53 Failed to login in UnidentifiedPatientKeyboardTest.unidentifiedPatientKeyboardTest, trying again...
12-Oct-2021 12:50:53 Failed to login in UnidentifiedPatientKeyboardTest.unidentifiedPatientKeyboardTest, trying again...
12-Oct-2021 12:50:53 Failed to login in UnidentifiedPatientKeyboardTest.unidentifiedPatientKeyboardTest, trying again...
12-Oct-2021 12:50:53 Failed to login in UnidentifiedPatientKeyboardTest.unidentifiedPatientKeyboardTest, trying again...
12-Oct-2021 12:50:53 Failed to login in UnidentifiedPatientKeyboardTest.unidentifiedPatientKeyboardTest, trying again...
12-Oct-2021 12:50:53 Failed to login in UnidentifiedPatientKeyboardTest.unidentifiedPatientKeyboardTest, trying again...
12-Oct-2021 12:50:54 Failed to login in UnidentifiedPatientKeyboardTest.unidentifiedPatientKeyboardTest, trying again...
12-Oct-2021 12:50:54 Failed to login in UnidentifiedPatientKeyboardTest.unidentifiedPatientKeyboardTest, trying again...
12-Oct-2021 12:50:54 Failed to login in UnidentifiedPatientKeyboardTest.unidentifiedPatientKeyboardTest, trying again...
12-Oct-2021 12:50:54 Failed to login in UnidentifiedPatientKeyboardTest.unidentifiedPatientKeyboardTest, trying again...
12-Oct-2021 12:50:54 Failed to login in UnidentifiedPatientKeyboardTest.unidentifiedPatientKeyboardTest, trying again...
12-Oct-2021 12:50:54 Failed to login in UnidentifiedPatientKeyboardTest.unidentifiedPatientKeyboardTest, trying again...
12-Oct-2021 12:50:54 Failed to login in UnidentifiedPatientKeyboardTest.unidentifiedPatientKeyboardTest, trying again...
12-Oct-2021 12:50:54 Failed to login in UnidentifiedPatientKeyboardTest.unidentifiedPatientKeyboardTest, trying again...
12-Oct-2021 12:50:54 Failed to login in UnidentifiedPatientKeyboardTest.unidentifiedPatientKeyboardTest, trying again...
12-Oct-2021 12:50:54 Failed to login in UnidentifiedPatientKeyboardTest.unidentifiedPatientKeyboardTest, trying again...
12-Oct-2021 12:50:54 Failed to login in UnidentifiedPatientKeyboardTest.unidentifiedPatientKeyboardTest, trying again...
12-Oct-2021 12:50:54 Failed to login in UnidentifiedPatientKeyboardTest.unidentifiedPatientKeyboardTest, trying again...
12-Oct-2021 12:50:54 Failed to login in UnidentifiedPatientKeyboardTest.unidentifiedPatientKeyboardTest, trying again...
12-Oct-2021 12:50:54 Failed to login in UnidentifiedPatientKeyboardTest.unidentifiedPatientKeyboardTest, trying again...
12-Oct-2021 12:50:54 Failed to login in UnidentifiedPatientKeyboardTest.unidentifiedPatientKeyboardTest, trying again...
12-Oct-2021 12:50:54 Failed to login in UnidentifiedPatientKeyboardTest.unidentifiedPatientKeyboardTest, trying again...
12-Oct-2021 12:50:54 Failed to login in UnidentifiedPatientKeyboardTest.unidentifiedPatientKeyboardTest, trying again...
12-Oct-2021 12:50:54 Failed to login in UnidentifiedPatientKeyboardTest.unidentifiedPatientKeyboardTest, trying again...
12-Oct-2021 12:50:54 Failed to login in UnidentifiedPatientKeyboardTest.unidentifiedPatientKeyboardTest, trying again...
12-Oct-2021 12:50:54 Failed to login in UnidentifiedPatientKeyboardTest.unidentifiedPatientKeyboardTest, trying again...
12-Oct-2021 12:50:54 Failed to login in UnidentifiedPatientKeyboardTest.unidentifiedPatientKeyboardTest, trying again...
12-Oct-2021 12:50:54 Failed to login in UnidentifiedPatientKeyboardTest.unidentifiedPatientKeyboardTest, trying again...
12-Oct-2021 12:50:54 Failed to login in UnidentifiedPatientKeyboardTest.unidentifiedPatientKeyboardTest, trying again...
12-Oct-2021 12:50:54 Failed to login in UnidentifiedPatientKeyboardTest.unidentifiedPatientKeyboardTest, trying again...
12-Oct-2021 12:50:55 Failed to login in UnidentifiedPatientKeyboardTest.unidentifiedPatientKeyboardTest, trying again...
12-Oct-2021 12:50:55 Failed to login in UnidentifiedPatientKeyboardTest.unidentifiedPatientKeyboardTest, trying again...
12-Oct-2021 12:50:55 Failed to login in UnidentifiedPatientKeyboardTest.unidentifiedPatientKeyboardTest, trying again...
12-Oct-2021 12:50:55 Failed to login in UnidentifiedPatientKeyboardTest.unidentifiedPatientKeyboardTest, trying again...
12-Oct-2021 12:50:55 Failed to login in UnidentifiedPatientKeyboardTest.unidentifiedPatientKeyboardTest, trying again...
12-Oct-2021 12:50:55 Failed to login in UnidentifiedPatientKeyboardTest.unidentifiedPatientKeyboardTest, trying again...
12-Oct-2021 12:50:55 Failed to login in UnidentifiedPatientKeyboardTest.unidentifiedPatientKeyboardTest, trying again...
12-Oct-2021 12:50:55 Failed to login in UnidentifiedPatientKeyboardTest.unidentifiedPatientKeyboardTest, trying again...
12-Oct-2021 12:50:55 Failed to login in UnidentifiedPatientKeyboardTest.unidentifiedPatientKeyboardTest, trying again...
12-Oct-2021 12:50:55 Failed to login in UnidentifiedPatientKeyboardTest.unidentifiedPatientKeyboardTest, trying again...
12-Oct-2021 12:50:55 Failed to login in UnidentifiedPatientKeyboardTest.unidentifiedPatientKeyboardTest, trying again...
12-Oct-2021 12:50:55 Failed to login in UnidentifiedPatientKeyboardTest.unidentifiedPatientKeyboardTest, trying again...
12-Oct-2021 12:50:55 Failed to login in UnidentifiedPatientKeyboardTest.unidentifiedPatientKeyboardTest, trying again...
12-Oct-2021 12:50:55 Failed to login in UnidentifiedPatientKeyboardTest.unidentifiedPatientKeyboardTest, trying again...
12-Oct-2021 12:50:55 Failed to login in UnidentifiedPatientKeyboardTest.unidentifiedPatientKeyboardTest, trying again...
12-Oct-2021 12:50:55 Failed to login in UnidentifiedPatientKeyboardTest.unidentifiedPatientKeyboardTest, trying again...
12-Oct-2021 12:50:55 Failed to login in UnidentifiedPatientKeyboardTest.unidentifiedPatientKeyboardTest, trying again...
12-Oct-2021 12:50:55 Failed to login in UnidentifiedPatientKeyboardTest.unidentifiedPatientKeyboardTest, trying again...
12-Oct-2021 12:50:55 Failed to login in UnidentifiedPatientKeyboardTest.unidentifiedPatientKeyboardTest, trying again...
12-Oct-2021 12:50:55 Failed to login in UnidentifiedPatientKeyboardTest.unidentifiedPatientKeyboardTest, trying again...
12-Oct-2021 12:50:55 Failed to login in UnidentifiedPatientKeyboardTest.unidentifiedPatientKeyboardTest, trying again...
12-Oct-2021 12:50:55 Failed to login in UnidentifiedPatientKeyboardTest.unidentifiedPatientKeyboardTest, trying again...
12-Oct-2021 12:50:55 Failed to login in UnidentifiedPatientKeyboardTest.unidentifiedPatientKeyboardTest, trying again...
12-Oct-2021 12:50:55 Failed to login in UnidentifiedPatientKeyboardTest.unidentifiedPatientKeyboardTest, trying again...
12-Oct-2021 12:50:55 Failed to login in UnidentifiedPatientKeyboardTest.unidentifiedPatientKeyboardTest, trying again...
12-Oct-2021 12:50:55 Failed to login in UnidentifiedPatientKeyboardTest.unidentifiedPatientKeyboardTest, trying again...
12-Oct-2021 12:50:55 Failed to login in UnidentifiedPatientKeyboardTest.unidentifiedPatientKeyboardTest, trying again...
12-Oct-2021 12:50:55 Failed to login in UnidentifiedPatientKeyboardTest.unidentifiedPatientKeyboardTest, trying again...
12-Oct-2021 12:50:56 Failed to login in UnidentifiedPatientKeyboardTest.unidentifiedPatientKeyboardTest, trying again...
12-Oct-2021 12:50:56 Failed to login in UnidentifiedPatientKeyboardTest.unidentifiedPatientKeyboardTest, trying again...
12-Oct-2021 12:50:56 Failed to login in UnidentifiedPatientKeyboardTest.unidentifiedPatientKeyboardTest, trying again...
12-Oct-2021 12:50:56 Failed to login in UnidentifiedPatientKeyboardTest.unidentifiedPatientKeyboardTest, trying again...
12-Oct-2021 12:50:56 Failed to login in UnidentifiedPatientKeyboardTest.unidentifiedPatientKeyboardTest, trying again...
12-Oct-2021 12:50:56 Failed to login in UnidentifiedPatientKeyboardTest.unidentifiedPatientKeyboardTest, trying again...
12-Oct-2021 12:50:56 Failed to login in UnidentifiedPatientKeyboardTest.unidentifiedPatientKeyboardTest, trying again...
12-Oct-2021 12:50:56 Failed to login in UnidentifiedPatientKeyboardTest.unidentifiedPatientKeyboardTest, trying again...
12-Oct-2021 12:50:56 Failed to login in UnidentifiedPatientKeyboardTest.unidentifiedPatientKeyboardTest, trying again...
12-Oct-2021 12:50:56 Failed to login in UnidentifiedPatientKeyboardTest.unidentifiedPatientKeyboardTest, trying again...
12-Oct-2021 12:50:56 Failed to login in UnidentifiedPatientKeyboardTest.unidentifiedPatientKeyboardTest, trying again...
12-Oct-2021 12:50:56 Failed to login in UnidentifiedPatientKeyboardTest.unidentifiedPatientKeyboardTest, trying again...
12-Oct-2021 12:50:56 Failed to login in UnidentifiedPatientKeyboardTest.unidentifiedPatientKeyboardTest, trying again...
12-Oct-2021 12:50:56 Failed to login in UnidentifiedPatientKeyboardTest.unidentifiedPatientKeyboardTest, trying again...
12-Oct-2021 12:50:56 Failed to login in UnidentifiedPatientKeyboardTest.unidentifiedPatientKeyboardTest, trying again...
12-Oct-2021 12:50:56 Failed to login in UnidentifiedPatientKeyboardTest.unidentifiedPatientKeyboardTest, trying again...
12-Oct-2021 12:50:56 Failed to login in UnidentifiedPatientKeyboardTest.unidentifiedPatientKeyboardTest, trying again...
12-Oct-2021 12:50:56 Failed to login in UnidentifiedPatientKeyboardTest.unidentifiedPatientKeyboardTest, trying again...
12-Oct-2021 12:50:56 Failed to login in UnidentifiedPatientKeyboardTest.unidentifiedPatientKeyboardTest, trying again...
12-Oct-2021 12:50:56 Failed to login in UnidentifiedPatientKeyboardTest.unidentifiedPatientKeyboardTest, trying again...
12-Oct-2021 12:50:56 Failed to login in UnidentifiedPatientKeyboardTest.unidentifiedPatientKeyboardTest, trying again...
12-Oct-2021 12:50:56 Failed to login in UnidentifiedPatientKeyboardTest.unidentifiedPatientKeyboardTest, trying again...
12-Oct-2021 12:50:56 Failed to login in UnidentifiedPatientKeyboardTest.unidentifiedPatientKeyboardTest, trying again...
12-Oct-2021 12:50:56 Failed to login in UnidentifiedPatientKeyboardTest.unidentifiedPatientKeyboardTest, trying again...
12-Oct-2021 12:50:57 Failed to login in UnidentifiedPatientKeyboardTest.unidentifiedPatientKeyboardTest, trying again...
12-Oct-2021 12:50:57 Failed to login in UnidentifiedPatientKeyboardTest.unidentifiedPatientKeyboardTest, trying again...
12-Oct-2021 12:50:57 Failed to login in UnidentifiedPatientKeyboardTest.unidentifiedPatientKeyboardTest, trying again...
12-Oct-2021 12:50:57 Failed to login in UnidentifiedPatientKeyboardTest.unidentifiedPatientKeyboardTest, trying again...
12-Oct-2021 12:50:57 Failed to login in UnidentifiedPatientKeyboardTest.unidentifiedPatientKeyboardTest, trying again...
12-Oct-2021 12:50:57 Failed to login in UnidentifiedPatientKeyboardTest.unidentifiedPatientKeyboardTest, trying again...
12-Oct-2021 12:50:57 Failed to login in UnidentifiedPatientKeyboardTest.unidentifiedPatientKeyboardTest, trying again...
12-Oct-2021 12:50:57 Failed to login in UnidentifiedPatientKeyboardTest.unidentifiedPatientKeyboardTest, trying again...
12-Oct-2021 12:50:57 Failed to login in UnidentifiedPatientKeyboardTest.unidentifiedPatientKeyboardTest, trying again...
12-Oct-2021 12:50:57 Failed to login in UnidentifiedPatientKeyboardTest.unidentifiedPatientKeyboardTest, trying again...
12-Oct-2021 12:50:57 Failed to login in UnidentifiedPatientKeyboardTest.unidentifiedPatientKeyboardTest, trying again...
12-Oct-2021 12:50:57 Failed to login in UnidentifiedPatientKeyboardTest.unidentifiedPatientKeyboardTest, trying again...
12-Oct-2021 12:50:57 Failed to login in UnidentifiedPatientKeyboardTest.unidentifiedPatientKeyboardTest, trying again...
12-Oct-2021 12:50:57 Failed to login in UnidentifiedPatientKeyboardTest.unidentifiedPatientKeyboardTest, trying again...
12-Oct-2021 12:50:57 Failed to login in UnidentifiedPatientKeyboardTest.unidentifiedPatientKeyboardTest, trying again...
12-Oct-2021 12:50:57 Failed to login in UnidentifiedPatientKeyboardTest.unidentifiedPatientKeyboardTest, trying again...
12-Oct-2021 12:50:57 Failed to login in UnidentifiedPatientKeyboardTest.unidentifiedPatientKeyboardTest, trying again...
12-Oct-2021 12:50:57 Failed to login in UnidentifiedPatientKeyboardTest.unidentifiedPatientKeyboardTest, trying again...
12-Oct-2021 12:50:57 Failed to login in UnidentifiedPatientKeyboardTest.unidentifiedPatientKeyboardTest, trying again...
12-Oct-2021 12:50:57 Failed to login in UnidentifiedPatientKeyboardTest.unidentifiedPatientKeyboardTest, trying again...
12-Oct-2021 12:50:57 Failed to login in UnidentifiedPatientKeyboardTest.unidentifiedPatientKeyboardTest, trying again...
12-Oct-2021 12:50:57 Failed to login in UnidentifiedPatientKeyboardTest.unidentifiedPatientKeyboardTest, trying again...
12-Oct-2021 12:50:57 Failed to login in UnidentifiedPatientKeyboardTest.unidentifiedPatientKeyboardTest, trying again...
12-Oct-2021 12:50:57 Failed to login in UnidentifiedPatientKeyboardTest.unidentifiedPatientKeyboardTest, trying again...
12-Oct-2021 12:50:57 Failed to login in UnidentifiedPatientKeyboardTest.unidentifiedPatientKeyboardTest, trying again...
12-Oct-2021 12:50:57 Failed to login in UnidentifiedPatientKeyboardTest.unidentifiedPatientKeyboardTest, trying again...
12-Oct-2021 12:50:57 Failed to login in UnidentifiedPatientKeyboardTest.unidentifiedPatientKeyboardTest, trying again...
12-Oct-2021 12:50:57 Failed to login in UnidentifiedPatientKeyboardTest.unidentifiedPatientKeyboardTest, trying again...
12-Oct-2021 12:50:58 Failed to login in UnidentifiedPatientKeyboardTest.unidentifiedPatientKeyboardTest, trying again...
12-Oct-2021 12:50:58 Failed to login in UnidentifiedPatientKeyboardTest.unidentifiedPatientKeyboardTest, trying again...
12-Oct-2021 12:50:58 Failed to login in UnidentifiedPatientKeyboardTest.unidentifiedPatientKeyboardTest, trying again...
12-Oct-2021 12:50:58 Failed to login in UnidentifiedPatientKeyboardTest.unidentifiedPatientKeyboardTest, trying again...
12-Oct-2021 12:50:58 Failed to login in UnidentifiedPatientKeyboardTest.unidentifiedPatientKeyboardTest, trying again...
12-Oct-2021 12:50:58 Failed to login in UnidentifiedPatientKeyboardTest.unidentifiedPatientKeyboardTest, trying again...
12-Oct-2021 12:50:58 Failed to login in UnidentifiedPatientKeyboardTest.unidentifiedPatientKeyboardTest, trying again...
12-Oct-2021 12:50:58 Failed to login in UnidentifiedPatientKeyboardTest.unidentifiedPatientKeyboardTest, trying again...
12-Oct-2021 12:50:58 Failed to login in UnidentifiedPatientKeyboardTest.unidentifiedPatientKeyboardTest, trying again...
12-Oct-2021 12:50:58 Failed to login in UnidentifiedPatientKeyboardTest.unidentifiedPatientKeyboardTest, trying again...
12-Oct-2021 12:50:58 Failed to login in UnidentifiedPatientKeyboardTest.unidentifiedPatientKeyboardTest, trying again...
12-Oct-2021 12:50:58 Failed to login in UnidentifiedPatientKeyboardTest.unidentifiedPatientKeyboardTest, trying again...
12-Oct-2021 12:50:58 Failed to login in UnidentifiedPatientKeyboardTest.unidentifiedPatientKeyboardTest, trying again...
12-Oct-2021 12:50:58 Failed to login in UnidentifiedPatientKeyboardTest.unidentifiedPatientKeyboardTest, trying again...
12-Oct-2021 12:50:58 Failed to login in UnidentifiedPatientKeyboardTest.unidentifiedPatientKeyboardTest, trying again...
12-Oct-2021 12:50:58 Failed to login in UnidentifiedPatientKeyboardTest.unidentifiedPatientKeyboardTest, trying again...
12-Oct-2021 12:50:58 Failed to login in UnidentifiedPatientKeyboardTest.unidentifiedPatientKeyboardTest, trying again...
12-Oct-2021 12:50:58 Failed to login in UnidentifiedPatientKeyboardTest.unidentifiedPatientKeyboardTest, trying again...
12-Oct-2021 12:50:58 Failed to login in UnidentifiedPatientKeyboardTest.unidentifiedPatientKeyboardTest, trying again...
12-Oct-2021 12:50:58 Failed to login in UnidentifiedPatientKeyboardTest.unidentifiedPatientKeyboardTest, trying again...
12-Oct-2021 12:50:58 Failed to login in UnidentifiedPatientKeyboardTest.unidentifiedPatientKeyboardTest, trying again...
12-Oct-2021 12:50:58 Failed to login in UnidentifiedPatientKeyboardTest.unidentifiedPatientKeyboardTest, trying again...
12-Oct-2021 12:50:59 Failed to login in UnidentifiedPatientKeyboardTest.unidentifiedPatientKeyboardTest, trying again...
12-Oct-2021 12:50:59 Failed to login in UnidentifiedPatientKeyboardTest.unidentifiedPatientKeyboardTest, trying again...
12-Oct-2021 12:50:59 Failed to login in UnidentifiedPatientKeyboardTest.unidentifiedPatientKeyboardTest, trying again...
12-Oct-2021 12:50:59 Failed to login in UnidentifiedPatientKeyboardTest.unidentifiedPatientKeyboardTest, trying again...
12-Oct-2021 12:50:59 Failed to login in UnidentifiedPatientKeyboardTest.unidentifiedPatientKeyboardTest, trying again...
12-Oct-2021 12:50:59 Failed to login in UnidentifiedPatientKeyboardTest.unidentifiedPatientKeyboardTest, trying again...
12-Oct-2021 12:50:59 Failed to login in UnidentifiedPatientKeyboardTest.unidentifiedPatientKeyboardTest, trying again...
12-Oct-2021 12:50:59 Failed to login in UnidentifiedPatientKeyboardTest.unidentifiedPatientKeyboardTest, trying again...
12-Oct-2021 12:50:59 Failed to login in UnidentifiedPatientKeyboardTest.unidentifiedPatientKeyboardTest, trying again...
12-Oct-2021 12:50:59 Failed to login in UnidentifiedPatientKeyboardTest.unidentifiedPatientKeyboardTest, trying again...
12-Oct-2021 12:50:59 Failed to login in UnidentifiedPatientKeyboardTest.unidentifiedPatientKeyboardTest, trying again...
12-Oct-2021 12:50:59 Failed to login in UnidentifiedPatientKeyboardTest.unidentifiedPatientKeyboardTest, trying again...
12-Oct-2021 12:50:59 Failed to login in UnidentifiedPatientKeyboardTest.unidentifiedPatientKeyboardTest, trying again...
12-Oct-2021 12:50:59 Failed to login in UnidentifiedPatientKeyboardTest.unidentifiedPatientKeyboardTest, trying again...
12-Oct-2021 12:50:59 Failed to login in UnidentifiedPatientKeyboardTest.unidentifiedPatientKeyboardTest, trying again...
12-Oct-2021 12:50:59 Failed to login in UnidentifiedPatientKeyboardTest.unidentifiedPatientKeyboardTest, trying again...
12-Oct-2021 12:50:59 Failed to login in UnidentifiedPatientKeyboardTest.unidentifiedPatientKeyboardTest, trying again...
12-Oct-2021 12:50:59 Failed to login in UnidentifiedPatientKeyboardTest.unidentifiedPatientKeyboardTest, trying again...
12-Oct-2021 12:50:59 Failed to login in UnidentifiedPatientKeyboardTest.unidentifiedPatientKeyboardTest, trying again...
12-Oct-2021 12:50:59 Failed to login in UnidentifiedPatientKeyboardTest.unidentifiedPatientKeyboardTest, trying again...
12-Oct-2021 12:50:59 Failed to login in UnidentifiedPatientKeyboardTest.unidentifiedPatientKeyboardTest, trying again...
12-Oct-2021 12:50:59 Failed to login in UnidentifiedPatientKeyboardTest.unidentifiedPatientKeyboardTest, trying again...
12-Oct-2021 12:50:59 Failed to login in UnidentifiedPatientKeyboardTest.unidentifiedPatientKeyboardTest, trying again...
12-Oct-2021 12:50:59 Failed to login in UnidentifiedPatientKeyboardTest.unidentifiedPatientKeyboardTest, trying again...
12-Oct-2021 12:50:59 Failed to login in UnidentifiedPatientKeyboardTest.unidentifiedPatientKeyboardTest, trying again...
12-Oct-2021 12:50:59 Failed to login in UnidentifiedPatientKeyboardTest.unidentifiedPatientKeyboardTest, trying again...
12-Oct-2021 12:51:00 Failed to login in UnidentifiedPatientKeyboardTest.unidentifiedPatientKeyboardTest, trying again...
12-Oct-2021 12:51:00 Failed to login in UnidentifiedPatientKeyboardTest.unidentifiedPatientKeyboardTest, trying again...
12-Oct-2021 12:51:00 Failed to login in UnidentifiedPatientKeyboardTest.unidentifiedPatientKeyboardTest, trying again...
12-Oct-2021 12:51:00 Failed to login in UnidentifiedPatientKeyboardTest.unidentifiedPatientKeyboardTest, trying again...
12-Oct-2021 12:51:00 Failed to login in UnidentifiedPatientKeyboardTest.unidentifiedPatientKeyboardTest, trying again...
12-Oct-2021 12:51:00 Failed to login in UnidentifiedPatientKeyboardTest.unidentifiedPatientKeyboardTest, trying again...
12-Oct-2021 12:51:00 Failed to login in UnidentifiedPatientKeyboardTest.unidentifiedPatientKeyboardTest, trying again...
12-Oct-2021 12:51:00 Failed to login in UnidentifiedPatientKeyboardTest.unidentifiedPatientKeyboardTest, trying again...
12-Oct-2021 12:51:00 Failed to login in UnidentifiedPatientKeyboardTest.unidentifiedPatientKeyboardTest, trying again...
12-Oct-2021 12:51:00 Failed to login in UnidentifiedPatientKeyboardTest.unidentifiedPatientKeyboardTest, trying again...
12-Oct-2021 12:51:00 Failed to login in UnidentifiedPatientKeyboardTest.unidentifiedPatientKeyboardTest, trying again...
12-Oct-2021 12:51:00 Failed to login in UnidentifiedPatientKeyboardTest.unidentifiedPatientKeyboardTest, trying again...
12-Oct-2021 12:51:00 Failed to login in UnidentifiedPatientKeyboardTest.unidentifiedPatientKeyboardTest, trying again...
12-Oct-2021 12:51:00 Failed to login in UnidentifiedPatientKeyboardTest.unidentifiedPatientKeyboardTest, trying again...
12-Oct-2021 12:51:00 Failed to login in UnidentifiedPatientKeyboardTest.unidentifiedPatientKeyboardTest, trying again...
12-Oct-2021 12:51:00 Failed to login in UnidentifiedPatientKeyboardTest.unidentifiedPatientKeyboardTest, trying again...
12-Oct-2021 12:51:00 Failed to login in UnidentifiedPatientKeyboardTest.unidentifiedPatientKeyboardTest, trying again...
12-Oct-2021 12:51:00 Failed to login in UnidentifiedPatientKeyboardTest.unidentifiedPatientKeyboardTest, trying again...
12-Oct-2021 12:51:00 Failed to login in UnidentifiedPatientKeyboardTest.unidentifiedPatientKeyboardTest, trying again...
12-Oct-2021 12:51:00 Failed to login in UnidentifiedPatientKeyboardTest.unidentifiedPatientKeyboardTest, trying again...
12-Oct-2021 12:51:00 Failed to login in UnidentifiedPatientKeyboardTest.unidentifiedPatientKeyboardTest, trying again...
12-Oct-2021 12:51:00 Failed to login in UnidentifiedPatientKeyboardTest.unidentifiedPatientKeyboardTest, trying again...
12-Oct-2021 12:51:00 Failed to login in UnidentifiedPatientKeyboardTest.unidentifiedPatientKeyboardTest, trying again...
12-Oct-2021 12:51:00 Failed to login in UnidentifiedPatientKeyboardTest.unidentifiedPatientKeyboardTest, trying again...
12-Oct-2021 12:51:00 Failed to login in UnidentifiedPatientKeyboardTest.unidentifiedPatientKeyboardTest, trying again...
12-Oct-2021 12:51:00 Failed to login in UnidentifiedPatientKeyboardTest.unidentifiedPatientKeyboardTest, trying again...
12-Oct-2021 12:51:00 Failed to login in UnidentifiedPatientKeyboardTest.unidentifiedPatientKeyboardTest, trying again...
12-Oct-2021 12:51:00 Failed to login in UnidentifiedPatientKeyboardTest.unidentifiedPatientKeyboardTest, trying again...
12-Oct-2021 12:51:01 Failed to login in UnidentifiedPatientKeyboardTest.unidentifiedPatientKeyboardTest, trying again...
12-Oct-2021 12:51:01 Failed to login in UnidentifiedPatientKeyboardTest.unidentifiedPatientKeyboardTest, trying again...
12-Oct-2021 12:51:01 Failed to login in UnidentifiedPatientKeyboardTest.unidentifiedPatientKeyboardTest, trying again...
12-Oct-2021 12:51:01 Failed to login in UnidentifiedPatientKeyboardTest.unidentifiedPatientKeyboardTest, trying again...
12-Oct-2021 12:51:01 Failed to login in UnidentifiedPatientKeyboardTest.unidentifiedPatientKeyboardTest, trying again...
12-Oct-2021 12:51:01 Failed to login in UnidentifiedPatientKeyboardTest.unidentifiedPatientKeyboardTest, trying again...
12-Oct-2021 12:51:01 Failed to login in UnidentifiedPatientKeyboardTest.unidentifiedPatientKeyboardTest, trying again...
12-Oct-2021 12:51:01 Failed to login in UnidentifiedPatientKeyboardTest.unidentifiedPatientKeyboardTest, trying again...
12-Oct-2021 12:51:01 Failed to login in UnidentifiedPatientKeyboardTest.unidentifiedPatientKeyboardTest, trying again...
12-Oct-2021 12:51:01 Failed to login in UnidentifiedPatientKeyboardTest.unidentifiedPatientKeyboardTest, trying again...
12-Oct-2021 12:51:01 Failed to login in UnidentifiedPatientKeyboardTest.unidentifiedPatientKeyboardTest, trying again...
12-Oct-2021 12:51:01 Failed to login in UnidentifiedPatientKeyboardTest.unidentifiedPatientKeyboardTest, trying again...
12-Oct-2021 12:51:01 Failed to login in UnidentifiedPatientKeyboardTest.unidentifiedPatientKeyboardTest, trying again...
12-Oct-2021 12:51:01 Failed to login in UnidentifiedPatientKeyboardTest.unidentifiedPatientKeyboardTest, trying again...
12-Oct-2021 12:51:01 Failed to login in UnidentifiedPatientKeyboardTest.unidentifiedPatientKeyboardTest, trying again...
12-Oct-2021 12:51:01 Failed to login in UnidentifiedPatientKeyboardTest.unidentifiedPatientKeyboardTest, trying again...
12-Oct-2021 12:51:01 Failed to login in UnidentifiedPatientKeyboardTest.unidentifiedPatientKeyboardTest, trying again...
12-Oct-2021 12:51:01 Failed to login in UnidentifiedPatientKeyboardTest.unidentifiedPatientKeyboardTest, trying again...
12-Oct-2021 12:51:01 Failed to login in UnidentifiedPatientKeyboardTest.unidentifiedPatientKeyboardTest, trying again...
12-Oct-2021 12:51:01 Failed to login in UnidentifiedPatientKeyboardTest.unidentifiedPatientKeyboardTest, trying again...
12-Oct-2021 12:51:01 Failed to login in UnidentifiedPatientKeyboardTest.unidentifiedPatientKeyboardTest, trying again...
12-Oct-2021 12:51:01 Failed to login in UnidentifiedPatientKeyboardTest.unidentifiedPatientKeyboardTest, trying again...
12-Oct-2021 12:51:01 Failed to login in UnidentifiedPatientKeyboardTest.unidentifiedPatientKeyboardTest, trying again...
12-Oct-2021 12:51:01 Failed to login in UnidentifiedPatientKeyboardTest.unidentifiedPatientKeyboardTest, trying again...
12-Oct-2021 12:51:01 Failed to login in UnidentifiedPatientKeyboardTest.unidentifiedPatientKeyboardTest, trying again...
12-Oct-2021 12:51:01 Failed to login in UnidentifiedPatientKeyboardTest.unidentifiedPatientKeyboardTest, trying again...
12-Oct-2021 12:51:01 Failed to login in UnidentifiedPatientKeyboardTest.unidentifiedPatientKeyboardTest, trying again...
12-Oct-2021 12:51:01 Failed to login in UnidentifiedPatientKeyboardTest.unidentifiedPatientKeyboardTest, trying again...
12-Oct-2021 12:51:02 Failed to login in UnidentifiedPatientKeyboardTest.unidentifiedPatientKeyboardTest, trying again...
12-Oct-2021 12:51:02 Failed to login in UnidentifiedPatientKeyboardTest.unidentifiedPatientKeyboardTest, trying again...
12-Oct-2021 12:51:02 Failed to login in UnidentifiedPatientKeyboardTest.unidentifiedPatientKeyboardTest, trying again...
12-Oct-2021 12:51:02 Failed to login in UnidentifiedPatientKeyboardTest.unidentifiedPatientKeyboardTest, trying again...
12-Oct-2021 12:51:02 Failed to login in UnidentifiedPatientKeyboardTest.unidentifiedPatientKeyboardTest, trying again...
12-Oct-2021 12:51:02 Failed to login in UnidentifiedPatientKeyboardTest.unidentifiedPatientKeyboardTest, trying again...
12-Oct-2021 12:51:02 Failed to login in UnidentifiedPatientKeyboardTest.unidentifiedPatientKeyboardTest, trying again...
12-Oct-2021 12:51:02 Failed to login in UnidentifiedPatientKeyboardTest.unidentifiedPatientKeyboardTest, trying again...
12-Oct-2021 12:51:02 Failed to login in UnidentifiedPatientKeyboardTest.unidentifiedPatientKeyboardTest, trying again...
12-Oct-2021 12:51:02 Failed to login in UnidentifiedPatientKeyboardTest.unidentifiedPatientKeyboardTest, trying again...
12-Oct-2021 12:51:02 Failed to login in UnidentifiedPatientKeyboardTest.unidentifiedPatientKeyboardTest, trying again...
12-Oct-2021 12:51:02 Failed to login in UnidentifiedPatientKeyboardTest.unidentifiedPatientKeyboardTest, trying again...
12-Oct-2021 12:51:02 Failed to login in UnidentifiedPatientKeyboardTest.unidentifiedPatientKeyboardTest, trying again...
12-Oct-2021 12:51:02 Failed to login in UnidentifiedPatientKeyboardTest.unidentifiedPatientKeyboardTest, trying again...
12-Oct-2021 12:51:02 Failed to login in UnidentifiedPatientKeyboardTest.unidentifiedPatientKeyboardTest, trying again...
12-Oct-2021 12:51:02 Failed to login in UnidentifiedPatientKeyboardTest.unidentifiedPatientKeyboardTest, trying again...
12-Oct-2021 12:51:02 Failed to login in UnidentifiedPatientKeyboardTest.unidentifiedPatientKeyboardTest, trying again...
12-Oct-2021 12:51:02 Failed to login in UnidentifiedPatientKeyboardTest.unidentifiedPatientKeyboardTest, trying again...
12-Oct-2021 12:51:02 Failed to login in UnidentifiedPatientKeyboardTest.unidentifiedPatientKeyboardTest, trying again...
12-Oct-2021 12:51:02 Failed to login in UnidentifiedPatientKeyboardTest.unidentifiedPatientKeyboardTest, trying again...
12-Oct-2021 12:51:02 Failed to login in UnidentifiedPatientKeyboardTest.unidentifiedPatientKeyboardTest, trying again...
12-Oct-2021 12:51:02 Failed to login in UnidentifiedPatientKeyboardTest.unidentifiedPatientKeyboardTest, trying again...
12-Oct-2021 12:51:02 Failed to login in UnidentifiedPatientKeyboardTest.unidentifiedPatientKeyboardTest, trying again...
12-Oct-2021 12:51:02 Failed to login in UnidentifiedPatientKeyboardTest.unidentifiedPatientKeyboardTest, trying again...
12-Oct-2021 12:51:02 Failed to login in UnidentifiedPatientKeyboardTest.unidentifiedPatientKeyboardTest, trying again...
12-Oct-2021 12:51:02 Failed to login in UnidentifiedPatientKeyboardTest.unidentifiedPatientKeyboardTest, trying again...
12-Oct-2021 12:51:02 Failed to login in UnidentifiedPatientKeyboardTest.unidentifiedPatientKeyboardTest, trying again...
12-Oct-2021 12:51:03 Failed to login in UnidentifiedPatientKeyboardTest.unidentifiedPatientKeyboardTest, trying again...
12-Oct-2021 12:51:03 Failed to login in UnidentifiedPatientKeyboardTest.unidentifiedPatientKeyboardTest, trying again...
12-Oct-2021 12:51:03 Failed to login in UnidentifiedPatientKeyboardTest.unidentifiedPatientKeyboardTest, trying again...
12-Oct-2021 12:51:03 Failed to login in UnidentifiedPatientKeyboardTest.unidentifiedPatientKeyboardTest, trying again...
12-Oct-2021 12:51:03 Failed to login in UnidentifiedPatientKeyboardTest.unidentifiedPatientKeyboardTest, trying again...
12-Oct-2021 12:51:03 Failed to login in UnidentifiedPatientKeyboardTest.unidentifiedPatientKeyboardTest, trying again...
12-Oct-2021 12:51:03 Failed to login in UnidentifiedPatientKeyboardTest.unidentifiedPatientKeyboardTest, trying again...
12-Oct-2021 12:51:03 Failed to login in UnidentifiedPatientKeyboardTest.unidentifiedPatientKeyboardTest, trying again...
12-Oct-2021 12:51:03 Failed to login in UnidentifiedPatientKeyboardTest.unidentifiedPatientKeyboardTest, trying again...
12-Oct-2021 12:51:03 Failed to login in UnidentifiedPatientKeyboardTest.unidentifiedPatientKeyboardTest, trying again...
12-Oct-2021 12:51:03 Failed to login in UnidentifiedPatientKeyboardTest.unidentifiedPatientKeyboardTest, trying again...
12-Oct-2021 12:51:03 Failed to login in UnidentifiedPatientKeyboardTest.unidentifiedPatientKeyboardTest, trying again...
12-Oct-2021 12:51:03 Failed to login in UnidentifiedPatientKeyboardTest.unidentifiedPatientKeyboardTest, trying again...
12-Oct-2021 12:51:03 Failed to login in UnidentifiedPatientKeyboardTest.unidentifiedPatientKeyboardTest, trying again...
12-Oct-2021 12:51:03 Failed to login in UnidentifiedPatientKeyboardTest.unidentifiedPatientKeyboardTest, trying again...
12-Oct-2021 12:51:03 Failed to login in UnidentifiedPatientKeyboardTest.unidentifiedPatientKeyboardTest, trying again...
12-Oct-2021 12:51:03 Failed to login in UnidentifiedPatientKeyboardTest.unidentifiedPatientKeyboardTest, trying again...
12-Oct-2021 12:51:03 Failed to login in UnidentifiedPatientKeyboardTest.unidentifiedPatientKeyboardTest, trying again...
12-Oct-2021 12:51:03 Failed to login in UnidentifiedPatientKeyboardTest.unidentifiedPatientKeyboardTest, trying again...
12-Oct-2021 12:51:03 Failed to login in UnidentifiedPatientKeyboardTest.unidentifiedPatientKeyboardTest, trying again...
12-Oct-2021 12:51:03 Failed to login in UnidentifiedPatientKeyboardTest.unidentifiedPatientKeyboardTest, trying again...
12-Oct-2021 12:51:03 Failed to login in UnidentifiedPatientKeyboardTest.unidentifiedPatientKeyboardTest, trying again...
12-Oct-2021 12:51:03 Failed to login in UnidentifiedPatientKeyboardTest.unidentifiedPatientKeyboardTest, trying again...
12-Oct-2021 12:51:03 Failed to login in UnidentifiedPatientKeyboardTest.unidentifiedPatientKeyboardTest, trying again...
12-Oct-2021 12:51:04 Failed to login in UnidentifiedPatientKeyboardTest.unidentifiedPatientKeyboardTest, trying again...
12-Oct-2021 12:51:04 Failed to login in UnidentifiedPatientKeyboardTest.unidentifiedPatientKeyboardTest, trying again...
12-Oct-2021 12:51:04 Failed to login in UnidentifiedPatientKeyboardTest.unidentifiedPatientKeyboardTest, trying again...
12-Oct-2021 12:51:04 Failed to login in UnidentifiedPatientKeyboardTest.unidentifiedPatientKeyboardTest, trying again...
12-Oct-2021 12:51:04 Failed to login in UnidentifiedPatientKeyboardTest.unidentifiedPatientKeyboardTest, trying again...
12-Oct-2021 12:51:04 Failed to login in UnidentifiedPatientKeyboardTest.unidentifiedPatientKeyboardTest, trying again...
12-Oct-2021 12:51:04 Failed to login in UnidentifiedPatientKeyboardTest.unidentifiedPatientKeyboardTest, trying again...
12-Oct-2021 12:51:04 Failed to login in UnidentifiedPatientKeyboardTest.unidentifiedPatientKeyboardTest, trying again...
12-Oct-2021 12:51:04 Failed to login in UnidentifiedPatientKeyboardTest.unidentifiedPatientKeyboardTest, trying again...
12-Oct-2021 12:51:04 Failed to login in UnidentifiedPatientKeyboardTest.unidentifiedPatientKeyboardTest, trying again...
12-Oct-2021 12:51:04 Failed to login in UnidentifiedPatientKeyboardTest.unidentifiedPatientKeyboardTest, trying again...
12-Oct-2021 12:51:04 Failed to login in UnidentifiedPatientKeyboardTest.unidentifiedPatientKeyboardTest, trying again...
12-Oct-2021 12:51:04 Failed to login in UnidentifiedPatientKeyboardTest.unidentifiedPatientKeyboardTest, trying again...
12-Oct-2021 12:51:04 Failed to login in UnidentifiedPatientKeyboardTest.unidentifiedPatientKeyboardTest, trying again...
12-Oct-2021 12:51:04 Failed to login in UnidentifiedPatientKeyboardTest.unidentifiedPatientKeyboardTest, trying again...
12-Oct-2021 12:51:04 Failed to login in UnidentifiedPatientKeyboardTest.unidentifiedPatientKeyboardTest, trying again...
12-Oct-2021 12:51:04 Failed to login in UnidentifiedPatientKeyboardTest.unidentifiedPatientKeyboardTest, trying again...
12-Oct-2021 12:51:04 Failed to login in UnidentifiedPatientKeyboardTest.unidentifiedPatientKeyboardTest, trying again...
12-Oct-2021 12:51:04 Failed to login in UnidentifiedPatientKeyboardTest.unidentifiedPatientKeyboardTest, trying again...
12-Oct-2021 12:51:04 Failed to login in UnidentifiedPatientKeyboardTest.unidentifiedPatientKeyboardTest, trying again...
12-Oct-2021 12:51:04 Failed to login in UnidentifiedPatientKeyboardTest.unidentifiedPatientKeyboardTest, trying again...
12-Oct-2021 12:51:04 Failed to login in UnidentifiedPatientKeyboardTest.unidentifiedPatientKeyboardTest, trying again...
12-Oct-2021 12:51:04 Failed to login in UnidentifiedPatientKeyboardTest.unidentifiedPatientKeyboardTest, trying again...
12-Oct-2021 12:51:04 Failed to login in UnidentifiedPatientKeyboardTest.unidentifiedPatientKeyboardTest, trying again...
12-Oct-2021 12:51:04 Failed to login in UnidentifiedPatientKeyboardTest.unidentifiedPatientKeyboardTest, trying again...
12-Oct-2021 12:51:04 Failed to login in UnidentifiedPatientKeyboardTest.unidentifiedPatientKeyboardTest, trying again...
12-Oct-2021 12:51:04 Failed to login in UnidentifiedPatientKeyboardTest.unidentifiedPatientKeyboardTest, trying again...
12-Oct-2021 12:51:04 Failed to login in UnidentifiedPatientKeyboardTest.unidentifiedPatientKeyboardTest, trying again...
12-Oct-2021 12:51:04 Failed to login in UnidentifiedPatientKeyboardTest.unidentifiedPatientKeyboardTest, trying again...
12-Oct-2021 12:51:04 Failed to login in UnidentifiedPatientKeyboardTest.unidentifiedPatientKeyboardTest, trying again...
12-Oct-2021 12:51:04 Failed to login in UnidentifiedPatientKeyboardTest.unidentifiedPatientKeyboardTest, trying again...
12-Oct-2021 12:51:05 Failed to login in UnidentifiedPatientKeyboardTest.unidentifiedPatientKeyboardTest, trying again...
12-Oct-2021 12:51:05 Failed to login in UnidentifiedPatientKeyboardTest.unidentifiedPatientKeyboardTest, trying again...
12-Oct-2021 12:51:05 Failed to login in UnidentifiedPatientKeyboardTest.unidentifiedPatientKeyboardTest, trying again...
12-Oct-2021 12:51:05 Failed to login in UnidentifiedPatientKeyboardTest.unidentifiedPatientKeyboardTest, trying again...
12-Oct-2021 12:51:05 Failed to login in UnidentifiedPatientKeyboardTest.unidentifiedPatientKeyboardTest, trying again...
12-Oct-2021 12:51:05 Failed to login in UnidentifiedPatientKeyboardTest.unidentifiedPatientKeyboardTest, trying again...
12-Oct-2021 12:51:05 Failed to login in UnidentifiedPatientKeyboardTest.unidentifiedPatientKeyboardTest, trying again...
12-Oct-2021 12:51:05 Failed to login in UnidentifiedPatientKeyboardTest.unidentifiedPatientKeyboardTest, trying again...
12-Oct-2021 12:51:05 Failed to login in UnidentifiedPatientKeyboardTest.unidentifiedPatientKeyboardTest, trying again...
12-Oct-2021 12:51:05 Failed to login in UnidentifiedPatientKeyboardTest.unidentifiedPatientKeyboardTest, trying again...
12-Oct-2021 12:51:05 Failed to login in UnidentifiedPatientKeyboardTest.unidentifiedPatientKeyboardTest, trying again...
12-Oct-2021 12:51:05 Failed to login in UnidentifiedPatientKeyboardTest.unidentifiedPatientKeyboardTest, trying again...
12-Oct-2021 12:51:05 Failed to login in UnidentifiedPatientKeyboardTest.unidentifiedPatientKeyboardTest, trying again...
12-Oct-2021 12:51:05 Failed to login in UnidentifiedPatientKeyboardTest.unidentifiedPatientKeyboardTest, trying again...
12-Oct-2021 12:51:05 Failed to login in UnidentifiedPatientKeyboardTest.unidentifiedPatientKeyboardTest, trying again...
12-Oct-2021 12:51:05 Failed to login in UnidentifiedPatientKeyboardTest.unidentifiedPatientKeyboardTest, trying again...
12-Oct-2021 12:51:05 Failed to login in UnidentifiedPatientKeyboardTest.unidentifiedPatientKeyboardTest, trying again...
12-Oct-2021 12:51:05 Failed to login in UnidentifiedPatientKeyboardTest.unidentifiedPatientKeyboardTest, trying again...
12-Oct-2021 12:51:05 Failed to login in UnidentifiedPatientKeyboardTest.unidentifiedPatientKeyboardTest, trying again...
12-Oct-2021 12:51:05 Failed to login in UnidentifiedPatientKeyboardTest.unidentifiedPatientKeyboardTest, trying again...
12-Oct-2021 12:51:05 Failed to login in UnidentifiedPatientKeyboardTest.unidentifiedPatientKeyboardTest, trying again...
12-Oct-2021 12:51:05 Failed to login in UnidentifiedPatientKeyboardTest.unidentifiedPatientKeyboardTest, trying again...
12-Oct-2021 12:51:05 Failed to login in UnidentifiedPatientKeyboardTest.unidentifiedPatientKeyboardTest, trying again...
12-Oct-2021 12:51:05 Failed to login in UnidentifiedPatientKeyboardTest.unidentifiedPatientKeyboardTest, trying again...
12-Oct-2021 12:51:05 Failed to login in UnidentifiedPatientKeyboardTest.unidentifiedPatientKeyboardTest, trying again...
12-Oct-2021 12:51:05 Failed to login in UnidentifiedPatientKeyboardTest.unidentifiedPatientKeyboardTest, trying again...
12-Oct-2021 12:51:05 Failed to login in UnidentifiedPatientKeyboardTest.unidentifiedPatientKeyboardTest, trying again...
12-Oct-2021 12:51:05 Failed to login in UnidentifiedPatientKeyboardTest.unidentifiedPatientKeyboardTest, trying again...
12-Oct-2021 12:51:05 Failed to login in UnidentifiedPatientKeyboardTest.unidentifiedPatientKeyboardTest, trying again...
12-Oct-2021 12:51:05 Failed to login in UnidentifiedPatientKeyboardTest.unidentifiedPatientKeyboardTest, trying again...
12-Oct-2021 12:51:06 Failed to login in UnidentifiedPatientKeyboardTest.unidentifiedPatientKeyboardTest, trying again...
12-Oct-2021 12:51:06 Failed to login in UnidentifiedPatientKeyboardTest.unidentifiedPatientKeyboardTest, trying again...
12-Oct-2021 12:51:06 Failed to login in UnidentifiedPatientKeyboardTest.unidentifiedPatientKeyboardTest, trying again...
12-Oct-2021 12:51:06 Failed to login in UnidentifiedPatientKeyboardTest.unidentifiedPatientKeyboardTest, trying again...
12-Oct-2021 12:51:06 Failed to login in UnidentifiedPatientKeyboardTest.unidentifiedPatientKeyboardTest, trying again...
12-Oct-2021 12:51:06 Failed to login in UnidentifiedPatientKeyboardTest.unidentifiedPatientKeyboardTest, trying again...
12-Oct-2021 12:51:06 Failed to login in UnidentifiedPatientKeyboardTest.unidentifiedPatientKeyboardTest, trying again...
12-Oct-2021 12:51:06 Failed to login in UnidentifiedPatientKeyboardTest.unidentifiedPatientKeyboardTest, trying again...
12-Oct-2021 12:51:06 Failed to login in UnidentifiedPatientKeyboardTest.unidentifiedPatientKeyboardTest, trying again...
12-Oct-2021 12:51:06 Failed to login in UnidentifiedPatientKeyboardTest.unidentifiedPatientKeyboardTest, trying again...
12-Oct-2021 12:51:06 Failed to login in UnidentifiedPatientKeyboardTest.unidentifiedPatientKeyboardTest, trying again...
12-Oct-2021 12:51:06 Failed to login in UnidentifiedPatientKeyboardTest.unidentifiedPatientKeyboardTest, trying again...
12-Oct-2021 12:51:06 Failed to login in UnidentifiedPatientKeyboardTest.unidentifiedPatientKeyboardTest, trying again...
12-Oct-2021 12:51:06 Failed to login in UnidentifiedPatientKeyboardTest.unidentifiedPatientKeyboardTest, trying again...
12-Oct-2021 12:51:06 Failed to login in UnidentifiedPatientKeyboardTest.unidentifiedPatientKeyboardTest, trying again...
12-Oct-2021 12:51:06 Failed to login in UnidentifiedPatientKeyboardTest.unidentifiedPatientKeyboardTest, trying again...
12-Oct-2021 12:51:06 Failed to login in UnidentifiedPatientKeyboardTest.unidentifiedPatientKeyboardTest, trying again...
12-Oct-2021 12:51:06 Failed to login in UnidentifiedPatientKeyboardTest.unidentifiedPatientKeyboardTest, trying again...
12-Oct-2021 12:51:06 Failed to login in UnidentifiedPatientKeyboardTest.unidentifiedPatientKeyboardTest, trying again...
12-Oct-2021 12:51:06 Failed to login in UnidentifiedPatientKeyboardTest.unidentifiedPatientKeyboardTest, trying again...
12-Oct-2021 12:51:07 Failed to login in UnidentifiedPatientKeyboardTest.unidentifiedPatientKeyboardTest, trying again...
12-Oct-2021 12:51:07 Failed to login in UnidentifiedPatientKeyboardTest.unidentifiedPatientKeyboardTest, trying again...
12-Oct-2021 12:51:07 Failed to login in UnidentifiedPatientKeyboardTest.unidentifiedPatientKeyboardTest, trying again...
12-Oct-2021 12:51:07 Failed to login in UnidentifiedPatientKeyboardTest.unidentifiedPatientKeyboardTest, trying again...
12-Oct-2021 12:51:07 Failed to login in UnidentifiedPatientKeyboardTest.unidentifiedPatientKeyboardTest, trying again...
12-Oct-2021 12:51:07 Failed to login in UnidentifiedPatientKeyboardTest.unidentifiedPatientKeyboardTest, trying again...
12-Oct-2021 12:51:07 Failed to login in UnidentifiedPatientKeyboardTest.unidentifiedPatientKeyboardTest, trying again...
12-Oct-2021 12:51:07 Failed to login in UnidentifiedPatientKeyboardTest.unidentifiedPatientKeyboardTest, trying again...
12-Oct-2021 12:51:07 Failed to login in UnidentifiedPatientKeyboardTest.unidentifiedPatientKeyboardTest, trying again...
12-Oct-2021 12:51:07 Failed to login in UnidentifiedPatientKeyboardTest.unidentifiedPatientKeyboardTest, trying again...
12-Oct-2021 12:51:07 Failed to login in UnidentifiedPatientKeyboardTest.unidentifiedPatientKeyboardTest, trying again...
12-Oct-2021 12:51:07 Failed to login in UnidentifiedPatientKeyboardTest.unidentifiedPatientKeyboardTest, trying again...
12-Oct-2021 12:51:07 Failed to login in UnidentifiedPatientKeyboardTest.unidentifiedPatientKeyboardTest, trying again...
12-Oct-2021 12:51:07 Failed to login in UnidentifiedPatientKeyboardTest.unidentifiedPatientKeyboardTest, trying again...
12-Oct-2021 12:51:07 Failed to login in UnidentifiedPatientKeyboardTest.unidentifiedPatientKeyboardTest, trying again...
12-Oct-2021 12:51:07 Failed to login in UnidentifiedPatientKeyboardTest.unidentifiedPatientKeyboardTest, trying again...
12-Oct-2021 12:51:07 Failed to login in UnidentifiedPatientKeyboardTest.unidentifiedPatientKeyboardTest, trying again...
12-Oct-2021 12:51:07 Failed to login in UnidentifiedPatientKeyboardTest.unidentifiedPatientKeyboardTest, trying again...
12-Oct-2021 12:51:07 Failed to login in UnidentifiedPatientKeyboardTest.unidentifiedPatientKeyboardTest, trying again...
12-Oct-2021 12:51:07 Failed to login in UnidentifiedPatientKeyboardTest.unidentifiedPatientKeyboardTest, trying again...
12-Oct-2021 12:51:07 Failed to login in UnidentifiedPatientKeyboardTest.unidentifiedPatientKeyboardTest, trying again...
12-Oct-2021 12:51:07 Failed to login in UnidentifiedPatientKeyboardTest.unidentifiedPatientKeyboardTest, trying again...
12-Oct-2021 12:51:07 Failed to login in UnidentifiedPatientKeyboardTest.unidentifiedPatientKeyboardTest, trying again...
12-Oct-2021 12:51:07 Failed to login in UnidentifiedPatientKeyboardTest.unidentifiedPatientKeyboardTest, trying again...
12-Oct-2021 12:51:07 Failed to login in UnidentifiedPatientKeyboardTest.unidentifiedPatientKeyboardTest, trying again...
12-Oct-2021 12:51:08 Failed to login in UnidentifiedPatientKeyboardTest.unidentifiedPatientKeyboardTest, trying again...
12-Oct-2021 12:51:08 Failed to login in UnidentifiedPatientKeyboardTest.unidentifiedPatientKeyboardTest, trying again...
12-Oct-2021 12:51:08 Failed to login in UnidentifiedPatientKeyboardTest.unidentifiedPatientKeyboardTest, trying again...
12-Oct-2021 12:51:08 Failed to login in UnidentifiedPatientKeyboardTest.unidentifiedPatientKeyboardTest, trying again...
12-Oct-2021 12:51:08 Failed to login in UnidentifiedPatientKeyboardTest.unidentifiedPatientKeyboardTest, trying again...
12-Oct-2021 12:51:08 Failed to login in UnidentifiedPatientKeyboardTest.unidentifiedPatientKeyboardTest, trying again...
12-Oct-2021 12:51:08 Failed to login in UnidentifiedPatientKeyboardTest.unidentifiedPatientKeyboardTest, trying again...
12-Oct-2021 12:51:08 Failed to login in UnidentifiedPatientKeyboardTest.unidentifiedPatientKeyboardTest, trying again...
12-Oct-2021 12:51:08 Failed to login in UnidentifiedPatientKeyboardTest.unidentifiedPatientKeyboardTest, trying again...
12-Oct-2021 12:51:08 Failed to login in UnidentifiedPatientKeyboardTest.unidentifiedPatientKeyboardTest, trying again...
12-Oct-2021 12:51:08 Failed to login in UnidentifiedPatientKeyboardTest.unidentifiedPatientKeyboardTest, trying again...
12-Oct-2021 12:51:08 Failed to login in UnidentifiedPatientKeyboardTest.unidentifiedPatientKeyboardTest, trying again...
12-Oct-2021 12:51:08 Failed to login in UnidentifiedPatientKeyboardTest.unidentifiedPatientKeyboardTest, trying again...
12-Oct-2021 12:51:08 Failed to login in UnidentifiedPatientKeyboardTest.unidentifiedPatientKeyboardTest, trying again...
12-Oct-2021 12:51:08 Failed to login in UnidentifiedPatientKeyboardTest.unidentifiedPatientKeyboardTest, trying again...
12-Oct-2021 12:51:08 Failed to login in UnidentifiedPatientKeyboardTest.unidentifiedPatientKeyboardTest, trying again...
12-Oct-2021 12:51:08 Failed to login in UnidentifiedPatientKeyboardTest.unidentifiedPatientKeyboardTest, trying again...
12-Oct-2021 12:51:08 Failed to login in UnidentifiedPatientKeyboardTest.unidentifiedPatientKeyboardTest, trying again...
12-Oct-2021 12:51:08 Failed to login in UnidentifiedPatientKeyboardTest.unidentifiedPatientKeyboardTest, trying again...
12-Oct-2021 12:51:08 Failed to login in UnidentifiedPatientKeyboardTest.unidentifiedPatientKeyboardTest, trying again...
12-Oct-2021 12:51:08 Failed to login in UnidentifiedPatientKeyboardTest.unidentifiedPatientKeyboardTest, trying again...
12-Oct-2021 12:51:08 Failed to login in UnidentifiedPatientKeyboardTest.unidentifiedPatientKeyboardTest, trying again...
12-Oct-2021 12:51:08 Failed to login in UnidentifiedPatientKeyboardTest.unidentifiedPatientKeyboardTest, trying again...
12-Oct-2021 12:51:09 Failed to login in UnidentifiedPatientKeyboardTest.unidentifiedPatientKeyboardTest, trying again...
12-Oct-2021 12:51:09 Failed to login in UnidentifiedPatientKeyboardTest.unidentifiedPatientKeyboardTest, trying again...
12-Oct-2021 12:51:09 Failed to login in UnidentifiedPatientKeyboardTest.unidentifiedPatientKeyboardTest, trying again...
12-Oct-2021 12:51:09 Failed to login in UnidentifiedPatientKeyboardTest.unidentifiedPatientKeyboardTest, trying again...
12-Oct-2021 12:51:09 Failed to login in UnidentifiedPatientKeyboardTest.unidentifiedPatientKeyboardTest, trying again...
12-Oct-2021 12:51:09 Failed to login in UnidentifiedPatientKeyboardTest.unidentifiedPatientKeyboardTest, trying again...
12-Oct-2021 12:51:09 Failed to login in UnidentifiedPatientKeyboardTest.unidentifiedPatientKeyboardTest, trying again...
12-Oct-2021 12:51:09 Failed to login in UnidentifiedPatientKeyboardTest.unidentifiedPatientKeyboardTest, trying again...
12-Oct-2021 12:51:09 Failed to login in UnidentifiedPatientKeyboardTest.unidentifiedPatientKeyboardTest, trying again...
12-Oct-2021 12:51:09 Failed to login in UnidentifiedPatientKeyboardTest.unidentifiedPatientKeyboardTest, trying again...
12-Oct-2021 12:51:09 Failed to login in UnidentifiedPatientKeyboardTest.unidentifiedPatientKeyboardTest, trying again...
12-Oct-2021 12:51:09 Failed to login in UnidentifiedPatientKeyboardTest.unidentifiedPatientKeyboardTest, trying again...
12-Oct-2021 12:51:09 Failed to login in UnidentifiedPatientKeyboardTest.unidentifiedPatientKeyboardTest, trying again...
12-Oct-2021 12:51:09 Failed to login in UnidentifiedPatientKeyboardTest.unidentifiedPatientKeyboardTest, trying again...
12-Oct-2021 12:51:09 Failed to login in UnidentifiedPatientKeyboardTest.unidentifiedPatientKeyboardTest, trying again...
12-Oct-2021 12:51:09 Failed to login in UnidentifiedPatientKeyboardTest.unidentifiedPatientKeyboardTest, trying again...
12-Oct-2021 12:51:09 Failed to login in UnidentifiedPatientKeyboardTest.unidentifiedPatientKeyboardTest, trying again...
12-Oct-2021 12:51:09 Failed to login in UnidentifiedPatientKeyboardTest.unidentifiedPatientKeyboardTest, trying again...
12-Oct-2021 12:51:09 Failed to login in UnidentifiedPatientKeyboardTest.unidentifiedPatientKeyboardTest, trying again...
12-Oct-2021 12:51:09 Failed to login in UnidentifiedPatientKeyboardTest.unidentifiedPatientKeyboardTest, trying again...
12-Oct-2021 12:51:09 Failed to login in UnidentifiedPatientKeyboardTest.unidentifiedPatientKeyboardTest, trying again...
12-Oct-2021 12:51:09 Failed to login in UnidentifiedPatientKeyboardTest.unidentifiedPatientKeyboardTest, trying again...
12-Oct-2021 12:51:09 Failed to login in UnidentifiedPatientKeyboardTest.unidentifiedPatientKeyboardTest, trying again...
12-Oct-2021 12:51:09 Failed to login in UnidentifiedPatientKeyboardTest.unidentifiedPatientKeyboardTest, trying again...
12-Oct-2021 12:51:10 Failed to login in UnidentifiedPatientKeyboardTest.unidentifiedPatientKeyboardTest, trying again...
12-Oct-2021 12:51:10 Failed to login in UnidentifiedPatientKeyboardTest.unidentifiedPatientKeyboardTest, trying again...
12-Oct-2021 12:51:10 Failed to login in UnidentifiedPatientKeyboardTest.unidentifiedPatientKeyboardTest, trying again...
12-Oct-2021 12:51:10 Failed to login in UnidentifiedPatientKeyboardTest.unidentifiedPatientKeyboardTest, trying again...
12-Oct-2021 12:51:10 Failed to login in UnidentifiedPatientKeyboardTest.unidentifiedPatientKeyboardTest, trying again...
12-Oct-2021 12:51:10 Failed to login in UnidentifiedPatientKeyboardTest.unidentifiedPatientKeyboardTest, trying again...
12-Oct-2021 12:51:10 Failed to login in UnidentifiedPatientKeyboardTest.unidentifiedPatientKeyboardTest, trying again...
12-Oct-2021 12:51:10 Failed to login in UnidentifiedPatientKeyboardTest.unidentifiedPatientKeyboardTest, trying again...
12-Oct-2021 12:51:10 Failed to login in UnidentifiedPatientKeyboardTest.unidentifiedPatientKeyboardTest, trying again...
12-Oct-2021 12:51:10 Failed to login in UnidentifiedPatientKeyboardTest.unidentifiedPatientKeyboardTest, trying again...
12-Oct-2021 12:51:10 Failed to login in UnidentifiedPatientKeyboardTest.unidentifiedPatientKeyboardTest, trying again...
12-Oct-2021 12:51:10 Failed to login in UnidentifiedPatientKeyboardTest.unidentifiedPatientKeyboardTest, trying again...
12-Oct-2021 12:51:10 Failed to login in UnidentifiedPatientKeyboardTest.unidentifiedPatientKeyboardTest, trying again...
12-Oct-2021 12:51:10 Failed to login in UnidentifiedPatientKeyboardTest.unidentifiedPatientKeyboardTest, trying again...
12-Oct-2021 12:51:10 Failed to login in UnidentifiedPatientKeyboardTest.unidentifiedPatientKeyboardTest, trying again...
12-Oct-2021 12:51:10 Failed to login in UnidentifiedPatientKeyboardTest.unidentifiedPatientKeyboardTest, trying again...
12-Oct-2021 12:51:10 Failed to login in UnidentifiedPatientKeyboardTest.unidentifiedPatientKeyboardTest, trying again...
12-Oct-2021 12:51:10 Failed to login in UnidentifiedPatientKeyboardTest.unidentifiedPatientKeyboardTest, trying again...
12-Oct-2021 12:51:10 Failed to login in UnidentifiedPatientKeyboardTest.unidentifiedPatientKeyboardTest, trying again...
12-Oct-2021 12:51:10 Failed to login in UnidentifiedPatientKeyboardTest.unidentifiedPatientKeyboardTest, trying again...
12-Oct-2021 12:51:10 Failed to login in UnidentifiedPatientKeyboardTest.unidentifiedPatientKeyboardTest, trying again...
12-Oct-2021 12:51:10 Failed to login in UnidentifiedPatientKeyboardTest.unidentifiedPatientKeyboardTest, trying again...
12-Oct-2021 12:51:10 Failed to login in UnidentifiedPatientKeyboardTest.unidentifiedPatientKeyboardTest, trying again...
12-Oct-2021 12:51:10 Failed to login in UnidentifiedPatientKeyboardTest.unidentifiedPatientKeyboardTest, trying again...
12-Oct-2021 12:51:10 Failed to login in UnidentifiedPatientKeyboardTest.unidentifiedPatientKeyboardTest, trying again...
12-Oct-2021 12:51:11 Failed to login in UnidentifiedPatientKeyboardTest.unidentifiedPatientKeyboardTest, trying again...
12-Oct-2021 12:51:11 Failed to login in UnidentifiedPatientKeyboardTest.unidentifiedPatientKeyboardTest, trying again...
12-Oct-2021 12:51:11 Failed to login in UnidentifiedPatientKeyboardTest.unidentifiedPatientKeyboardTest, trying again...
12-Oct-2021 12:51:11 Failed to login in UnidentifiedPatientKeyboardTest.unidentifiedPatientKeyboardTest, trying again...
12-Oct-2021 12:51:11 Failed to login in UnidentifiedPatientKeyboardTest.unidentifiedPatientKeyboardTest, trying again...
12-Oct-2021 12:51:11 Failed to login in UnidentifiedPatientKeyboardTest.unidentifiedPatientKeyboardTest, trying again...
12-Oct-2021 12:51:11 Failed to login in UnidentifiedPatientKeyboardTest.unidentifiedPatientKeyboardTest, trying again...
12-Oct-2021 12:51:11 Failed to login in UnidentifiedPatientKeyboardTest.unidentifiedPatientKeyboardTest, trying again...
12-Oct-2021 12:51:11 Failed to login in UnidentifiedPatientKeyboardTest.unidentifiedPatientKeyboardTest, trying again...
12-Oct-2021 12:51:11 Failed to login in UnidentifiedPatientKeyboardTest.unidentifiedPatientKeyboardTest, trying again...
12-Oct-2021 12:51:11 Failed to login in UnidentifiedPatientKeyboardTest.unidentifiedPatientKeyboardTest, trying again...
12-Oct-2021 12:51:11 Failed to login in UnidentifiedPatientKeyboardTest.unidentifiedPatientKeyboardTest, trying again...
12-Oct-2021 12:51:11 Failed to login in UnidentifiedPatientKeyboardTest.unidentifiedPatientKeyboardTest, trying again...
12-Oct-2021 12:51:11 Failed to login in UnidentifiedPatientKeyboardTest.unidentifiedPatientKeyboardTest, trying again...
12-Oct-2021 12:51:11 Failed to login in UnidentifiedPatientKeyboardTest.unidentifiedPatientKeyboardTest, trying again...
12-Oct-2021 12:51:11 Failed to login in UnidentifiedPatientKeyboardTest.unidentifiedPatientKeyboardTest, trying again...
12-Oct-2021 12:51:11 Failed to login in UnidentifiedPatientKeyboardTest.unidentifiedPatientKeyboardTest, trying again...
12-Oct-2021 12:51:11 Failed to login in UnidentifiedPatientKeyboardTest.unidentifiedPatientKeyboardTest, trying again...
12-Oct-2021 12:51:11 Failed to login in UnidentifiedPatientKeyboardTest.unidentifiedPatientKeyboardTest, trying again...
12-Oct-2021 12:51:11 Failed to login in UnidentifiedPatientKeyboardTest.unidentifiedPatientKeyboardTest, trying again...
12-Oct-2021 12:51:11 Failed to login in UnidentifiedPatientKeyboardTest.unidentifiedPatientKeyboardTest, trying again...
12-Oct-2021 12:51:11 Failed to login in UnidentifiedPatientKeyboardTest.unidentifiedPatientKeyboardTest, trying again...
12-Oct-2021 12:51:11 Failed to login in UnidentifiedPatientKeyboardTest.unidentifiedPatientKeyboardTest, trying again...
12-Oct-2021 12:51:12 Failed to login in UnidentifiedPatientKeyboardTest.unidentifiedPatientKeyboardTest, trying again...
12-Oct-2021 12:51:12 Failed to login in UnidentifiedPatientKeyboardTest.unidentifiedPatientKeyboardTest, trying again...
12-Oct-2021 12:51:12 Failed to login in UnidentifiedPatientKeyboardTest.unidentifiedPatientKeyboardTest, trying again...
12-Oct-2021 12:51:12 Failed to login in UnidentifiedPatientKeyboardTest.unidentifiedPatientKeyboardTest, trying again...
12-Oct-2021 12:51:12 Failed to login in UnidentifiedPatientKeyboardTest.unidentifiedPatientKeyboardTest, trying again...
12-Oct-2021 12:51:12 Failed to login in UnidentifiedPatientKeyboardTest.unidentifiedPatientKeyboardTest, trying again...
12-Oct-2021 12:51:12 Failed to login in UnidentifiedPatientKeyboardTest.unidentifiedPatientKeyboardTest, trying again...
12-Oct-2021 12:51:12 Failed to login in UnidentifiedPatientKeyboardTest.unidentifiedPatientKeyboardTest, trying again...
12-Oct-2021 12:51:12 Failed to login in UnidentifiedPatientKeyboardTest.unidentifiedPatientKeyboardTest, trying again...
12-Oct-2021 12:51:12 Failed to login in UnidentifiedPatientKeyboardTest.unidentifiedPatientKeyboardTest, trying again...
12-Oct-2021 12:51:12 Failed to login in UnidentifiedPatientKeyboardTest.unidentifiedPatientKeyboardTest, trying again...
12-Oct-2021 12:51:12 Failed to login in UnidentifiedPatientKeyboardTest.unidentifiedPatientKeyboardTest, trying again...
12-Oct-2021 12:51:12 Failed to login in UnidentifiedPatientKeyboardTest.unidentifiedPatientKeyboardTest, trying again...
12-Oct-2021 12:51:12 Failed to login in UnidentifiedPatientKeyboardTest.unidentifiedPatientKeyboardTest, trying again...
12-Oct-2021 12:51:12 Failed to login in UnidentifiedPatientKeyboardTest.unidentifiedPatientKeyboardTest, trying again...
12-Oct-2021 12:51:12 Failed to login in UnidentifiedPatientKeyboardTest.unidentifiedPatientKeyboardTest, trying again...
12-Oct-2021 12:51:12 Failed to login in UnidentifiedPatientKeyboardTest.unidentifiedPatientKeyboardTest, trying again...
12-Oct-2021 12:51:12 Failed to login in UnidentifiedPatientKeyboardTest.unidentifiedPatientKeyboardTest, trying again...
12-Oct-2021 12:51:12 Failed to login in UnidentifiedPatientKeyboardTest.unidentifiedPatientKeyboardTest, trying again...
12-Oct-2021 12:51:12 Failed to login in UnidentifiedPatientKeyboardTest.unidentifiedPatientKeyboardTest, trying again...
12-Oct-2021 12:51:12 Failed to login in UnidentifiedPatientKeyboardTest.unidentifiedPatientKeyboardTest, trying again...
12-Oct-2021 12:51:12 Failed to login in UnidentifiedPatientKeyboardTest.unidentifiedPatientKeyboardTest, trying again...
12-Oct-2021 12:51:12 Failed to login in UnidentifiedPatientKeyboardTest.unidentifiedPatientKeyboardTest, trying again...
12-Oct-2021 12:51:12 Failed to login in UnidentifiedPatientKeyboardTest.unidentifiedPatientKeyboardTest, trying again...
12-Oct-2021 12:51:12 Failed to login in UnidentifiedPatientKeyboardTest.unidentifiedPatientKeyboardTest, trying again...
12-Oct-2021 12:51:12 Failed to login in UnidentifiedPatientKeyboardTest.unidentifiedPatientKeyboardTest, trying again...
12-Oct-2021 12:51:12 Failed to login in UnidentifiedPatientKeyboardTest.unidentifiedPatientKeyboardTest, trying again...
12-Oct-2021 12:51:13 Failed to login in UnidentifiedPatientKeyboardTest.unidentifiedPatientKeyboardTest, trying again...
12-Oct-2021 12:51:13 Failed to login in UnidentifiedPatientKeyboardTest.unidentifiedPatientKeyboardTest, trying again...
12-Oct-2021 12:51:13 Failed to login in UnidentifiedPatientKeyboardTest.unidentifiedPatientKeyboardTest, trying again...
12-Oct-2021 12:51:13 Failed to login in UnidentifiedPatientKeyboardTest.unidentifiedPatientKeyboardTest, trying again...
12-Oct-2021 12:51:13 Failed to login in UnidentifiedPatientKeyboardTest.unidentifiedPatientKeyboardTest, trying again...
12-Oct-2021 12:51:13 Failed to login in UnidentifiedPatientKeyboardTest.unidentifiedPatientKeyboardTest, trying again...
12-Oct-2021 12:51:13 Failed to login in UnidentifiedPatientKeyboardTest.unidentifiedPatientKeyboardTest, trying again...
12-Oct-2021 12:51:13 Failed to login in UnidentifiedPatientKeyboardTest.unidentifiedPatientKeyboardTest, trying again...
12-Oct-2021 12:51:13 Failed to login in UnidentifiedPatientKeyboardTest.unidentifiedPatientKeyboardTest, trying again...
12-Oct-2021 12:51:13 Failed to login in UnidentifiedPatientKeyboardTest.unidentifiedPatientKeyboardTest, trying again...
12-Oct-2021 12:51:13 Failed to login in UnidentifiedPatientKeyboardTest.unidentifiedPatientKeyboardTest, trying again...
12-Oct-2021 12:51:13 Failed to login in UnidentifiedPatientKeyboardTest.unidentifiedPatientKeyboardTest, trying again...
12-Oct-2021 12:51:13 Failed to login in UnidentifiedPatientKeyboardTest.unidentifiedPatientKeyboardTest, trying again...
12-Oct-2021 12:51:13 Failed to login in UnidentifiedPatientKeyboardTest.unidentifiedPatientKeyboardTest, trying again...
12-Oct-2021 12:51:13 Failed to login in UnidentifiedPatientKeyboardTest.unidentifiedPatientKeyboardTest, trying again...
12-Oct-2021 12:51:13 Failed to login in UnidentifiedPatientKeyboardTest.unidentifiedPatientKeyboardTest, trying again...
12-Oct-2021 12:51:13 Failed to login in UnidentifiedPatientKeyboardTest.unidentifiedPatientKeyboardTest, trying again...
12-Oct-2021 12:51:13 Failed to login in UnidentifiedPatientKeyboardTest.unidentifiedPatientKeyboardTest, trying again...
12-Oct-2021 12:51:13 Failed to login in UnidentifiedPatientKeyboardTest.unidentifiedPatientKeyboardTest, trying again...
12-Oct-2021 12:51:13 Failed to login in UnidentifiedPatientKeyboardTest.unidentifiedPatientKeyboardTest, trying again...
12-Oct-2021 12:51:13 Failed to login in UnidentifiedPatientKeyboardTest.unidentifiedPatientKeyboardTest, trying again...
12-Oct-2021 12:51:13 Failed to login in UnidentifiedPatientKeyboardTest.unidentifiedPatientKeyboardTest, trying again...
12-Oct-2021 12:51:14 Failed to login in UnidentifiedPatientKeyboardTest.unidentifiedPatientKeyboardTest, trying again...
12-Oct-2021 12:51:14 Failed to login in UnidentifiedPatientKeyboardTest.unidentifiedPatientKeyboardTest, trying again...
12-Oct-2021 12:51:14 Failed to login in UnidentifiedPatientKeyboardTest.unidentifiedPatientKeyboardTest, trying again...
12-Oct-2021 12:51:14 Failed to login in UnidentifiedPatientKeyboardTest.unidentifiedPatientKeyboardTest, trying again...
12-Oct-2021 12:51:14 Failed to login in UnidentifiedPatientKeyboardTest.unidentifiedPatientKeyboardTest, trying again...
12-Oct-2021 12:51:14 Failed to login in UnidentifiedPatientKeyboardTest.unidentifiedPatientKeyboardTest, trying again...
12-Oct-2021 12:51:14 Failed to login in UnidentifiedPatientKeyboardTest.unidentifiedPatientKeyboardTest, trying again...
12-Oct-2021 12:51:14 Failed to login in UnidentifiedPatientKeyboardTest.unidentifiedPatientKeyboardTest, trying again...
12-Oct-2021 12:51:14 Failed to login in UnidentifiedPatientKeyboardTest.unidentifiedPatientKeyboardTest, trying again...
12-Oct-2021 12:51:14 Failed to login in UnidentifiedPatientKeyboardTest.unidentifiedPatientKeyboardTest, trying again...
12-Oct-2021 12:51:14 Failed to login in UnidentifiedPatientKeyboardTest.unidentifiedPatientKeyboardTest, trying again...
12-Oct-2021 12:51:14 Failed to login in UnidentifiedPatientKeyboardTest.unidentifiedPatientKeyboardTest, trying again...
12-Oct-2021 12:51:14 Failed to login in UnidentifiedPatientKeyboardTest.unidentifiedPatientKeyboardTest, trying again...
12-Oct-2021 12:51:14 Failed to login in UnidentifiedPatientKeyboardTest.unidentifiedPatientKeyboardTest, trying again...
12-Oct-2021 12:51:14 Failed to login in UnidentifiedPatientKeyboardTest.unidentifiedPatientKeyboardTest, trying again...
12-Oct-2021 12:51:14 Failed to login in UnidentifiedPatientKeyboardTest.unidentifiedPatientKeyboardTest, trying again...
12-Oct-2021 12:51:14 Failed to login in UnidentifiedPatientKeyboardTest.unidentifiedPatientKeyboardTest, trying again...
12-Oct-2021 12:51:14 Failed to login in UnidentifiedPatientKeyboardTest.unidentifiedPatientKeyboardTest, trying again...
12-Oct-2021 12:51:14 Failed to login in UnidentifiedPatientKeyboardTest.unidentifiedPatientKeyboardTest, trying again...
12-Oct-2021 12:51:14 Failed to login in UnidentifiedPatientKeyboardTest.unidentifiedPatientKeyboardTest, trying again...
12-Oct-2021 12:51:14 Failed to login in UnidentifiedPatientKeyboardTest.unidentifiedPatientKeyboardTest, trying again...
12-Oct-2021 12:51:14 Failed to login in UnidentifiedPatientKeyboardTest.unidentifiedPatientKeyboardTest, trying again...
12-Oct-2021 12:51:14 Failed to login in UnidentifiedPatientKeyboardTest.unidentifiedPatientKeyboardTest, trying again...
12-Oct-2021 12:51:14 Failed to login in UnidentifiedPatientKeyboardTest.unidentifiedPatientKeyboardTest, trying again...
12-Oct-2021 12:51:14 Failed to login in UnidentifiedPatientKeyboardTest.unidentifiedPatientKeyboardTest, trying again...
12-Oct-2021 12:51:14 Failed to login in UnidentifiedPatientKeyboardTest.unidentifiedPatientKeyboardTest, trying again...
12-Oct-2021 12:51:14 Failed to login in UnidentifiedPatientKeyboardTest.unidentifiedPatientKeyboardTest, trying again...
12-Oct-2021 12:51:15 Failed to login in UnidentifiedPatientKeyboardTest.unidentifiedPatientKeyboardTest, trying again...
12-Oct-2021 12:51:15 Failed to login in UnidentifiedPatientKeyboardTest.unidentifiedPatientKeyboardTest, trying again...
12-Oct-2021 12:51:15 Failed to login in UnidentifiedPatientKeyboardTest.unidentifiedPatientKeyboardTest, trying again...
12-Oct-2021 12:51:15 Failed to login in UnidentifiedPatientKeyboardTest.unidentifiedPatientKeyboardTest, trying again...
12-Oct-2021 12:51:15 Failed to login in UnidentifiedPatientKeyboardTest.unidentifiedPatientKeyboardTest, trying again...
12-Oct-2021 12:51:15 Failed to login in UnidentifiedPatientKeyboardTest.unidentifiedPatientKeyboardTest, trying again...
12-Oct-2021 12:51:15 Failed to login in UnidentifiedPatientKeyboardTest.unidentifiedPatientKeyboardTest, trying again...
12-Oct-2021 12:51:15 Failed to login in UnidentifiedPatientKeyboardTest.unidentifiedPatientKeyboardTest, trying again...
12-Oct-2021 12:51:15 Failed to login in UnidentifiedPatientKeyboardTest.unidentifiedPatientKeyboardTest, trying again...
12-Oct-2021 12:51:15 Failed to login in UnidentifiedPatientKeyboardTest.unidentifiedPatientKeyboardTest, trying again...
12-Oct-2021 12:51:15 Failed to login in UnidentifiedPatientKeyboardTest.unidentifiedPatientKeyboardTest, trying again...
12-Oct-2021 12:51:15 Failed to login in UnidentifiedPatientKeyboardTest.unidentifiedPatientKeyboardTest, trying again...
12-Oct-2021 12:51:15 Failed to login in UnidentifiedPatientKeyboardTest.unidentifiedPatientKeyboardTest, trying again...
12-Oct-2021 12:51:15 Failed to login in UnidentifiedPatientKeyboardTest.unidentifiedPatientKeyboardTest, trying again...
12-Oct-2021 12:51:15 Failed to login in UnidentifiedPatientKeyboardTest.unidentifiedPatientKeyboardTest, trying again...
12-Oct-2021 12:51:15 Failed to login in UnidentifiedPatientKeyboardTest.unidentifiedPatientKeyboardTest, trying again...
12-Oct-2021 12:51:15 Failed to login in UnidentifiedPatientKeyboardTest.unidentifiedPatientKeyboardTest, trying again...
12-Oct-2021 12:51:15 Failed to login in UnidentifiedPatientKeyboardTest.unidentifiedPatientKeyboardTest, trying again...
12-Oct-2021 12:51:15 Failed to login in UnidentifiedPatientKeyboardTest.unidentifiedPatientKeyboardTest, trying again...
12-Oct-2021 12:51:15 Failed to login in UnidentifiedPatientKeyboardTest.unidentifiedPatientKeyboardTest, trying again...
12-Oct-2021 12:51:15 Failed to login in UnidentifiedPatientKeyboardTest.unidentifiedPatientKeyboardTest, trying again...
12-Oct-2021 12:51:15 Failed to login in UnidentifiedPatientKeyboardTest.unidentifiedPatientKeyboardTest, trying again...
12-Oct-2021 12:51:15 Failed to login in UnidentifiedPatientKeyboardTest.unidentifiedPatientKeyboardTest, trying again...
12-Oct-2021 12:51:15 Failed to login in UnidentifiedPatientKeyboardTest.unidentifiedPatientKeyboardTest, trying again...
12-Oct-2021 12:51:15 Failed to login in UnidentifiedPatientKeyboardTest.unidentifiedPatientKeyboardTest, trying again...
12-Oct-2021 12:51:15 Failed to login in UnidentifiedPatientKeyboardTest.unidentifiedPatientKeyboardTest, trying again...
12-Oct-2021 12:51:15 Failed to login in UnidentifiedPatientKeyboardTest.unidentifiedPatientKeyboardTest, trying again...
12-Oct-2021 12:51:16 Failed to login in UnidentifiedPatientKeyboardTest.unidentifiedPatientKeyboardTest, trying again...
12-Oct-2021 12:51:16 Failed to login in UnidentifiedPatientKeyboardTest.unidentifiedPatientKeyboardTest, trying again...
12-Oct-2021 12:51:16 Failed to login in UnidentifiedPatientKeyboardTest.unidentifiedPatientKeyboardTest, trying again...
12-Oct-2021 12:51:16 Failed to login in UnidentifiedPatientKeyboardTest.unidentifiedPatientKeyboardTest, trying again...
12-Oct-2021 12:51:16 Failed to login in UnidentifiedPatientKeyboardTest.unidentifiedPatientKeyboardTest, trying again...
12-Oct-2021 12:51:16 Failed to login in UnidentifiedPatientKeyboardTest.unidentifiedPatientKeyboardTest, trying again...
12-Oct-2021 12:51:16 Failed to login in UnidentifiedPatientKeyboardTest.unidentifiedPatientKeyboardTest, trying again...
12-Oct-2021 12:51:16 Failed to login in UnidentifiedPatientKeyboardTest.unidentifiedPatientKeyboardTest, trying again...
12-Oct-2021 12:51:16 Failed to login in UnidentifiedPatientKeyboardTest.unidentifiedPatientKeyboardTest, trying again...
12-Oct-2021 12:51:16 Failed to login in UnidentifiedPatientKeyboardTest.unidentifiedPatientKeyboardTest, trying again...
12-Oct-2021 12:51:16 Failed to login in UnidentifiedPatientKeyboardTest.unidentifiedPatientKeyboardTest, trying again...
12-Oct-2021 12:51:16 Failed to login in UnidentifiedPatientKeyboardTest.unidentifiedPatientKeyboardTest, trying again...
12-Oct-2021 12:51:16 Failed to login in UnidentifiedPatientKeyboardTest.unidentifiedPatientKeyboardTest, trying again...
12-Oct-2021 12:51:16 Failed to login in UnidentifiedPatientKeyboardTest.unidentifiedPatientKeyboardTest, trying again...
12-Oct-2021 12:51:16 Failed to login in UnidentifiedPatientKeyboardTest.unidentifiedPatientKeyboardTest, trying again...
12-Oct-2021 12:51:16 Failed to login in UnidentifiedPatientKeyboardTest.unidentifiedPatientKeyboardTest, trying again...
12-Oct-2021 12:51:16 Failed to login in UnidentifiedPatientKeyboardTest.unidentifiedPatientKeyboardTest, trying again...
12-Oct-2021 12:51:16 Failed to login in UnidentifiedPatientKeyboardTest.unidentifiedPatientKeyboardTest, trying again...
12-Oct-2021 12:51:16 Failed to login in UnidentifiedPatientKeyboardTest.unidentifiedPatientKeyboardTest, trying again...
12-Oct-2021 12:51:16 Failed to login in UnidentifiedPatientKeyboardTest.unidentifiedPatientKeyboardTest, trying again...
12-Oct-2021 12:51:16 Failed to login in UnidentifiedPatientKeyboardTest.unidentifiedPatientKeyboardTest, trying again...
12-Oct-2021 12:51:16 Failed to login in UnidentifiedPatientKeyboardTest.unidentifiedPatientKeyboardTest, trying again...
12-Oct-2021 12:51:16 Failed to login in UnidentifiedPatientKeyboardTest.unidentifiedPatientKeyboardTest, trying again...
12-Oct-2021 12:51:16 Failed to login in UnidentifiedPatientKeyboardTest.unidentifiedPatientKeyboardTest, trying again...
12-Oct-2021 12:51:16 Failed to login in UnidentifiedPatientKeyboardTest.unidentifiedPatientKeyboardTest, trying again...
12-Oct-2021 12:51:16 Failed to login in UnidentifiedPatientKeyboardTest.unidentifiedPatientKeyboardTest, trying again...
12-Oct-2021 12:51:17 Failed to login in UnidentifiedPatientKeyboardTest.unidentifiedPatientKeyboardTest, trying again...
12-Oct-2021 12:51:17 Failed to login in UnidentifiedPatientKeyboardTest.unidentifiedPatientKeyboardTest, trying again...
12-Oct-2021 12:51:17 Failed to login in UnidentifiedPatientKeyboardTest.unidentifiedPatientKeyboardTest, trying again...
12-Oct-2021 12:51:17 Failed to login in UnidentifiedPatientKeyboardTest.unidentifiedPatientKeyboardTest, trying again...
12-Oct-2021 12:51:17 Failed to login in UnidentifiedPatientKeyboardTest.unidentifiedPatientKeyboardTest, trying again...
12-Oct-2021 12:51:17 Failed to login in UnidentifiedPatientKeyboardTest.unidentifiedPatientKeyboardTest, trying again...
12-Oct-2021 12:51:17 Failed to login in UnidentifiedPatientKeyboardTest.unidentifiedPatientKeyboardTest, trying again...
12-Oct-2021 12:51:17 Failed to login in UnidentifiedPatientKeyboardTest.unidentifiedPatientKeyboardTest, trying again...
12-Oct-2021 12:51:17 Failed to login in UnidentifiedPatientKeyboardTest.unidentifiedPatientKeyboardTest, trying again...
12-Oct-2021 12:51:17 Failed to login in UnidentifiedPatientKeyboardTest.unidentifiedPatientKeyboardTest, trying again...
12-Oct-2021 12:51:17 Failed to login in UnidentifiedPatientKeyboardTest.unidentifiedPatientKeyboardTest, trying again...
12-Oct-2021 12:51:17 Failed to login in UnidentifiedPatientKeyboardTest.unidentifiedPatientKeyboardTest, trying again...
12-Oct-2021 12:51:17 Failed to login in UnidentifiedPatientKeyboardTest.unidentifiedPatientKeyboardTest, trying again...
12-Oct-2021 12:51:17 Failed to login in UnidentifiedPatientKeyboardTest.unidentifiedPatientKeyboardTest, trying again...
12-Oct-2021 12:51:17 Failed to login in UnidentifiedPatientKeyboardTest.unidentifiedPatientKeyboardTest, trying again...
12-Oct-2021 12:51:17 Failed to login in UnidentifiedPatientKeyboardTest.unidentifiedPatientKeyboardTest, trying again...
12-Oct-2021 12:51:17 Failed to login in UnidentifiedPatientKeyboardTest.unidentifiedPatientKeyboardTest, trying again...
12-Oct-2021 12:51:17 Failed to login in UnidentifiedPatientKeyboardTest.unidentifiedPatientKeyboardTest, trying again...
12-Oct-2021 12:51:17 Failed to login in UnidentifiedPatientKeyboardTest.unidentifiedPatientKeyboardTest, trying again...
12-Oct-2021 12:51:17 Failed to login in UnidentifiedPatientKeyboardTest.unidentifiedPatientKeyboardTest, trying again...
12-Oct-2021 12:51:17 Test killed due to server failure in UnidentifiedPatientKeyboardTest.unidentifiedPatientKeyboardTest
12-Oct-2021 12:51:17 jakarta.ws.rs.ServerErrorException: Bad Gateway
12-Oct-2021 12:51:17         at org.openmrs.uitestframework.test.TestBase.goToLoginPage(TestBase.java:245)
12-Oct-2021 12:51:17         at org.openmrs.uitestframework.test.TestBase.login(TestBase.java:231)
12-Oct-2021 12:51:17         at org.openmrs.uitestframework.test.TestBase.launchBrowser(TestBase.java:191)
12-Oct-2021 12:51:17         at org.openmrs.uitestframework.test.TestBase.startWebDriver(TestBase.java:130)
12-Oct-2021 12:51:17         at sun.reflect.NativeMethodAccessorImpl.invoke0(Native Method)
12-Oct-2021 12:51:17         at sun.reflect.NativeMethodAccessorImpl.invoke(NativeMethodAccessorImpl.java:62)
12-Oct-2021 12:51:17         at sun.reflect.DelegatingMethodAccessorImpl.invoke(DelegatingMethodAccessorImpl.java:43)
12-Oct-2021 12:51:17         at java.lang.reflect.Method.invoke(Method.java:498)
12-Oct-2021 12:51:17         at org.junit.runners.model.FrameworkMethod$1.runReflectiveCall(FrameworkMethod.java:59)
12-Oct-2021 12:51:17         at org.junit.internal.runners.model.ReflectiveCallable.run(ReflectiveCallable.java:12)
12-Oct-2021 12:51:17         at org.junit.runners.model.FrameworkMethod.invokeExplosively(FrameworkMethod.java:56)
12-Oct-2021 12:51:17         at org.junit.internal.runners.statements.RunBefores.invokeMethod(RunBefores.java:33)
12-Oct-2021 12:51:17         at org.junit.internal.runners.statements.RunBefores.evaluate(RunBefores.java:24)
12-Oct-2021 12:51:17         at org.junit.internal.runners.statements.RunAfters.evaluate(RunAfters.java:27)
12-Oct-2021 12:51:17         at org.junit.rules.TestWatcher$1.evaluate(TestWatcher.java:61)
12-Oct-2021 12:51:17         at org.junit.rules.TestWatcher$1.evaluate(TestWatcher.java:61)
12-Oct-2021 12:51:17         at org.junit.runners.ParentRunner$3.evaluate(ParentRunner.java:306)
12-Oct-2021 12:51:17         at org.junit.runners.BlockJUnit4ClassRunner$1.evaluate(BlockJUnit4ClassRunner.java:100)
12-Oct-2021 12:51:17         at org.junit.runners.ParentRunner.runLeaf(ParentRunner.java:366)
12-Oct-2021 12:51:17         at org.junit.runners.BlockJUnit4ClassRunner.runChild(BlockJUnit4ClassRunner.java:103)
12-Oct-2021 12:51:17         at org.junit.runners.BlockJUnit4ClassRunner.runChild(BlockJUnit4ClassRunner.java:63)
12-Oct-2021 12:51:17         at org.junit.runners.ParentRunner$4.run(ParentRunner.java:331)
12-Oct-2021 12:51:17         at org.junit.runners.ParentRunner$1.schedule(ParentRunner.java:79)
12-Oct-2021 12:51:17         at org.junit.runners.ParentRunner.runChildren(ParentRunner.java:329)
12-Oct-2021 12:51:17         at org.junit.runners.ParentRunner.access$100(ParentRunner.java:66)
12-Oct-2021 12:51:17         at org.junit.runners.ParentRunner$2.evaluate(ParentRunner.java:293)
12-Oct-2021 12:51:17         at org.junit.runners.ParentRunner$3.evaluate(ParentRunner.java:306)
12-Oct-2021 12:51:17         at org.junit.runners.ParentRunner.run(ParentRunner.java:413)
12-Oct-2021 12:51:17         at org.apache.maven.surefire.junit4.JUnit4Provider.execute(JUnit4Provider.java:236)
12-Oct-2021 12:51:17         at org.apache.maven.surefire.junit4.JUnit4Provider.executeTestSet(JUnit4Provider.java:134)
12-Oct-2021 12:51:17         at org.apache.maven.surefire.junit4.JUnit4Provider.invoke(JUnit4Provider.java:113)
12-Oct-2021 12:51:17         at sun.reflect.NativeMethodAccessorImpl.invoke0(Native Method)
12-Oct-2021 12:51:17         at sun.reflect.NativeMethodAccessorImpl.invoke(NativeMethodAccessorImpl.java:62)
12-Oct-2021 12:51:17         at sun.reflect.DelegatingMethodAccessorImpl.invoke(DelegatingMethodAccessorImpl.java:43)
12-Oct-2021 12:51:17         at java.lang.reflect.Method.invoke(Method.java:498)
12-Oct-2021 12:51:17         at org.apache.maven.surefire.util.ReflectionUtils.invokeMethodWithArray(ReflectionUtils.java:189)
12-Oct-2021 12:51:17         at org.apache.maven.surefire.booter.ProviderFactory$ProviderProxy.invoke(ProviderFactory.java:165)
12-Oct-2021 12:51:17         at org.apache.maven.surefire.booter.ProviderFactory.invokeProvider(ProviderFactory.java:85)
12-Oct-2021 12:51:17         at org.apache.maven.surefire.booter.ForkedBooter.runSuitesInProcess(ForkedBooter.java:103)
12-Oct-2021 12:51:17         at org.apache.maven.surefire.booter.ForkedBooter.main(ForkedBooter.java:74)
12-Oct-2021 12:51:18 Tests run: 3, Failures: 1, Errors: 2, Skipped: 0, Time elapsed: 112.048 sec <<< FAILURE!
12-Oct-2021 12:51:18 Running org.openmrs.reference.DeleteAllergyTest
12-Oct-2021 12:51:18 Tests run: 1, Failures: 1, Errors: 0, Skipped: 0, Time elapsed: 0.005 sec <<< FAILURE!
12-Oct-2021 12:51:18 Running org.openmrs.reference.SearchActiveVisitsTest
12-Oct-2021 12:51:18 Tests run: 1, Failures: 1, Errors: 0, Skipped: 0, Time elapsed: 0.001 sec <<< FAILURE!
12-Oct-2021 12:51:18 Running org.openmrs.reference.AddVisitTypeTest
12-Oct-2021 12:51:18 Tests run: 1, Failures: 1, Errors: 0, Skipped: 0, Time elapsed: 0 sec <<< FAILURE!
12-Oct-2021 12:51:18 Running org.openmrs.reference.FindPatientRecordTest
12-Oct-2021 12:51:18 Tests run: 1, Failures: 1, Errors: 0, Skipped: 0, Time elapsed: 0.009 sec <<< FAILURE!
12-Oct-2021 12:51:18 Running org.openmrs.reference.EditPersonTest
12-Oct-2021 12:51:18 Tests run: 2, Failures: 1, Errors: 1, Skipped: 0, Time elapsed: 0.001 sec <<< FAILURE!
12-Oct-2021 12:51:18 Running org.openmrs.reference.RetireLocationTest
12-Oct-2021 12:51:18 Tests run: 2, Failures: 1, Errors: 1, Skipped: 0, Time elapsed: 0.013 sec <<< FAILURE!
12-Oct-2021 12:51:18 Running org.openmrs.reference.XSSOnPhoneNumberFieldTest
12-Oct-2021 12:51:18 Tests run: 1, Failures: 1, Errors: 0, Skipped: 0, Time elapsed: 0.012 sec <<< FAILURE!
12-Oct-2021 12:51:18 Running org.openmrs.reference.TransferToWardServiceTest
12-Oct-2021 12:51:18 Tests run: 1, Failures: 1, Errors: 0, Skipped: 0, Time elapsed: 0.002 sec <<< FAILURE!
12-Oct-2021 12:51:18 Running org.openmrs.reference.EditVisitTypeTest
12-Oct-2021 12:51:18 Tests run: 2, Failures: 1, Errors: 1, Skipped: 0, Time elapsed: 0.024 sec <<< FAILURE!
12-Oct-2021 12:51:18 Running org.openmrs.reference.ComeBackToApplicationAfterLogoutTest
12-Oct-2021 12:51:18 Tests run: 1, Failures: 1, Errors: 0, Skipped: 0, Time elapsed: 0 sec <<< FAILURE!
12-Oct-2021 12:51:18 Running org.openmrs.reference.EditDemographicTest
12-Oct-2021 12:51:18 Tests run: 1, Failures: 1, Errors: 0, Skipped: 0, Time elapsed: 0.002 sec <<< FAILURE!
12-Oct-2021 12:51:18 Running org.openmrs.reference.DeleteVisitTypeTest
12-Oct-2021 12:51:18 Tests run: 2, Failures: 1, Errors: 1, Skipped: 0, Time elapsed: 0.036 sec <<< FAILURE!
12-Oct-2021 12:51:18 Running org.openmrs.reference.FormTest
12-Oct-2021 12:51:18 Tests run: 8, Failures: 4, Errors: 4, Skipped: 0, Time elapsed: 0.01 sec <<< FAILURE!
12-Oct-2021 12:51:18 Running org.openmrs.reference.RegisterUnidentifiedPatientTest
12-Oct-2021 12:51:18 Tests run: 2, Failures: 1, Errors: 1, Skipped: 0, Time elapsed: 0.002 sec <<< FAILURE!
12-Oct-2021 12:51:18 Running org.openmrs.reference.AddPatientAppointmentTest
12-Oct-2021 12:51:18 Tests run: 1, Failures: 1, Errors: 0, Skipped: 0, Time elapsed: 0.001 sec <<< FAILURE!
12-Oct-2021 12:51:18 Running org.openmrs.reference.AdmitExitInpatientTest
12-Oct-2021 12:51:18 Tests run: 1, Failures: 1, Errors: 0, Skipped: 0, Time elapsed: 0.002 sec <<< FAILURE!
12-Oct-2021 12:51:18 Running org.openmrs.reference.DeleteRequestAppointmentTest
12-Oct-2021 12:51:18 Tests run: 1, Failures: 1, Errors: 0, Skipped: 0, Time elapsed: 0.002 sec <<< FAILURE!
12-Oct-2021 12:51:18 Running org.openmrs.reference.EditAllergyTest
12-Oct-2021 12:51:18 Tests run: 1, Failures: 1, Errors: 0, Skipped: 0, Time elapsed: 0.001 sec <<< FAILURE!
12-Oct-2021 12:51:18 Running org.openmrs.reference.VisitNoteTest
12-Oct-2021 12:51:18 Tests run: 1, Failures: 1, Errors: 0, Skipped: 0, Time elapsed: 0.002 sec <<< FAILURE!
12-Oct-2021 12:51:18 Running org.openmrs.reference.CreatePersonTest
12-Oct-2021 12:51:18 Tests run: 1, Failures: 1, Errors: 0, Skipped: 0, Time elapsed: 0.002 sec <<< FAILURE!
12-Oct-2021 12:51:18 Running org.openmrs.reference.FindPatientByNameTest
12-Oct-2021 12:51:18 Tests run: 2, Failures: 1, Errors: 1, Skipped: 0, Time elapsed: 0.004 sec <<< FAILURE!
12-Oct-2021 12:51:18 Running org.openmrs.reference.AddUserTest
12-Oct-2021 12:51:18 Tests run: 1, Failures: 1, Errors: 0, Skipped: 0, Time elapsed: 0.004 sec <<< FAILURE!
12-Oct-2021 12:51:18 Running org.openmrs.reference.AddProviderTest
12-Oct-2021 12:51:18 Tests run: 2, Failures: 1, Errors: 1, Skipped: 0, Time elapsed: 0.027 sec <<< FAILURE!
12-Oct-2021 12:51:18 Running org.openmrs.reference.AddPastVisitTest
12-Oct-2021 12:51:18 Tests run: 1, Failures: 1, Errors: 0, Skipped: 0, Time elapsed: 0.001 sec <<< FAILURE!
12-Oct-2021 12:51:18 Running org.openmrs.reference.RecordMergeIssueTest
12-Oct-2021 12:51:18 Tests run: 2, Failures: 1, Errors: 1, Skipped: 0, Time elapsed: 0.003 sec <<< FAILURE!
12-Oct-2021 12:51:18 Running org.openmrs.reference.CaptureVitalsTest
12-Oct-2021 12:51:18 Tests run: 1, Failures: 1, Errors: 0, Skipped: 0, Time elapsed: 0 sec <<< FAILURE!
12-Oct-2021 12:51:18 Running org.openmrs.reference.NamePatientAccentedLetterTest
12-Oct-2021 12:51:18 Tests run: 2, Failures: 1, Errors: 1, Skipped: 0, Time elapsed: 0 sec <<< FAILURE!
12-Oct-2021 12:51:18 Running org.openmrs.reference.RetirePersonTest
12-Oct-2021 12:51:18 Tests run: 2, Failures: 1, Errors: 1, Skipped: 0, Time elapsed: 0.018 sec <<< FAILURE!
12-Oct-2021 12:51:18 Running org.openmrs.reference.EndVisitTest
12-Oct-2021 12:51:18 Tests run: 1, Failures: 1, Errors: 0, Skipped: 0, Time elapsed: 0.002 sec <<< FAILURE!
12-Oct-2021 12:51:18 Running org.openmrs.reference.DeleteAppointmentBlockTest
12-Oct-2021 12:51:18 Tests run: 1, Failures: 1, Errors: 0, Skipped: 0, Time elapsed: 0.001 sec <<< FAILURE!
12-Oct-2021 12:51:18 Running org.openmrs.reference.BookRequestAppointmentTest
12-Oct-2021 12:51:18 Tests run: 1, Failures: 1, Errors: 0, Skipped: 0, Time elapsed: 0.009 sec <<< FAILURE!
12-Oct-2021 12:51:18 Running org.openmrs.reference.AddDeleteServiceTest
12-Oct-2021 12:51:18 Tests run: 1, Failures: 1, Errors: 0, Skipped: 0, Time elapsed: 0.004 sec <<< FAILURE!
12-Oct-2021 12:51:18 Running org.openmrs.reference.AddEditAppointmentBlockTest
12-Oct-2021 12:51:18 Tests run: 1, Failures: 1, Errors: 0, Skipped: 0, Time elapsed: 0 sec <<< FAILURE!
12-Oct-2021 12:51:18 Running org.openmrs.reference.RetireProviderTest
12-Oct-2021 12:51:18 Tests run: 2, Failures: 1, Errors: 1, Skipped: 0, Time elapsed: 0.014 sec <<< FAILURE!
12-Oct-2021 12:51:18 Running org.openmrs.reference.MergePatientTest
12-Oct-2021 12:51:18 Tests run: 1, Failures: 1, Errors: 0, Skipped: 0, Time elapsed: 0.002 sec <<< FAILURE!
12-Oct-2021 12:51:18 Running org.openmrs.reference.AddDeleteLocationTest
12-Oct-2021 12:51:18 Tests run: 2, Failures: 1, Errors: 1, Skipped: 0, Time elapsed: 0.022 sec <<< FAILURE!
12-Oct-2021 12:51:18 Running org.openmrs.reference.DuplicatePatientRegisterTest
12-Oct-2021 12:51:18 Tests run: 2, Failures: 1, Errors: 1, Skipped: 0, Time elapsed: 0.004 sec <<< FAILURE!
12-Oct-2021 12:51:18 Running org.openmrs.reference.UsingBackButtonInMergePatientTest
12-Oct-2021 12:51:18 Tests run: 2, Failures: 1, Errors: 1, Skipped: 0, Time elapsed: 0.002 sec <<< FAILURE!
12-Oct-2021 12:51:18 Running org.openmrs.reference.AddDiagnosisToVisitNoteTest
12-Oct-2021 12:51:18 Tests run: 1, Failures: 1, Errors: 0, Skipped: 0, Time elapsed: 0.001 sec <<< FAILURE!
12-Oct-2021 12:51:18 Running org.openmrs.reference.MergeVisitsTest
12-Oct-2021 12:51:18 Tests run: 2, Failures: 1, Errors: 1, Skipped: 0, Time elapsed: 0.004 sec <<< FAILURE!
12-Oct-2021 12:51:18 Running org.openmrs.reference.EditServiceTest
12-Oct-2021 12:51:18 Tests run: 1, Failures: 1, Errors: 0, Skipped: 0, Time elapsed: 0.007 sec <<< FAILURE!
12-Oct-2021 12:51:18 Running org.openmrs.reference.AddNewAllergyTest
12-Oct-2021 12:51:18 Tests run: 1, Failures: 1, Errors: 0, Skipped: 0, Time elapsed: 0.002 sec <<< FAILURE!
12-Oct-2021 12:51:18 Running org.openmrs.reference.LoginTest
12-Oct-2021 12:51:18 Tests run: 5, Failures: 5, Errors: 0, Skipped: 0, Time elapsed: 0.003 sec <<< FAILURE!
12-Oct-2021 12:51:18 Running org.openmrs.reference.DeleteProviderTest
12-Oct-2021 12:51:18 Tests run: 2, Failures: 1, Errors: 1, Skipped: 0, Time elapsed: 0.025 sec <<< FAILURE!
12-Oct-2021 12:51:18 Running org.openmrs.reference.RegisterPatientTest
12-Oct-2021 12:51:18 Tests run: 2, Failures: 1, Errors: 1, Skipped: 0, Time elapsed: 0.001 sec <<< FAILURE!
12-Oct-2021 12:51:18 Running org.openmrs.reference.ContactInfoTest
12-Oct-2021 12:51:18 Tests run: 1, Failures: 1, Errors: 0, Skipped: 0, Time elapsed: 0.001 sec <<< FAILURE!
12-Oct-2021 12:51:18 Running org.openmrs.reference.StartVisitTest
12-Oct-2021 12:51:18 Tests run: 1, Failures: 1, Errors: 0, Skipped: 0, Time elapsed: 0.001 sec <<< FAILURE!
12-Oct-2021 12:51:18 Running org.openmrs.reference.DeletePersonTest
12-Oct-2021 12:51:18 Tests run: 2, Failures: 1, Errors: 1, Skipped: 0, Time elapsed: 0.03 sec <<< FAILURE!
12-Oct-2021 12:51:18 Running org.openmrs.reference.EditProviderTest
12-Oct-2021 12:51:18 Tests run: 2, Failures: 1, Errors: 1, Skipped: 0, Time elapsed: 0.022 sec <<< FAILURE!
12-Oct-2021 12:51:18 Running org.openmrs.reference.RetireVisitTypeTest
12-Oct-2021 12:51:18 Tests run: 2, Failures: 1, Errors: 1, Skipped: 0, Time elapsed: 0.021 sec <<< FAILURE!
12-Oct-2021 12:51:19
12-Oct-2021 12:51:19 Results :
12-Oct-2021 12:51:19
12-Oct-2021 12:51:19 Failed tests:   unidentifiedPatientKeyboardTest(org.openmrs.reference.UnidentifiedPatientKeyboardTest): Test killed due to server failure
12-Oct-2021 12:51:19   deleteAllergyTest(org.openmrs.reference.DeleteAllergyTest): Test killed due to server failure
12-Oct-2021 12:51:19   searchActiveVisitsTest(org.openmrs.reference.SearchActiveVisitsTest): Test killed due to server failure
12-Oct-2021 12:51:19   addVisitTypeTest(org.openmrs.reference.AddVisitTypeTest): Test killed due to server failure
12-Oct-2021 12:51:19   findPatientRecordTest(org.openmrs.reference.FindPatientRecordTest): Test killed due to server failure
12-Oct-2021 12:51:19   editPersonTest(org.openmrs.reference.EditPersonTest): Test killed due to server failure
12-Oct-2021 12:51:19   retireLocationTest(org.openmrs.reference.RetireLocationTest): Test killed due to server failure
12-Oct-2021 12:51:19   xssOnPhoneNumberFieldTest(org.openmrs.reference.XSSOnPhoneNumberFieldTest): Test killed due to server failure
12-Oct-2021 12:51:19   transferToWardServiceTest(org.openmrs.reference.TransferToWardServiceTest): Test killed due to server failure
12-Oct-2021 12:51:19   editVisitTypeTest(org.openmrs.reference.EditVisitTypeTest): Test killed due to server failure
12-Oct-2021 12:51:19   comeBackToApplicationAfterLogoutTest(org.openmrs.reference.ComeBackToApplicationAfterLogoutTest): Test killed due to server failure
12-Oct-2021 12:51:19   editDemographicTest(org.openmrs.reference.EditDemographicTest): Test killed due to server failure
12-Oct-2021 12:51:19   deleteVisitTypeTest(org.openmrs.reference.DeleteVisitTypeTest): Test killed due to server failure
12-Oct-2021 12:51:19   deleteFormTest(org.openmrs.reference.FormTest): Test killed due to server failure
12-Oct-2021 12:51:19   editFormTest(org.openmrs.reference.FormTest): Test killed due to server failure
12-Oct-2021 12:51:19   initiateFormPresence(org.openmrs.reference.FormTest): Test killed due to server failure
12-Oct-2021 12:51:19   addFormTest(org.openmrs.reference.FormTest): Test killed due to server failure
12-Oct-2021 12:51:19   registerUnidentifiedPatientTest(org.openmrs.reference.RegisterUnidentifiedPatientTest): Test killed due to server failure
12-Oct-2021 12:51:19   addPatientAppointmentTest(org.openmrs.reference.AddPatientAppointmentTest): Test killed due to server failure
12-Oct-2021 12:51:19   admitExitInpatientTest(org.openmrs.reference.AdmitExitInpatientTest): Test killed due to server failure
12-Oct-2021 12:51:19   deleteRequestAppointmentTest(org.openmrs.reference.DeleteRequestAppointmentTest): Test killed due to server failure
12-Oct-2021 12:51:19   editAllergyTest(org.openmrs.reference.EditAllergyTest): Test killed due to server failure
12-Oct-2021 12:51:19   visitNoteTest(org.openmrs.reference.VisitNoteTest): Test killed due to server failure
12-Oct-2021 12:51:19   createPersonTest(org.openmrs.reference.CreatePersonTest): Test killed due to server failure
12-Oct-2021 12:51:19   findPatientByNameTest(org.openmrs.reference.FindPatientByNameTest): Test killed due to server failure
12-Oct-2021 12:51:19   addUserTest(org.openmrs.reference.AddUserTest): Test killed due to server failure
12-Oct-2021 12:51:19   addProviderTest(org.openmrs.reference.AddProviderTest): Test killed due to server failure
12-Oct-2021 12:51:19   addPastVisitTest(org.openmrs.reference.AddPastVisitTest): Test killed due to server failure
12-Oct-2021 12:51:19   recordMergeIssueTest(org.openmrs.reference.RecordMergeIssueTest): Test killed due to server failure
12-Oct-2021 12:51:19   captureVitalsTest(org.openmrs.reference.CaptureVitalsTest): Test killed due to server failure
12-Oct-2021 12:51:19   namePatientAccentedLetterTest(org.openmrs.reference.NamePatientAccentedLetterTest): Test killed due to server failure
12-Oct-2021 12:51:19   retirePersonTest(org.openmrs.reference.RetirePersonTest): Test killed due to server failure
12-Oct-2021 12:51:19   endVisitTest(org.openmrs.reference.EndVisitTest): Test killed due to server failure
12-Oct-2021 12:51:19   deleteAppointmentBlockTest(org.openmrs.reference.DeleteAppointmentBlockTest): Test killed due to server failure
12-Oct-2021 12:51:19   bookRequestAppointmentTest(org.openmrs.reference.BookRequestAppointmentTest): Test killed due to server failure
12-Oct-2021 12:51:19   addDeleteServiceTest(org.openmrs.reference.AddDeleteServiceTest): Test killed due to server failure
12-Oct-2021 12:51:19   addEditAppointmentBlockTest(org.openmrs.reference.AddEditAppointmentBlockTest): Test killed due to server failure
12-Oct-2021 12:51:19   retireProviderTest(org.openmrs.reference.RetireProviderTest): Test killed due to server failure
12-Oct-2021 12:51:19   mergePatientTest(org.openmrs.reference.MergePatientTest): Test killed due to server failure
12-Oct-2021 12:51:19   addLocationTest(org.openmrs.reference.AddDeleteLocationTest): Test killed due to server failure
12-Oct-2021 12:51:19   duplicatePatientRegisterTest(org.openmrs.reference.DuplicatePatientRegisterTest): Test killed due to server failure
12-Oct-2021 12:51:19   usingBackButtonInMergePatientTest(org.openmrs.reference.UsingBackButtonInMergePatientTest): Test killed due to server failure
12-Oct-2021 12:51:19   addDiagnosisToVisitNoteTest(org.openmrs.reference.AddDiagnosisToVisitNoteTest): Test killed due to server failure
12-Oct-2021 12:51:19   mergeVisitsTest(org.openmrs.reference.MergeVisitsTest): Test killed due to server failure
12-Oct-2021 12:51:19   editServiceTest(org.openmrs.reference.EditServiceTest): Test killed due to server failure
12-Oct-2021 12:51:19   addNewAllergyTest(org.openmrs.reference.AddNewAllergyTest): Test killed due to server failure
12-Oct-2021 12:51:19   verifyNurseModulesAvailableOnHomePage(org.openmrs.reference.LoginTest): Test killed due to server failure
12-Oct-2021 12:51:19   verifyModulesAvailableOnHomePage(org.openmrs.reference.LoginTest): Test killed due to server failure
12-Oct-2021 12:51:19   verifySysadminModulesAvailableOnHomePage(org.openmrs.reference.LoginTest): Test killed due to server failure
12-Oct-2021 12:51:19   verifyClerkModulesAvailableOnHomePage(org.openmrs.reference.LoginTest): Test killed due to server failure
12-Oct-2021 12:51:19   verifyDoctorModulesAvailableOnHomePage(org.openmrs.reference.LoginTest): Test killed due to server failure
12-Oct-2021 12:51:19   deleteProviderTest(org.openmrs.reference.DeleteProviderTest): Test killed due to server failure
12-Oct-2021 12:51:19   registerPatientTest(org.openmrs.reference.RegisterPatientTest): Test killed due to server failure
12-Oct-2021 12:51:19   contactInfoTest(org.openmrs.reference.ContactInfoTest): Test killed due to server failure
12-Oct-2021 12:51:19   startVisitTest(org.openmrs.reference.StartVisitTest): Test killed due to server failure
12-Oct-2021 12:51:19   deletePersonTest(org.openmrs.reference.DeletePersonTest): Test killed due to server failure
12-Oct-2021 12:51:19   editProviderTest(org.openmrs.reference.EditProviderTest): Test killed due to server failure
12-Oct-2021 12:51:19   retireVisitTypeTest(org.openmrs.reference.RetireVisitTypeTest): Test killed due to server failure
12-Oct-2021 12:51:19
12-Oct-2021 12:51:19 Tests in error:
12-Oct-2021 12:51:19   unidentifiedPatientKeyboardTest(org.openmrs.reference.UnidentifiedPatientKeyboardTest)
12-Oct-2021 12:51:19   unidentifiedPatientKeyboardTest(org.openmrs.reference.UnidentifiedPatientKeyboardTest): Session ID is null. Using WebDriver after calling quit()?(..)
12-Oct-2021 12:51:19   editPersonTest(org.openmrs.reference.EditPersonTest): Delete request failed: https://qa-refapp.openmrs.org/openmrs/ws/rest/v1/person/null?purge=true
12-Oct-2021 12:51:19   retireLocationTest(org.openmrs.reference.RetireLocationTest): Delete request failed: https://qa-refapp.openmrs.org/openmrs/ws/rest/v1/location/null?purge=true
12-Oct-2021 12:51:19   editVisitTypeTest(org.openmrs.reference.EditVisitTypeTest): Delete request failed: https://qa-refapp.openmrs.org/openmrs/ws/rest/v1/visittype/null?purge=true
12-Oct-2021 12:51:19   deleteVisitTypeTest(org.openmrs.reference.DeleteVisitTypeTest): Delete request failed: https://qa-refapp.openmrs.org/openmrs/ws/rest/v1/visittype/null?purge=true
12-Oct-2021 12:51:19   deleteFormTest(org.openmrs.reference.FormTest)
12-Oct-2021 12:51:19   editFormTest(org.openmrs.reference.FormTest)
12-Oct-2021 12:51:19   initiateFormPresence(org.openmrs.reference.FormTest)
12-Oct-2021 12:51:19   addFormTest(org.openmrs.reference.FormTest)
12-Oct-2021 12:51:19   registerUnidentifiedPatientTest(org.openmrs.reference.RegisterUnidentifiedPatientTest)
12-Oct-2021 12:51:19   findPatientByNameTest(org.openmrs.reference.FindPatientByNameTest)
12-Oct-2021 12:51:19   addProviderTest(org.openmrs.reference.AddProviderTest): Delete request failed: https://qa-refapp.openmrs.org/openmrs/ws/rest/v1/person/null?purge=true
12-Oct-2021 12:51:19   recordMergeIssueTest(org.openmrs.reference.RecordMergeIssueTest)
12-Oct-2021 12:51:19   namePatientAccentedLetterTest(org.openmrs.reference.NamePatientAccentedLetterTest)
12-Oct-2021 12:51:19   retirePersonTest(org.openmrs.reference.RetirePersonTest): Delete request failed: https://qa-refapp.openmrs.org/openmrs/ws/rest/v1/person/null?purge=true
12-Oct-2021 12:51:19   retireProviderTest(org.openmrs.reference.RetireProviderTest): Delete request failed: https://qa-refapp.openmrs.org/openmrs/ws/rest/v1/provider/null?purge=true
12-Oct-2021 12:51:19   addLocationTest(org.openmrs.reference.AddDeleteLocationTest): Delete request failed: https://qa-refapp.openmrs.org/openmrs/ws/rest/v1//locationtag/null?purge=true
12-Oct-2021 12:51:19   duplicatePatientRegisterTest(org.openmrs.reference.DuplicatePatientRegisterTest)
12-Oct-2021 12:51:19   usingBackButtonInMergePatientTest(org.openmrs.reference.UsingBackButtonInMergePatientTest)
12-Oct-2021 12:51:19   mergeVisitsTest(org.openmrs.reference.MergeVisitsTest)
12-Oct-2021 12:51:19   deleteProviderTest(org.openmrs.reference.DeleteProviderTest): Delete request failed: https://qa-refapp.openmrs.org/openmrs/ws/rest/v1/provider/null?purge=true
12-Oct-2021 12:51:19   registerPatientTest(org.openmrs.reference.RegisterPatientTest)
12-Oct-2021 12:51:19   deletePersonTest(org.openmrs.reference.DeletePersonTest): Delete request failed: https://qa-refapp.openmrs.org/openmrs/ws/rest/v1/person/null?purge=true
12-Oct-2021 12:51:19   editProviderTest(org.openmrs.reference.EditProviderTest): Delete request failed: https://qa-refapp.openmrs.org/openmrs/ws/rest/v1/provider/null?purge=true
12-Oct-2021 12:51:19   retireVisitTypeTest(org.openmrs.reference.RetireVisitTypeTest): Delete request failed: https://qa-refapp.openmrs.org/openmrs/ws/rest/v1/visittype/null?purge=true
12-Oct-2021 12:51:19
12-Oct-2021 12:51:19 Tests run: 84, Failures: 58, Errors: 26, Skipped: 0
12-Oct-2021 12:51:19
12-Oct-2021 12:51:19 [INFO] ------------------------------------------------------------------------
12-Oct-2021 12:51:19 [INFO] Reactor Summary:
12-Oct-2021 12:51:19 [INFO]
12-Oct-2021 12:51:19 [INFO] Reference Application Distribution ................. SUCCESS [  0.355 s]
12-Oct-2021 12:51:19 [INFO] Reference Application Distribution Package ......... SUCCESS [ 22.732 s]
12-Oct-2021 12:51:19 [INFO] Reference Application Distribution UI Tests ........ FAILURE [01:59 min]
12-Oct-2021 12:51:19 [INFO] ------------------------------------------------------------------------
12-Oct-2021 12:51:19 [INFO] BUILD FAILURE
12-Oct-2021 12:51:19 [INFO] ------------------------------------------------------------------------
12-Oct-2021 12:51:19 [INFO] Total time: 02:22 min
12-Oct-2021 12:51:19 [INFO] Finished at: 2021-10-12T12:51:19+00:00
12-Oct-2021 12:51:19 [INFO] Final Memory: 63M/389M
12-Oct-2021 12:51:19 [INFO] ------------------------------------------------------------------------
12-Oct-2021 12:51:19 [ERROR] Failed to execute goal org.apache.maven.plugins:maven-surefire-plugin:2.12:test (default-test) on project referenceapplication-ui-tests: There are test failures.
12-Oct-2021 12:51:19 [ERROR]
12-Oct-2021 12:51:19 [ERROR] Please refer to /home/bamboo-agent/bamboo-agent/xml-data/build-dir/REFAPP-UI-FRAMEWORK/ui-tests/target/surefire-reports for the individual test results.
12-Oct-2021 12:51:19 [ERROR] -> [Help 1]
12-Oct-2021 12:51:19 org.apache.maven.lifecycle.LifecycleExecutionException: Failed to execute goal org.apache.maven.plugins:maven-surefire-plugin:2.12:test (default-test) on project referenceapplication-ui-tests: There are test failures.
12-Oct-2021 12:51:19
12-Oct-2021 12:51:19 Please refer to /home/bamboo-agent/bamboo-agent/xml-data/build-dir/REFAPP-UI-FRAMEWORK/ui-tests/target/surefire-reports for the individual test results.
12-Oct-2021 12:51:19         at org.apache.maven.lifecycle.internal.MojoExecutor.execute(MojoExecutor.java:212)
12-Oct-2021 12:51:19         at org.apache.maven.lifecycle.internal.MojoExecutor.execute(MojoExecutor.java:153)
12-Oct-2021 12:51:19         at org.apache.maven.lifecycle.internal.MojoExecutor.execute(MojoExecutor.java:145)
12-Oct-2021 12:51:19         at org.apache.maven.lifecycle.internal.LifecycleModuleBuilder.buildProject(LifecycleModuleBuilder.java:116)
12-Oct-2021 12:51:19         at org.apache.maven.lifecycle.internal.LifecycleModuleBuilder.buildProject(LifecycleModuleBuilder.java:80)
12-Oct-2021 12:51:19         at org.apache.maven.lifecycle.internal.builder.singlethreaded.SingleThreadedBuilder.build(SingleThreadedBuilder.java:51)
12-Oct-2021 12:51:19         at org.apache.maven.lifecycle.internal.LifecycleStarter.execute(LifecycleStarter.java:128)
12-Oct-2021 12:51:19         at org.apache.maven.DefaultMaven.doExecute(DefaultMaven.java:307)
12-Oct-2021 12:51:19         at org.apache.maven.DefaultMaven.doExecute(DefaultMaven.java:193)
12-Oct-2021 12:51:19         at org.apache.maven.DefaultMaven.execute(DefaultMaven.java:106)
12-Oct-2021 12:51:19         at org.apache.maven.cli.MavenCli.execute(MavenCli.java:863)
12-Oct-2021 12:51:19         at org.apache.maven.cli.MavenCli.doMain(MavenCli.java:288)
12-Oct-2021 12:51:19         at org.apache.maven.cli.MavenCli.main(MavenCli.java:199)
12-Oct-2021 12:51:19         at sun.reflect.NativeMethodAccessorImpl.invoke0(Native Method)
12-Oct-2021 12:51:19         at sun.reflect.NativeMethodAccessorImpl.invoke(NativeMethodAccessorImpl.java:62)
12-Oct-2021 12:51:19         at sun.reflect.DelegatingMethodAccessorImpl.invoke(DelegatingMethodAccessorImpl.java:43)
12-Oct-2021 12:51:19         at java.lang.reflect.Method.invoke(Method.java:498)
12-Oct-2021 12:51:19         at org.codehaus.plexus.classworlds.launcher.Launcher.launchEnhanced(Launcher.java:289)
12-Oct-2021 12:51:19         at org.codehaus.plexus.classworlds.launcher.Launcher.launch(Launcher.java:229)
12-Oct-2021 12:51:19         at org.codehaus.plexus.classworlds.launcher.Launcher.mainWithExitCode(Launcher.java:415)
12-Oct-2021 12:51:19         at org.codehaus.plexus.classworlds.launcher.Launcher.main(Launcher.java:356)
12-Oct-2021 12:51:19 Caused by: org.apache.maven.plugin.MojoFailureException: There are test failures.
12-Oct-2021 12:51:19
12-Oct-2021 12:51:19 Please refer to /home/bamboo-agent/bamboo-agent/xml-data/build-dir/REFAPP-UI-FRAMEWORK/ui-tests/target/surefire-reports for the individual test results.
12-Oct-2021 12:51:19         at org.apache.maven.plugin.surefire.SurefireHelper.reportExecution(SurefireHelper.java:83)
12-Oct-2021 12:51:19         at org.apache.maven.plugin.surefire.SurefirePlugin.writeSummary(SurefirePlugin.java:673)
12-Oct-2021 12:51:19         at org.apache.maven.plugin.surefire.SurefirePlugin.handleSummary(SurefirePlugin.java:647)
12-Oct-2021 12:51:19         at org.apache.maven.plugin.surefire.AbstractSurefireMojo.executeAfterPreconditionsChecked(AbstractSurefireMojo.java:137)
12-Oct-2021 12:51:19         at org.apache.maven.plugin.surefire.AbstractSurefireMojo.execute(AbstractSurefireMojo.java:98)
12-Oct-2021 12:51:19         at org.apache.maven.plugin.DefaultBuildPluginManager.executeMojo(DefaultBuildPluginManager.java:134)
12-Oct-2021 12:51:19         at org.apache.maven.lifecycle.internal.MojoExecutor.execute(MojoExecutor.java:207)
12-Oct-2021 12:51:19         ... 20 more
12-Oct-2021 12:51:19 [ERROR]
12-Oct-2021 12:51:19 [ERROR] Re-run Maven using the -X switch to enable full debug logging.
12-Oct-2021 12:51:19 [ERROR]
12-Oct-2021 12:51:19 [ERROR] For more information about the errors and possible solutions, please read the following articles:
12-Oct-2021 12:51:19 [ERROR] [Help 1] http://cwiki.apache.org/confluence/display/MAVEN/MojoFailureException
12-Oct-2021 12:51:19 [ERROR]
12-Oct-2021 12:51:19 [ERROR] After correcting the problems, you can resume the build with the command
12-Oct-2021 12:51:19 [ERROR]   mvn <goals> -rf :referenceapplication-ui-tests
12-Oct-2021 12:51:19 Failing task since return code of [/usr/share/apache-maven-3.3.9/bin/mvn --batch-mode -Djava.io.tmpdir=/home/bamboo-agent/bamboo-agent/.agent_tmp/REFAPP-UI-FRAMEWORK clean install -DskipTests=false -e] was 1 while expected 0
12-Oct-2021 12:51:19 Parsing test results under /home/bamboo-agent/bamboo-agent/xml-data/build-dir/REFAPP-UI-FRAMEWORK...
12-Oct-2021 12:51:19 Finished task 'Build distribution' with result: Failed
12-Oct-2021 12:51:19 Running post build plugin 'Docker Container Cleanup'
12-Oct-2021 12:51:19 Running post build plugin 'NCover Results Collector'
12-Oct-2021 12:51:19 Running post build plugin 'Clover Results Collector'
12-Oct-2021 12:51:19 Running post build plugin 'Sauce OnDemand Post Runner'
12-Oct-2021 12:51:19 Running post build plugin 'npm Cache Cleanup'
12-Oct-2021 12:51:19 Running post build plugin 'Artifact Copier'
12-Oct-2021 12:51:19 Finalising the build...
12-Oct-2021 12:51:19 Stopping timer.
12-Oct-2021 12:51:19 Build REFAPP-UI-FRAMEWORK-646 completed.
12-Oct-2021 12:51:19 Running on server: post build plugin 'NCover Results Collector'
12-Oct-2021 12:51:19 Running on server: post build plugin 'Build Hanging Detection Configuration'
12-Oct-2021 12:51:19 Running on server: post build plugin 'Clover Delta Calculator'
12-Oct-2021 12:51:19 Running on server: post build plugin 'Maven Dependencies Postprocessor'
12-Oct-2021 12:51:19 All post build plugins have finished
12-Oct-2021 12:51:19 Generating build results summary...
12-Oct-2021 12:51:20 Saving build results to disk...
12-Oct-2021 12:51:20 Logging substituted variables...
12-Oct-2021 12:51:20 Indexing build results...
12-Oct-2021 12:51:20 Finished building REFAPP-UI-FRAMEWORK-646.