UI tests for the reference application

Build: #647 failed

Job: Run QA UI Tests failed

Stages & jobs

  1. Ref App UI Testing

Build log

The build generated 1,908 lines of output.The output is too long and has been truncated to the last 1,000 lines. Download or view full build log

12-Oct-2021 13:19:32 Running locally...
12-Oct-2021 13:19:32 Starting ChromeDriver 90.0.4430.24 (4c6d850f087da467d926e8eddb76550aed655991-refs/branch-heads/4430@{#429}) on port 17334
12-Oct-2021 13:19:32 Only local connections are allowed.
12-Oct-2021 13:19:32 Please see https://chromedriver.chromium.org/security-considerations for suggestions on keeping ChromeDriver safe.
12-Oct-2021 13:19:32 ChromeDriver was started successfully.
12-Oct-2021 13:19:32 Oct 12, 2021 1:19:32 PM org.openqa.selenium.remote.ProtocolHandshake createSession
12-Oct-2021 13:19:32 INFO: Detected dialect: W3C
12-Oct-2021 13:19:37 Tests run: 1, Failures: 0, Errors: 0, Skipped: 0, Time elapsed: 5.358 sec
12-Oct-2021 13:19:37 Running org.openmrs.reference.MergePatientTest
12-Oct-2021 13:19:37 Running locally...
12-Oct-2021 13:19:37 Starting ChromeDriver 90.0.4430.24 (4c6d850f087da467d926e8eddb76550aed655991-refs/branch-heads/4430@{#429}) on port 20467
12-Oct-2021 13:19:37 Only local connections are allowed.
12-Oct-2021 13:19:37 Please see https://chromedriver.chromium.org/security-considerations for suggestions on keeping ChromeDriver safe.
12-Oct-2021 13:19:37 ChromeDriver was started successfully.
12-Oct-2021 13:19:38 Oct 12, 2021 1:19:38 PM org.openqa.selenium.remote.ProtocolHandshake createSession
12-Oct-2021 13:19:38 INFO: Detected dialect: W3C
12-Oct-2021 13:19:46 Tests run: 1, Failures: 0, Errors: 0, Skipped: 0, Time elapsed: 8.48 sec
12-Oct-2021 13:19:46 Running org.openmrs.reference.AddDeleteLocationTest
12-Oct-2021 13:19:46 Running locally...
12-Oct-2021 13:19:46 Starting ChromeDriver 90.0.4430.24 (4c6d850f087da467d926e8eddb76550aed655991-refs/branch-heads/4430@{#429}) on port 7517
12-Oct-2021 13:19:46 Only local connections are allowed.
12-Oct-2021 13:19:46 Please see https://chromedriver.chromium.org/security-considerations for suggestions on keeping ChromeDriver safe.
12-Oct-2021 13:19:46 ChromeDriver was started successfully.
12-Oct-2021 13:19:46 Oct 12, 2021 1:19:46 PM org.openqa.selenium.remote.ProtocolHandshake createSession
12-Oct-2021 13:19:46 INFO: Detected dialect: W3C
12-Oct-2021 13:19:50 Tests run: 1, Failures: 0, Errors: 0, Skipped: 0, Time elapsed: 4.543 sec
12-Oct-2021 13:19:50 Running org.openmrs.reference.DuplicatePatientRegisterTest
12-Oct-2021 13:19:50 Running locally...
12-Oct-2021 13:19:50 Starting ChromeDriver 90.0.4430.24 (4c6d850f087da467d926e8eddb76550aed655991-refs/branch-heads/4430@{#429}) on port 9092
12-Oct-2021 13:19:50 Only local connections are allowed.
12-Oct-2021 13:19:50 Please see https://chromedriver.chromium.org/security-considerations for suggestions on keeping ChromeDriver safe.
12-Oct-2021 13:19:50 ChromeDriver was started successfully.
12-Oct-2021 13:19:51 Oct 12, 2021 1:19:51 PM org.openqa.selenium.remote.ProtocolHandshake createSession
12-Oct-2021 13:19:51 INFO: Detected dialect: W3C
12-Oct-2021 13:20:02 Tests run: 1, Failures: 0, Errors: 0, Skipped: 0, Time elapsed: 11.453 sec
12-Oct-2021 13:20:02 Running org.openmrs.reference.UsingBackButtonInMergePatientTest
12-Oct-2021 13:20:02 Running locally...
12-Oct-2021 13:20:02 Starting ChromeDriver 90.0.4430.24 (4c6d850f087da467d926e8eddb76550aed655991-refs/branch-heads/4430@{#429}) on port 23213
12-Oct-2021 13:20:02 Only local connections are allowed.
12-Oct-2021 13:20:02 Please see https://chromedriver.chromium.org/security-considerations for suggestions on keeping ChromeDriver safe.
12-Oct-2021 13:20:02 ChromeDriver was started successfully.
12-Oct-2021 13:20:02 Oct 12, 2021 1:20:02 PM org.openqa.selenium.remote.ProtocolHandshake createSession
12-Oct-2021 13:20:02 INFO: Detected dialect: W3C
12-Oct-2021 13:20:16 Tests run: 1, Failures: 0, Errors: 0, Skipped: 0, Time elapsed: 13.836 sec
12-Oct-2021 13:20:16 Running org.openmrs.reference.AddDiagnosisToVisitNoteTest
12-Oct-2021 13:20:16 Running locally...
12-Oct-2021 13:20:16 Starting ChromeDriver 90.0.4430.24 (4c6d850f087da467d926e8eddb76550aed655991-refs/branch-heads/4430@{#429}) on port 30653
12-Oct-2021 13:20:16 Only local connections are allowed.
12-Oct-2021 13:20:16 Please see https://chromedriver.chromium.org/security-considerations for suggestions on keeping ChromeDriver safe.
12-Oct-2021 13:20:16 ChromeDriver was started successfully.
12-Oct-2021 13:20:16 Oct 12, 2021 1:20:16 PM org.openqa.selenium.remote.ProtocolHandshake createSession
12-Oct-2021 13:20:16 INFO: Detected dialect: W3C
12-Oct-2021 13:20:29 Tests run: 1, Failures: 0, Errors: 0, Skipped: 0, Time elapsed: 13.295 sec
12-Oct-2021 13:20:29 Running org.openmrs.reference.MergeVisitsTest
12-Oct-2021 13:20:29 Running locally...
12-Oct-2021 13:20:29 Starting ChromeDriver 90.0.4430.24 (4c6d850f087da467d926e8eddb76550aed655991-refs/branch-heads/4430@{#429}) on port 27677
12-Oct-2021 13:20:29 Only local connections are allowed.
12-Oct-2021 13:20:29 Please see https://chromedriver.chromium.org/security-considerations for suggestions on keeping ChromeDriver safe.
12-Oct-2021 13:20:29 ChromeDriver was started successfully.
12-Oct-2021 13:20:29 Oct 12, 2021 1:20:29 PM org.openqa.selenium.remote.ProtocolHandshake createSession
12-Oct-2021 13:20:29 INFO: Detected dialect: W3C
12-Oct-2021 13:20:43 Tests run: 1, Failures: 0, Errors: 0, Skipped: 0, Time elapsed: 13.787 sec
12-Oct-2021 13:20:43 Running org.openmrs.reference.EditServiceTest
12-Oct-2021 13:20:43 Running locally...
12-Oct-2021 13:20:43 Starting ChromeDriver 90.0.4430.24 (4c6d850f087da467d926e8eddb76550aed655991-refs/branch-heads/4430@{#429}) on port 28846
12-Oct-2021 13:20:43 Only local connections are allowed.
12-Oct-2021 13:20:43 Please see https://chromedriver.chromium.org/security-considerations for suggestions on keeping ChromeDriver safe.
12-Oct-2021 13:20:43 ChromeDriver was started successfully.
12-Oct-2021 13:20:43 Oct 12, 2021 1:20:43 PM org.openqa.selenium.remote.ProtocolHandshake createSession
12-Oct-2021 13:20:43 INFO: Detected dialect: W3C
12-Oct-2021 13:20:49 Tests run: 1, Failures: 0, Errors: 0, Skipped: 0, Time elapsed: 6.477 sec
12-Oct-2021 13:20:49 Running org.openmrs.reference.AddNewAllergyTest
12-Oct-2021 13:20:49 Running locally...
12-Oct-2021 13:20:49 Starting ChromeDriver 90.0.4430.24 (4c6d850f087da467d926e8eddb76550aed655991-refs/branch-heads/4430@{#429}) on port 5705
12-Oct-2021 13:20:49 Only local connections are allowed.
12-Oct-2021 13:20:49 Please see https://chromedriver.chromium.org/security-considerations for suggestions on keeping ChromeDriver safe.
12-Oct-2021 13:20:49 ChromeDriver was started successfully.
12-Oct-2021 13:20:50 Oct 12, 2021 1:20:50 PM org.openqa.selenium.remote.ProtocolHandshake createSession
12-Oct-2021 13:20:50 INFO: Detected dialect: W3C
12-Oct-2021 13:20:57 Tests run: 1, Failures: 0, Errors: 0, Skipped: 0, Time elapsed: 8.093 sec
12-Oct-2021 13:20:57 Running org.openmrs.reference.LoginTest
12-Oct-2021 13:20:57 Running locally...
12-Oct-2021 13:20:57 Starting ChromeDriver 90.0.4430.24 (4c6d850f087da467d926e8eddb76550aed655991-refs/branch-heads/4430@{#429}) on port 13437
12-Oct-2021 13:20:57 Only local connections are allowed.
12-Oct-2021 13:20:57 Please see https://chromedriver.chromium.org/security-considerations for suggestions on keeping ChromeDriver safe.
12-Oct-2021 13:20:57 ChromeDriver was started successfully.
12-Oct-2021 13:20:58 Oct 12, 2021 1:20:58 PM org.openqa.selenium.remote.ProtocolHandshake createSession
12-Oct-2021 13:20:58 INFO: Detected dialect: W3C
12-Oct-2021 13:21:00 Running locally...
12-Oct-2021 13:21:00 Starting ChromeDriver 90.0.4430.24 (4c6d850f087da467d926e8eddb76550aed655991-refs/branch-heads/4430@{#429}) on port 26606
12-Oct-2021 13:21:00 Only local connections are allowed.
12-Oct-2021 13:21:00 Please see https://chromedriver.chromium.org/security-considerations for suggestions on keeping ChromeDriver safe.
12-Oct-2021 13:21:00 ChromeDriver was started successfully.
12-Oct-2021 13:21:00 Oct 12, 2021 1:21:00 PM org.openqa.selenium.remote.ProtocolHandshake createSession
12-Oct-2021 13:21:00 INFO: Detected dialect: W3C
12-Oct-2021 13:21:02 Running locally...
12-Oct-2021 13:21:02 Starting ChromeDriver 90.0.4430.24 (4c6d850f087da467d926e8eddb76550aed655991-refs/branch-heads/4430@{#429}) on port 14980
12-Oct-2021 13:21:02 Only local connections are allowed.
12-Oct-2021 13:21:02 Please see https://chromedriver.chromium.org/security-considerations for suggestions on keeping ChromeDriver safe.
12-Oct-2021 13:21:02 ChromeDriver was started successfully.
12-Oct-2021 13:21:03 Oct 12, 2021 1:21:03 PM org.openqa.selenium.remote.ProtocolHandshake createSession
12-Oct-2021 13:21:03 INFO: Detected dialect: W3C
12-Oct-2021 13:21:05 Running locally...
12-Oct-2021 13:21:05 Starting ChromeDriver 90.0.4430.24 (4c6d850f087da467d926e8eddb76550aed655991-refs/branch-heads/4430@{#429}) on port 5823
12-Oct-2021 13:21:05 Only local connections are allowed.
12-Oct-2021 13:21:05 Please see https://chromedriver.chromium.org/security-considerations for suggestions on keeping ChromeDriver safe.
12-Oct-2021 13:21:05 ChromeDriver was started successfully.
12-Oct-2021 13:21:06 Oct 12, 2021 1:21:06 PM org.openqa.selenium.remote.ProtocolHandshake createSession
12-Oct-2021 13:21:06 INFO: Detected dialect: W3C
12-Oct-2021 13:21:08 Running locally...
12-Oct-2021 13:21:08 Starting ChromeDriver 90.0.4430.24 (4c6d850f087da467d926e8eddb76550aed655991-refs/branch-heads/4430@{#429}) on port 6968
12-Oct-2021 13:21:08 Only local connections are allowed.
12-Oct-2021 13:21:08 Please see https://chromedriver.chromium.org/security-considerations for suggestions on keeping ChromeDriver safe.
12-Oct-2021 13:21:08 ChromeDriver was started successfully.
12-Oct-2021 13:21:09 Oct 12, 2021 1:21:09 PM org.openqa.selenium.remote.ProtocolHandshake createSession
12-Oct-2021 13:21:09 INFO: Detected dialect: W3C
12-Oct-2021 13:21:11 Tests run: 5, Failures: 0, Errors: 0, Skipped: 0, Time elapsed: 13.564 sec
12-Oct-2021 13:21:11 Running org.openmrs.reference.DeleteProviderTest
12-Oct-2021 13:21:11 Running locally...
12-Oct-2021 13:21:11 Starting ChromeDriver 90.0.4430.24 (4c6d850f087da467d926e8eddb76550aed655991-refs/branch-heads/4430@{#429}) on port 23886
12-Oct-2021 13:21:11 Only local connections are allowed.
12-Oct-2021 13:21:11 Please see https://chromedriver.chromium.org/security-considerations for suggestions on keeping ChromeDriver safe.
12-Oct-2021 13:21:11 ChromeDriver was started successfully.
12-Oct-2021 13:21:11 Oct 12, 2021 1:21:11 PM org.openqa.selenium.remote.ProtocolHandshake createSession
12-Oct-2021 13:21:11 INFO: Detected dialect: W3C
12-Oct-2021 13:21:16 Tests run: 1, Failures: 0, Errors: 0, Skipped: 0, Time elapsed: 4.992 sec
12-Oct-2021 13:21:16 Running org.openmrs.reference.RegisterPatientTest
12-Oct-2021 13:21:16 Running locally...
12-Oct-2021 13:21:16 Starting ChromeDriver 90.0.4430.24 (4c6d850f087da467d926e8eddb76550aed655991-refs/branch-heads/4430@{#429}) on port 13075
12-Oct-2021 13:21:16 Only local connections are allowed.
12-Oct-2021 13:21:16 Please see https://chromedriver.chromium.org/security-considerations for suggestions on keeping ChromeDriver safe.
12-Oct-2021 13:21:16 ChromeDriver was started successfully.
12-Oct-2021 13:21:16 Oct 12, 2021 1:21:16 PM org.openqa.selenium.remote.ProtocolHandshake createSession
12-Oct-2021 13:21:16 INFO: Detected dialect: W3C
12-Oct-2021 13:21:24 Tests run: 1, Failures: 0, Errors: 0, Skipped: 0, Time elapsed: 7.914 sec
12-Oct-2021 13:21:24 Running org.openmrs.reference.ContactInfoTest
12-Oct-2021 13:21:24 Running locally...
12-Oct-2021 13:21:24 Starting ChromeDriver 90.0.4430.24 (4c6d850f087da467d926e8eddb76550aed655991-refs/branch-heads/4430@{#429}) on port 27498
12-Oct-2021 13:21:24 Only local connections are allowed.
12-Oct-2021 13:21:24 Please see https://chromedriver.chromium.org/security-considerations for suggestions on keeping ChromeDriver safe.
12-Oct-2021 13:21:24 ChromeDriver was started successfully.
12-Oct-2021 13:21:24 Oct 12, 2021 1:21:24 PM org.openqa.selenium.remote.ProtocolHandshake createSession
12-Oct-2021 13:21:24 INFO: Detected dialect: W3C
12-Oct-2021 13:21:36 Tests run: 1, Failures: 0, Errors: 0, Skipped: 0, Time elapsed: 12.07 sec
12-Oct-2021 13:21:36 Running org.openmrs.reference.StartVisitTest
12-Oct-2021 13:21:36 Running locally...
12-Oct-2021 13:21:36 Starting ChromeDriver 90.0.4430.24 (4c6d850f087da467d926e8eddb76550aed655991-refs/branch-heads/4430@{#429}) on port 2542
12-Oct-2021 13:21:36 Only local connections are allowed.
12-Oct-2021 13:21:36 Please see https://chromedriver.chromium.org/security-considerations for suggestions on keeping ChromeDriver safe.
12-Oct-2021 13:21:36 ChromeDriver was started successfully.
12-Oct-2021 13:21:36 Oct 12, 2021 1:21:36 PM org.openqa.selenium.remote.ProtocolHandshake createSession
12-Oct-2021 13:21:36 INFO: Detected dialect: W3C
12-Oct-2021 13:21:48 Tests run: 1, Failures: 0, Errors: 0, Skipped: 0, Time elapsed: 11.611 sec
12-Oct-2021 13:21:48 Running org.openmrs.reference.DeletePersonTest
12-Oct-2021 13:21:48 Running locally...
12-Oct-2021 13:21:48 Starting ChromeDriver 90.0.4430.24 (4c6d850f087da467d926e8eddb76550aed655991-refs/branch-heads/4430@{#429}) on port 29092
12-Oct-2021 13:21:48 Only local connections are allowed.
12-Oct-2021 13:21:48 Please see https://chromedriver.chromium.org/security-considerations for suggestions on keeping ChromeDriver safe.
12-Oct-2021 13:21:48 ChromeDriver was started successfully.
12-Oct-2021 13:21:48 Oct 12, 2021 1:21:48 PM org.openqa.selenium.remote.ProtocolHandshake createSession
12-Oct-2021 13:21:48 INFO: Detected dialect: W3C
12-Oct-2021 13:21:55 Tests run: 1, Failures: 0, Errors: 0, Skipped: 0, Time elapsed: 6.984 sec
12-Oct-2021 13:21:55 Running org.openmrs.reference.EditProviderTest
12-Oct-2021 13:21:55 Running locally...
12-Oct-2021 13:21:55 Starting ChromeDriver 90.0.4430.24 (4c6d850f087da467d926e8eddb76550aed655991-refs/branch-heads/4430@{#429}) on port 13304
12-Oct-2021 13:21:55 Only local connections are allowed.
12-Oct-2021 13:21:55 Please see https://chromedriver.chromium.org/security-considerations for suggestions on keeping ChromeDriver safe.
12-Oct-2021 13:21:55 ChromeDriver was started successfully.
12-Oct-2021 13:21:55 Oct 12, 2021 1:21:55 PM org.openqa.selenium.remote.ProtocolHandshake createSession
12-Oct-2021 13:21:55 INFO: Detected dialect: W3C
12-Oct-2021 13:22:01 Tests run: 1, Failures: 0, Errors: 0, Skipped: 0, Time elapsed: 6.473 sec
12-Oct-2021 13:22:01 Running org.openmrs.reference.RetireVisitTypeTest
12-Oct-2021 13:22:01 Running locally...
12-Oct-2021 13:22:01 Starting ChromeDriver 90.0.4430.24 (4c6d850f087da467d926e8eddb76550aed655991-refs/branch-heads/4430@{#429}) on port 7628
12-Oct-2021 13:22:01 Only local connections are allowed.
12-Oct-2021 13:22:01 Please see https://chromedriver.chromium.org/security-considerations for suggestions on keeping ChromeDriver safe.
12-Oct-2021 13:22:01 ChromeDriver was started successfully.
12-Oct-2021 13:22:01 Oct 12, 2021 1:22:01 PM org.openqa.selenium.remote.ProtocolHandshake createSession
12-Oct-2021 13:22:01 INFO: Detected dialect: W3C
12-Oct-2021 13:22:05 Tests run: 1, Failures: 0, Errors: 0, Skipped: 0, Time elapsed: 4.439 sec
12-Oct-2021 13:22:06
12-Oct-2021 13:22:06 Results :
12-Oct-2021 13:22:06
12-Oct-2021 13:22:06 Tests run: 58, Failures: 0, Errors: 0, Skipped: 0
12-Oct-2021 13:22:06
12-Oct-2021 13:22:06 [INFO]
12-Oct-2021 13:22:06 [INFO] --- maven-jar-plugin:2.4:jar (default-jar) @ referenceapplication-ui-tests ---
12-Oct-2021 13:22:06 [WARNING] JAR will be empty - no content was marked for inclusion!
12-Oct-2021 13:22:06 [INFO] Building jar: /home/bamboo-agent/bamboo-agent/xml-data/build-dir/REFAPP-UI-FRAMEWORK/ui-tests/target/referenceapplication-ui-tests-2.12.0-SNAPSHOT.jar
12-Oct-2021 13:22:06 [INFO]
12-Oct-2021 13:22:06 [INFO] --- maven-jar-plugin:2.4:test-jar (default) @ referenceapplication-ui-tests ---
12-Oct-2021 13:22:06 [INFO] Building jar: /home/bamboo-agent/bamboo-agent/xml-data/build-dir/REFAPP-UI-FRAMEWORK/ui-tests/target/referenceapplication-ui-tests-2.12.0-SNAPSHOT-tests.jar
12-Oct-2021 13:22:09 [INFO]
12-Oct-2021 13:22:09 [INFO] --- maven-failsafe-plugin:2.18.1:integration-test (default) @ referenceapplication-ui-tests ---
12-Oct-2021 13:22:10 [INFO] Failsafe report directory: /home/bamboo-agent/bamboo-agent/xml-data/build-dir/REFAPP-UI-FRAMEWORK/ui-tests/target/failsafe-reports
12-Oct-2021 13:22:10
12-Oct-2021 13:22:10 -------------------------------------------------------
12-Oct-2021 13:22:10 T E S T S
12-Oct-2021 13:22:10 -------------------------------------------------------
12-Oct-2021 13:22:14 Running org.openmrs.reference.AddDeleteLocationTest
12-Oct-2021 13:22:14 Running locally...
12-Oct-2021 13:22:17 Starting ChromeDriver 90.0.4430.24 (4c6d850f087da467d926e8eddb76550aed655991-refs/branch-heads/4430@{#429}) on port 4787
12-Oct-2021 13:22:17 Only local connections are allowed.
12-Oct-2021 13:22:17 Please see https://chromedriver.chromium.org/security-considerations for suggestions on keeping ChromeDriver safe.
12-Oct-2021 13:22:17 ChromeDriver was started successfully.
12-Oct-2021 13:22:18 Oct 12, 2021 1:22:18 PM org.openqa.selenium.remote.ProtocolHandshake createSession
12-Oct-2021 13:22:18 INFO: Detected dialect: W3C
12-Oct-2021 13:22:24 Tests run: 1, Failures: 0, Errors: 0, Skipped: 0, Time elapsed: 10.174 sec - in org.openmrs.reference.AddDeleteLocationTest
12-Oct-2021 13:22:24 Running org.openmrs.reference.AddDeleteServiceTest
12-Oct-2021 13:22:24 Running locally...
12-Oct-2021 13:22:24 Starting ChromeDriver 90.0.4430.24 (4c6d850f087da467d926e8eddb76550aed655991-refs/branch-heads/4430@{#429}) on port 1564
12-Oct-2021 13:22:24 Only local connections are allowed.
12-Oct-2021 13:22:24 Please see https://chromedriver.chromium.org/security-considerations for suggestions on keeping ChromeDriver safe.
12-Oct-2021 13:22:24 ChromeDriver was started successfully.
12-Oct-2021 13:22:24 Oct 12, 2021 1:22:24 PM org.openqa.selenium.remote.ProtocolHandshake createSession
12-Oct-2021 13:22:24 INFO: Detected dialect: W3C
12-Oct-2021 13:22:30 Tests run: 1, Failures: 0, Errors: 0, Skipped: 0, Time elapsed: 5.839 sec - in org.openmrs.reference.AddDeleteServiceTest
12-Oct-2021 13:22:30 Running org.openmrs.reference.AddDiagnosisToVisitNoteTest
12-Oct-2021 13:22:30 Running locally...
12-Oct-2021 13:22:30 Starting ChromeDriver 90.0.4430.24 (4c6d850f087da467d926e8eddb76550aed655991-refs/branch-heads/4430@{#429}) on port 16310
12-Oct-2021 13:22:30 Only local connections are allowed.
12-Oct-2021 13:22:30 Please see https://chromedriver.chromium.org/security-considerations for suggestions on keeping ChromeDriver safe.
12-Oct-2021 13:22:30 ChromeDriver was started successfully.
12-Oct-2021 13:22:30 Oct 12, 2021 1:22:30 PM org.openqa.selenium.remote.ProtocolHandshake createSession
12-Oct-2021 13:22:30 INFO: Detected dialect: W3C
12-Oct-2021 13:22:45 Tests run: 1, Failures: 0, Errors: 0, Skipped: 0, Time elapsed: 14.974 sec - in org.openmrs.reference.AddDiagnosisToVisitNoteTest
12-Oct-2021 13:22:45 Running org.openmrs.reference.AddEditAppointmentBlockTest
12-Oct-2021 13:22:45 Running locally...
12-Oct-2021 13:22:45 Starting ChromeDriver 90.0.4430.24 (4c6d850f087da467d926e8eddb76550aed655991-refs/branch-heads/4430@{#429}) on port 14613
12-Oct-2021 13:22:45 Only local connections are allowed.
12-Oct-2021 13:22:45 Please see https://chromedriver.chromium.org/security-considerations for suggestions on keeping ChromeDriver safe.
12-Oct-2021 13:22:45 ChromeDriver was started successfully.
12-Oct-2021 13:22:45 Oct 12, 2021 1:22:45 PM org.openqa.selenium.remote.ProtocolHandshake createSession
12-Oct-2021 13:22:45 INFO: Detected dialect: W3C
12-Oct-2021 13:22:52 Tests run: 1, Failures: 0, Errors: 0, Skipped: 0, Time elapsed: 6.86 sec - in org.openmrs.reference.AddEditAppointmentBlockTest
12-Oct-2021 13:22:52 Running org.openmrs.reference.AddNewAllergyTest
12-Oct-2021 13:22:52 Running locally...
12-Oct-2021 13:22:52 Starting ChromeDriver 90.0.4430.24 (4c6d850f087da467d926e8eddb76550aed655991-refs/branch-heads/4430@{#429}) on port 9809
12-Oct-2021 13:22:52 Only local connections are allowed.
12-Oct-2021 13:22:52 Please see https://chromedriver.chromium.org/security-considerations for suggestions on keeping ChromeDriver safe.
12-Oct-2021 13:22:52 ChromeDriver was started successfully.
12-Oct-2021 13:22:52 Oct 12, 2021 1:22:52 PM org.openqa.selenium.remote.ProtocolHandshake createSession
12-Oct-2021 13:22:52 INFO: Detected dialect: W3C
12-Oct-2021 13:23:00 Tests run: 1, Failures: 0, Errors: 0, Skipped: 0, Time elapsed: 8.611 sec - in org.openmrs.reference.AddNewAllergyTest
12-Oct-2021 13:23:00 Running org.openmrs.reference.AddPastVisitTest
12-Oct-2021 13:23:00 Running locally...
12-Oct-2021 13:23:00 Starting ChromeDriver 90.0.4430.24 (4c6d850f087da467d926e8eddb76550aed655991-refs/branch-heads/4430@{#429}) on port 16334
12-Oct-2021 13:23:00 Only local connections are allowed.
12-Oct-2021 13:23:00 Please see https://chromedriver.chromium.org/security-considerations for suggestions on keeping ChromeDriver safe.
12-Oct-2021 13:23:00 ChromeDriver was started successfully.
12-Oct-2021 13:23:01 Oct 12, 2021 1:23:01 PM org.openqa.selenium.remote.ProtocolHandshake createSession
12-Oct-2021 13:23:01 INFO: Detected dialect: W3C
12-Oct-2021 13:23:10 Tests run: 1, Failures: 0, Errors: 0, Skipped: 0, Time elapsed: 9.402 sec - in org.openmrs.reference.AddPastVisitTest
12-Oct-2021 13:23:10 Running org.openmrs.reference.AddPatientAppointmentTest
12-Oct-2021 13:23:10 Running locally...
12-Oct-2021 13:23:10 Starting ChromeDriver 90.0.4430.24 (4c6d850f087da467d926e8eddb76550aed655991-refs/branch-heads/4430@{#429}) on port 24108
12-Oct-2021 13:23:10 Only local connections are allowed.
12-Oct-2021 13:23:10 Please see https://chromedriver.chromium.org/security-considerations for suggestions on keeping ChromeDriver safe.
12-Oct-2021 13:23:10 ChromeDriver was started successfully.
12-Oct-2021 13:23:10 Oct 12, 2021 1:23:10 PM org.openqa.selenium.remote.ProtocolHandshake createSession
12-Oct-2021 13:23:10 INFO: Detected dialect: W3C
12-Oct-2021 13:23:26 Tests run: 1, Failures: 0, Errors: 0, Skipped: 0, Time elapsed: 15.831 sec - in org.openmrs.reference.AddPatientAppointmentTest
12-Oct-2021 13:23:26 Running org.openmrs.reference.AddProviderTest
12-Oct-2021 13:23:26 Running locally...
12-Oct-2021 13:23:26 Starting ChromeDriver 90.0.4430.24 (4c6d850f087da467d926e8eddb76550aed655991-refs/branch-heads/4430@{#429}) on port 30676
12-Oct-2021 13:23:26 Only local connections are allowed.
12-Oct-2021 13:23:26 Please see https://chromedriver.chromium.org/security-considerations for suggestions on keeping ChromeDriver safe.
12-Oct-2021 13:23:26 ChromeDriver was started successfully.
12-Oct-2021 13:23:26 Oct 12, 2021 1:23:26 PM org.openqa.selenium.remote.ProtocolHandshake createSession
12-Oct-2021 13:23:26 INFO: Detected dialect: W3C
12-Oct-2021 13:23:33 Tests run: 1, Failures: 0, Errors: 0, Skipped: 0, Time elapsed: 7.433 sec - in org.openmrs.reference.AddProviderTest
12-Oct-2021 13:23:33 Running org.openmrs.reference.AddUserTest
12-Oct-2021 13:23:33 Running locally...
12-Oct-2021 13:23:33 Starting ChromeDriver 90.0.4430.24 (4c6d850f087da467d926e8eddb76550aed655991-refs/branch-heads/4430@{#429}) on port 28821
12-Oct-2021 13:23:33 Only local connections are allowed.
12-Oct-2021 13:23:33 Please see https://chromedriver.chromium.org/security-considerations for suggestions on keeping ChromeDriver safe.
12-Oct-2021 13:23:33 ChromeDriver was started successfully.
12-Oct-2021 13:23:33 Oct 12, 2021 1:23:33 PM org.openqa.selenium.remote.ProtocolHandshake createSession
12-Oct-2021 13:23:33 INFO: Detected dialect: W3C
12-Oct-2021 13:23:44 Tests run: 1, Failures: 0, Errors: 0, Skipped: 0, Time elapsed: 11.129 sec - in org.openmrs.reference.AddUserTest
12-Oct-2021 13:23:44 Running org.openmrs.reference.AddVisitTypeTest
12-Oct-2021 13:23:44 Running locally...
12-Oct-2021 13:23:44 Starting ChromeDriver 90.0.4430.24 (4c6d850f087da467d926e8eddb76550aed655991-refs/branch-heads/4430@{#429}) on port 15623
12-Oct-2021 13:23:44 Only local connections are allowed.
12-Oct-2021 13:23:44 Please see https://chromedriver.chromium.org/security-considerations for suggestions on keeping ChromeDriver safe.
12-Oct-2021 13:23:44 ChromeDriver was started successfully.
12-Oct-2021 13:23:45 Oct 12, 2021 1:23:45 PM org.openqa.selenium.remote.ProtocolHandshake createSession
12-Oct-2021 13:23:45 INFO: Detected dialect: W3C
12-Oct-2021 13:23:49 Starting ChromeDriver 90.0.4430.24 (4c6d850f087da467d926e8eddb76550aed655991-refs/branch-heads/4430@{#429}) on port 5955
12-Oct-2021 13:23:49 Only local connections are allowed.
12-Oct-2021 13:23:49 Please see https://chromedriver.chromium.org/security-considerations for suggestions on keeping ChromeDriver safe.
12-Oct-2021 13:23:49 ChromeDriver was started successfully.
12-Oct-2021 13:23:49 Tests run: 1, Failures: 0, Errors: 0, Skipped: 0, Time elapsed: 4.654 sec - in org.openmrs.reference.AddVisitTypeTest
12-Oct-2021 13:23:49 Running org.openmrs.reference.AdmitExitInpatientTest
12-Oct-2021 13:23:49 Running locally...
12-Oct-2021 13:23:49 Oct 12, 2021 1:23:49 PM org.openqa.selenium.remote.ProtocolHandshake createSession
12-Oct-2021 13:23:49 INFO: Detected dialect: W3C
12-Oct-2021 13:24:04 Tests run: 1, Failures: 0, Errors: 0, Skipped: 0, Time elapsed: 15.233 sec - in org.openmrs.reference.AdmitExitInpatientTest
12-Oct-2021 13:24:04 Running org.openmrs.reference.BookRequestAppointmentTest
12-Oct-2021 13:24:04 Running locally...
12-Oct-2021 13:24:04 Starting ChromeDriver 90.0.4430.24 (4c6d850f087da467d926e8eddb76550aed655991-refs/branch-heads/4430@{#429}) on port 18838
12-Oct-2021 13:24:04 Only local connections are allowed.
12-Oct-2021 13:24:04 Please see https://chromedriver.chromium.org/security-considerations for suggestions on keeping ChromeDriver safe.
12-Oct-2021 13:24:04 ChromeDriver was started successfully.
12-Oct-2021 13:24:05 Oct 12, 2021 1:24:05 PM org.openqa.selenium.remote.ProtocolHandshake createSession
12-Oct-2021 13:24:05 INFO: Detected dialect: W3C
12-Oct-2021 13:24:26 Tests run: 1, Failures: 0, Errors: 0, Skipped: 0, Time elapsed: 21.342 sec - in org.openmrs.reference.BookRequestAppointmentTest
12-Oct-2021 13:24:26 Running org.openmrs.reference.CaptureVitalsTest
12-Oct-2021 13:24:26 Running locally...
12-Oct-2021 13:24:26 Starting ChromeDriver 90.0.4430.24 (4c6d850f087da467d926e8eddb76550aed655991-refs/branch-heads/4430@{#429}) on port 30935
12-Oct-2021 13:24:26 Only local connections are allowed.
12-Oct-2021 13:24:26 Please see https://chromedriver.chromium.org/security-considerations for suggestions on keeping ChromeDriver safe.
12-Oct-2021 13:24:26 ChromeDriver was started successfully.
12-Oct-2021 13:24:26 Oct 12, 2021 1:24:26 PM org.openqa.selenium.remote.ProtocolHandshake createSession
12-Oct-2021 13:24:26 INFO: Detected dialect: W3C
12-Oct-2021 13:24:36 Tests run: 1, Failures: 0, Errors: 0, Skipped: 0, Time elapsed: 10.776 sec - in org.openmrs.reference.CaptureVitalsTest
12-Oct-2021 13:24:36 Running org.openmrs.reference.ComeBackToApplicationAfterLogoutTest
12-Oct-2021 13:24:36 Running locally...
12-Oct-2021 13:24:36 Starting ChromeDriver 90.0.4430.24 (4c6d850f087da467d926e8eddb76550aed655991-refs/branch-heads/4430@{#429}) on port 11088
12-Oct-2021 13:24:36 Only local connections are allowed.
12-Oct-2021 13:24:36 Please see https://chromedriver.chromium.org/security-considerations for suggestions on keeping ChromeDriver safe.
12-Oct-2021 13:24:36 ChromeDriver was started successfully.
12-Oct-2021 13:24:37 Oct 12, 2021 1:24:37 PM org.openqa.selenium.remote.ProtocolHandshake createSession
12-Oct-2021 13:24:37 INFO: Detected dialect: W3C
12-Oct-2021 13:24:39 Tests run: 1, Failures: 0, Errors: 0, Skipped: 0, Time elapsed: 2.535 sec - in org.openmrs.reference.ComeBackToApplicationAfterLogoutTest
12-Oct-2021 13:24:39 Running org.openmrs.reference.ContactInfoTest
12-Oct-2021 13:24:39 Running locally...
12-Oct-2021 13:24:39 Starting ChromeDriver 90.0.4430.24 (4c6d850f087da467d926e8eddb76550aed655991-refs/branch-heads/4430@{#429}) on port 14751
12-Oct-2021 13:24:39 Only local connections are allowed.
12-Oct-2021 13:24:39 Please see https://chromedriver.chromium.org/security-considerations for suggestions on keeping ChromeDriver safe.
12-Oct-2021 13:24:39 ChromeDriver was started successfully.
12-Oct-2021 13:24:39 Oct 12, 2021 1:24:39 PM org.openqa.selenium.remote.ProtocolHandshake createSession
12-Oct-2021 13:24:39 INFO: Detected dialect: W3C
12-Oct-2021 13:24:52 Tests run: 1, Failures: 0, Errors: 0, Skipped: 0, Time elapsed: 12.694 sec - in org.openmrs.reference.ContactInfoTest
12-Oct-2021 13:24:52 Running org.openmrs.reference.CreatePersonTest
12-Oct-2021 13:24:52 Running locally...
12-Oct-2021 13:24:52 Starting ChromeDriver 90.0.4430.24 (4c6d850f087da467d926e8eddb76550aed655991-refs/branch-heads/4430@{#429}) on port 24500
12-Oct-2021 13:24:52 Only local connections are allowed.
12-Oct-2021 13:24:52 Please see https://chromedriver.chromium.org/security-considerations for suggestions on keeping ChromeDriver safe.
12-Oct-2021 13:24:52 ChromeDriver was started successfully.
12-Oct-2021 13:24:52 Oct 12, 2021 1:24:52 PM org.openqa.selenium.remote.ProtocolHandshake createSession
12-Oct-2021 13:24:52 INFO: Detected dialect: W3C
12-Oct-2021 13:24:57 Tests run: 1, Failures: 0, Errors: 0, Skipped: 0, Time elapsed: 5.307 sec - in org.openmrs.reference.CreatePersonTest
12-Oct-2021 13:24:57 Running org.openmrs.reference.DeleteAllergyTest
12-Oct-2021 13:24:57 Running locally...
12-Oct-2021 13:24:57 Starting ChromeDriver 90.0.4430.24 (4c6d850f087da467d926e8eddb76550aed655991-refs/branch-heads/4430@{#429}) on port 14128
12-Oct-2021 13:24:57 Only local connections are allowed.
12-Oct-2021 13:24:57 Please see https://chromedriver.chromium.org/security-considerations for suggestions on keeping ChromeDriver safe.
12-Oct-2021 13:24:57 ChromeDriver was started successfully.
12-Oct-2021 13:24:57 Oct 12, 2021 1:24:57 PM org.openqa.selenium.remote.ProtocolHandshake createSession
12-Oct-2021 13:24:57 INFO: Detected dialect: W3C
12-Oct-2021 13:25:06 Tests run: 1, Failures: 0, Errors: 0, Skipped: 0, Time elapsed: 8.941 sec - in org.openmrs.reference.DeleteAllergyTest
12-Oct-2021 13:25:06 Running org.openmrs.reference.DeleteAppointmentBlockTest
12-Oct-2021 13:25:06 Running locally...
12-Oct-2021 13:25:06 Starting ChromeDriver 90.0.4430.24 (4c6d850f087da467d926e8eddb76550aed655991-refs/branch-heads/4430@{#429}) on port 19044
12-Oct-2021 13:25:06 Only local connections are allowed.
12-Oct-2021 13:25:06 Please see https://chromedriver.chromium.org/security-considerations for suggestions on keeping ChromeDriver safe.
12-Oct-2021 13:25:06 ChromeDriver was started successfully.
12-Oct-2021 13:25:06 Oct 12, 2021 1:25:06 PM org.openqa.selenium.remote.ProtocolHandshake createSession
12-Oct-2021 13:25:06 INFO: Detected dialect: W3C
12-Oct-2021 13:25:10 Running locally...
12-Oct-2021 13:25:10 Starting ChromeDriver 90.0.4430.24 (4c6d850f087da467d926e8eddb76550aed655991-refs/branch-heads/4430@{#429}) on port 2912
12-Oct-2021 13:25:10 Only local connections are allowed.
12-Oct-2021 13:25:10 Please see https://chromedriver.chromium.org/security-considerations for suggestions on keeping ChromeDriver safe.
12-Oct-2021 13:25:10 ChromeDriver was started successfully.
12-Oct-2021 13:25:11 Oct 12, 2021 1:25:11 PM org.openqa.selenium.remote.ProtocolHandshake createSession
12-Oct-2021 13:25:11 INFO: Detected dialect: W3C
12-Oct-2021 13:25:15 Running locally...
12-Oct-2021 13:25:15 Starting ChromeDriver 90.0.4430.24 (4c6d850f087da467d926e8eddb76550aed655991-refs/branch-heads/4430@{#429}) on port 2951
12-Oct-2021 13:25:15 Only local connections are allowed.
12-Oct-2021 13:25:15 Please see https://chromedriver.chromium.org/security-considerations for suggestions on keeping ChromeDriver safe.
12-Oct-2021 13:25:15 ChromeDriver was started successfully.
12-Oct-2021 13:25:15 Oct 12, 2021 1:25:15 PM org.openqa.selenium.remote.ProtocolHandshake createSession
12-Oct-2021 13:25:15 INFO: Detected dialect: W3C
12-Oct-2021 13:25:19 Tests run: 6, Failures: 0, Errors: 6, Skipped: 0, Time elapsed: 13.414 sec <<< FAILURE! - in org.openmrs.reference.DeleteAppointmentBlockTest
12-Oct-2021 13:25:19 deleteAppointmentBlockTest(org.openmrs.reference.DeleteAppointmentBlockTest)  Time elapsed: 4.441 sec  <<< ERROR!
12-Oct-2021 13:25:19 org.openqa.selenium.ElementClickInterceptedException: element click intercepted: Element <div class="fc-day-content">...</div> is not clickable at point (392, 369). Other element would receive the click: <div class="fc-event-inner">...</div>
12-Oct-2021 13:25:19   (Session info: headless chrome=90.0.4430.72)
12-Oct-2021 13:25:19 Build info: version: '4.0.0-alpha-6', revision: '5f43a29cfc'
12-Oct-2021 13:25:19 System info: host: 'yue', ip: '127.0.0.1', os.name: 'Linux', os.arch: 'amd64', os.version: '4.4.0-210-generic', java.version: '1.8.0_292'
12-Oct-2021 13:25:19 Driver info: org.openqa.selenium.chrome.ChromeDriver
12-Oct-2021 13:25:19 Capabilities {acceptInsecureCerts: false, browserName: chrome, browserVersion: 90.0.4430.72, chrome: {chromedriverVersion: 90.0.4430.24 (4c6d850f087da..., userDataDir: /tmp/.com.google.Chrome.D4FiWo}, goog:chromeOptions: {debuggerAddress: localhost:37774}, javascriptEnabled: true, networkConnectionEnabled: false, pageLoadStrategy: normal, platform: LINUX, platformName: LINUX, proxy: Proxy(), setWindowRect: true, strictFileInteractability: false, timeouts: {implicit: 0, pageLoad: 300000, script: 30000}, unhandledPromptBehavior: dismiss and notify, webauthn:extension:largeBlob: true, webauthn:virtualAuthenticators: true}
12-Oct-2021 13:25:19 Session ID: d86631c616978472b06d8cb32d9777f7
12-Oct-2021 13:25:19         at sun.reflect.NativeConstructorAccessorImpl.newInstance0(Native Method)
12-Oct-2021 13:25:19         at sun.reflect.NativeConstructorAccessorImpl.newInstance(NativeConstructorAccessorImpl.java:62)
12-Oct-2021 13:25:19         at sun.reflect.DelegatingConstructorAccessorImpl.newInstance(DelegatingConstructorAccessorImpl.java:45)
12-Oct-2021 13:25:19         at java.lang.reflect.Constructor.newInstance(Constructor.java:423)
12-Oct-2021 13:25:19         at org.openqa.selenium.remote.codec.w3c.W3CHttpResponseCodec.createException(W3CHttpResponseCodec.java:196)
12-Oct-2021 13:25:19         at org.openqa.selenium.remote.codec.w3c.W3CHttpResponseCodec.decode(W3CHttpResponseCodec.java:129)
12-Oct-2021 13:25:19         at org.openqa.selenium.remote.codec.w3c.W3CHttpResponseCodec.decode(W3CHttpResponseCodec.java:53)
12-Oct-2021 13:25:19         at org.openqa.selenium.remote.HttpCommandExecutor.execute(HttpCommandExecutor.java:160)
12-Oct-2021 13:25:19         at org.openqa.selenium.remote.service.DriverCommandExecutor.execute(DriverCommandExecutor.java:83)
12-Oct-2021 13:25:19         at org.openqa.selenium.remote.RemoteWebDriver.execute(RemoteWebDriver.java:582)
12-Oct-2021 13:25:19         at org.openqa.selenium.remote.RemoteWebElement.execute(RemoteWebElement.java:316)
12-Oct-2021 13:25:19         at org.openqa.selenium.remote.RemoteWebElement.click(RemoteWebElement.java:85)
12-Oct-2021 13:25:19         at org.openmrs.uitestframework.page.Page.clickOn(Page.java:210)
12-Oct-2021 13:25:19         at org.openmrs.reference.page.AppointmentBlocksPage.clickOnDay(AppointmentBlocksPage.java:124)
12-Oct-2021 13:25:19         at org.openmrs.reference.DeleteAppointmentBlockTest.deleteAppointmentBlockTest(DeleteAppointmentBlockTest.java:42)
12-Oct-2021 13:25:19
12-Oct-2021 13:25:19 deleteAppointmentBlockTest(org.openmrs.reference.DeleteAppointmentBlockTest)  Time elapsed: 4.449 sec  <<< ERROR!
12-Oct-2021 13:25:19 org.openqa.selenium.NoSuchSessionException: Session ID is null. Using WebDriver after calling quit()?
12-Oct-2021 13:25:19 Build info: version: '4.0.0-alpha-6', revision: '5f43a29cfc'
12-Oct-2021 13:25:19 System info: host: 'yue', ip: '127.0.0.1', os.name: 'Linux', os.arch: 'amd64', os.version: '4.4.0-210-generic', java.version: '1.8.0_292'
12-Oct-2021 13:25:19 Driver info: driver.version: RemoteWebDriver
12-Oct-2021 13:25:19         at org.openqa.selenium.remote.HttpCommandExecutor.execute(HttpCommandExecutor.java:127)
12-Oct-2021 13:25:19         at org.openqa.selenium.remote.service.DriverCommandExecutor.execute(DriverCommandExecutor.java:83)
12-Oct-2021 13:25:19         at org.openqa.selenium.remote.RemoteWebDriver.execute(RemoteWebDriver.java:582)
12-Oct-2021 13:25:19         at org.openqa.selenium.remote.RemoteWebDriver.execute(RemoteWebDriver.java:639)
12-Oct-2021 13:25:19         at org.openqa.selenium.remote.RemoteWebDriver.execute(RemoteWebDriver.java:643)
12-Oct-2021 13:25:19         at org.openqa.selenium.remote.RemoteWebDriver.getScreenshotAs(RemoteWebDriver.java:303)
12-Oct-2021 13:25:19         at org.openmrs.uitestframework.test.TestBase.takeScreenshot(TestBase.java:345)
12-Oct-2021 13:25:19         at org.openmrs.uitestframework.test.TestBase$1.failed(TestBase.java:84)
12-Oct-2021 13:25:19         at org.junit.rules.TestWatcher.failedQuietly(TestWatcher.java:90)
12-Oct-2021 13:25:19         at org.junit.rules.TestWatcher.access$300(TestWatcher.java:52)
12-Oct-2021 13:25:19         at org.junit.rules.TestWatcher$1.evaluate(TestWatcher.java:68)
12-Oct-2021 13:25:19         at org.junit.runners.ParentRunner$3.evaluate(ParentRunner.java:306)
12-Oct-2021 13:25:19         at org.junit.runners.BlockJUnit4ClassRunner$1.evaluate(BlockJUnit4ClassRunner.java:100)
12-Oct-2021 13:25:19         at org.junit.runners.ParentRunner.runLeaf(ParentRunner.java:366)
12-Oct-2021 13:25:19         at org.junit.runners.BlockJUnit4ClassRunner.runChild(BlockJUnit4ClassRunner.java:103)
12-Oct-2021 13:25:19         at org.junit.runners.BlockJUnit4ClassRunner.runChild(BlockJUnit4ClassRunner.java:63)
12-Oct-2021 13:25:19         at org.junit.runners.ParentRunner$4.run(ParentRunner.java:331)
12-Oct-2021 13:25:19         at org.junit.runners.ParentRunner$1.schedule(ParentRunner.java:79)
12-Oct-2021 13:25:19         at org.junit.runners.ParentRunner.runChildren(ParentRunner.java:329)
12-Oct-2021 13:25:19         at org.junit.runners.ParentRunner.access$100(ParentRunner.java:66)
12-Oct-2021 13:25:19         at org.junit.runners.ParentRunner$2.evaluate(ParentRunner.java:293)
12-Oct-2021 13:25:19         at org.junit.runners.ParentRunner$3.evaluate(ParentRunner.java:306)
12-Oct-2021 13:25:19         at org.junit.runners.ParentRunner.run(ParentRunner.java:413)
12-Oct-2021 13:25:19         at org.apache.maven.surefire.junit4.JUnit4Provider.execute(JUnit4Provider.java:283)
12-Oct-2021 13:25:19         at org.apache.maven.surefire.junit4.JUnit4Provider.executeWithRerun(JUnit4Provider.java:173)
12-Oct-2021 13:25:19         at org.apache.maven.surefire.junit4.JUnit4Provider.executeTestSet(JUnit4Provider.java:153)
12-Oct-2021 13:25:19         at org.apache.maven.surefire.junit4.JUnit4Provider.invoke(JUnit4Provider.java:128)
12-Oct-2021 13:25:19         at org.apache.maven.surefire.booter.ForkedBooter.invokeProviderInSameClassLoader(ForkedBooter.java:203)
12-Oct-2021 13:25:19         at org.apache.maven.surefire.booter.ForkedBooter.runSuitesInProcess(ForkedBooter.java:155)
12-Oct-2021 13:25:19         at org.apache.maven.surefire.booter.ForkedBooter.main(ForkedBooter.java:103)
12-Oct-2021 13:25:19
12-Oct-2021 13:25:19 deleteAppointmentBlockTest(org.openmrs.reference.DeleteAppointmentBlockTest)  Time elapsed: 4.525 sec  <<< ERROR!
12-Oct-2021 13:25:19 org.openqa.selenium.ElementClickInterceptedException: element click intercepted: Element <div class="fc-day-content">...</div> is not clickable at point (392, 369). Other element would receive the click: <div class="fc-event-inner">...</div>
12-Oct-2021 13:25:19   (Session info: headless chrome=90.0.4430.72)
12-Oct-2021 13:25:19 Build info: version: '4.0.0-alpha-6', revision: '5f43a29cfc'
12-Oct-2021 13:25:19 System info: host: 'yue', ip: '127.0.0.1', os.name: 'Linux', os.arch: 'amd64', os.version: '4.4.0-210-generic', java.version: '1.8.0_292'
12-Oct-2021 13:25:19 Driver info: org.openqa.selenium.chrome.ChromeDriver
12-Oct-2021 13:25:19 Capabilities {acceptInsecureCerts: false, browserName: chrome, browserVersion: 90.0.4430.72, chrome: {chromedriverVersion: 90.0.4430.24 (4c6d850f087da..., userDataDir: /tmp/.com.google.Chrome.OwVG33}, goog:chromeOptions: {debuggerAddress: localhost:33107}, javascriptEnabled: true, networkConnectionEnabled: false, pageLoadStrategy: normal, platform: LINUX, platformName: LINUX, proxy: Proxy(), setWindowRect: true, strictFileInteractability: false, timeouts: {implicit: 0, pageLoad: 300000, script: 30000}, unhandledPromptBehavior: dismiss and notify, webauthn:extension:largeBlob: true, webauthn:virtualAuthenticators: true}
12-Oct-2021 13:25:19 Session ID: 7a3cb0110770479c7c1cdc936d9f3112
12-Oct-2021 13:25:19         at sun.reflect.NativeConstructorAccessorImpl.newInstance0(Native Method)
12-Oct-2021 13:25:19         at sun.reflect.NativeConstructorAccessorImpl.newInstance(NativeConstructorAccessorImpl.java:62)
12-Oct-2021 13:25:19         at sun.reflect.DelegatingConstructorAccessorImpl.newInstance(DelegatingConstructorAccessorImpl.java:45)
12-Oct-2021 13:25:19         at java.lang.reflect.Constructor.newInstance(Constructor.java:423)
12-Oct-2021 13:25:19         at org.openqa.selenium.remote.codec.w3c.W3CHttpResponseCodec.createException(W3CHttpResponseCodec.java:196)
12-Oct-2021 13:25:19         at org.openqa.selenium.remote.codec.w3c.W3CHttpResponseCodec.decode(W3CHttpResponseCodec.java:129)
12-Oct-2021 13:25:19         at org.openqa.selenium.remote.codec.w3c.W3CHttpResponseCodec.decode(W3CHttpResponseCodec.java:53)
12-Oct-2021 13:25:19         at org.openqa.selenium.remote.HttpCommandExecutor.execute(HttpCommandExecutor.java:160)
12-Oct-2021 13:25:19         at org.openqa.selenium.remote.service.DriverCommandExecutor.execute(DriverCommandExecutor.java:83)
12-Oct-2021 13:25:19         at org.openqa.selenium.remote.RemoteWebDriver.execute(RemoteWebDriver.java:582)
12-Oct-2021 13:25:19         at org.openqa.selenium.remote.RemoteWebElement.execute(RemoteWebElement.java:316)
12-Oct-2021 13:25:19         at org.openqa.selenium.remote.RemoteWebElement.click(RemoteWebElement.java:85)
12-Oct-2021 13:25:19         at org.openmrs.uitestframework.page.Page.clickOn(Page.java:210)
12-Oct-2021 13:25:19         at org.openmrs.reference.page.AppointmentBlocksPage.clickOnDay(AppointmentBlocksPage.java:124)
12-Oct-2021 13:25:19         at org.openmrs.reference.DeleteAppointmentBlockTest.deleteAppointmentBlockTest(DeleteAppointmentBlockTest.java:42)
12-Oct-2021 13:25:19
12-Oct-2021 13:25:19 deleteAppointmentBlockTest(org.openmrs.reference.DeleteAppointmentBlockTest)  Time elapsed: 4.527 sec  <<< ERROR!
12-Oct-2021 13:25:19 org.openqa.selenium.NoSuchSessionException: Session ID is null. Using WebDriver after calling quit()?
12-Oct-2021 13:25:19 Build info: version: '4.0.0-alpha-6', revision: '5f43a29cfc'
12-Oct-2021 13:25:19 System info: host: 'yue', ip: '127.0.0.1', os.name: 'Linux', os.arch: 'amd64', os.version: '4.4.0-210-generic', java.version: '1.8.0_292'
12-Oct-2021 13:25:19 Driver info: driver.version: RemoteWebDriver
12-Oct-2021 13:25:19         at org.openqa.selenium.remote.HttpCommandExecutor.execute(HttpCommandExecutor.java:127)
12-Oct-2021 13:25:19         at org.openqa.selenium.remote.service.DriverCommandExecutor.execute(DriverCommandExecutor.java:83)
12-Oct-2021 13:25:19         at org.openqa.selenium.remote.RemoteWebDriver.execute(RemoteWebDriver.java:582)
12-Oct-2021 13:25:19         at org.openqa.selenium.remote.RemoteWebDriver.execute(RemoteWebDriver.java:639)
12-Oct-2021 13:25:19         at org.openqa.selenium.remote.RemoteWebDriver.execute(RemoteWebDriver.java:643)
12-Oct-2021 13:25:19         at org.openqa.selenium.remote.RemoteWebDriver.getScreenshotAs(RemoteWebDriver.java:303)
12-Oct-2021 13:25:19         at org.openmrs.uitestframework.test.TestBase.takeScreenshot(TestBase.java:345)
12-Oct-2021 13:25:19         at org.openmrs.uitestframework.test.TestBase$1.failed(TestBase.java:84)
12-Oct-2021 13:25:19         at org.junit.rules.TestWatcher.failedQuietly(TestWatcher.java:90)
12-Oct-2021 13:25:19         at org.junit.rules.TestWatcher.access$300(TestWatcher.java:52)
12-Oct-2021 13:25:19         at org.junit.rules.TestWatcher$1.evaluate(TestWatcher.java:68)
12-Oct-2021 13:25:19         at org.junit.runners.ParentRunner$3.evaluate(ParentRunner.java:306)
12-Oct-2021 13:25:19         at org.junit.runners.BlockJUnit4ClassRunner$1.evaluate(BlockJUnit4ClassRunner.java:100)
12-Oct-2021 13:25:19         at org.junit.runners.ParentRunner.runLeaf(ParentRunner.java:366)
12-Oct-2021 13:25:19         at org.junit.runners.BlockJUnit4ClassRunner.runChild(BlockJUnit4ClassRunner.java:103)
12-Oct-2021 13:25:19         at org.junit.runners.BlockJUnit4ClassRunner.runChild(BlockJUnit4ClassRunner.java:63)
12-Oct-2021 13:25:19         at org.junit.runners.ParentRunner$4.run(ParentRunner.java:331)
12-Oct-2021 13:25:19         at org.junit.runners.ParentRunner$1.schedule(ParentRunner.java:79)
12-Oct-2021 13:25:19         at org.junit.runners.ParentRunner.runChildren(ParentRunner.java:329)
12-Oct-2021 13:25:19         at org.junit.runners.ParentRunner.access$100(ParentRunner.java:66)
12-Oct-2021 13:25:19         at org.junit.runners.ParentRunner$2.evaluate(ParentRunner.java:293)
12-Oct-2021 13:25:19         at org.junit.runners.ParentRunner$3.evaluate(ParentRunner.java:306)
12-Oct-2021 13:25:19         at org.junit.runners.ParentRunner.run(ParentRunner.java:413)
12-Oct-2021 13:25:19         at org.apache.maven.surefire.junit4.JUnit4Provider.execute(JUnit4Provider.java:275)
12-Oct-2021 13:25:19         at org.apache.maven.surefire.junit4.JUnit4Provider.executeWithRerun(JUnit4Provider.java:183)
12-Oct-2021 13:25:19         at org.apache.maven.surefire.junit4.JUnit4Provider.executeTestSet(JUnit4Provider.java:153)
12-Oct-2021 13:25:19         at org.apache.maven.surefire.junit4.JUnit4Provider.invoke(JUnit4Provider.java:128)
12-Oct-2021 13:25:19         at org.apache.maven.surefire.booter.ForkedBooter.invokeProviderInSameClassLoader(ForkedBooter.java:203)
12-Oct-2021 13:25:19         at org.apache.maven.surefire.booter.ForkedBooter.runSuitesInProcess(ForkedBooter.java:155)
12-Oct-2021 13:25:19         at org.apache.maven.surefire.booter.ForkedBooter.main(ForkedBooter.java:103)
12-Oct-2021 13:25:19
12-Oct-2021 13:25:19 deleteAppointmentBlockTest(org.openmrs.reference.DeleteAppointmentBlockTest)  Time elapsed: 4.434 sec  <<< ERROR!
12-Oct-2021 13:25:19 org.openqa.selenium.ElementClickInterceptedException: element click intercepted: Element <div class="fc-day-content">...</div> is not clickable at point (392, 369). Other element would receive the click: <div class="fc-event-inner">...</div>
12-Oct-2021 13:25:19   (Session info: headless chrome=90.0.4430.72)
12-Oct-2021 13:25:19 Build info: version: '4.0.0-alpha-6', revision: '5f43a29cfc'
12-Oct-2021 13:25:19 System info: host: 'yue', ip: '127.0.0.1', os.name: 'Linux', os.arch: 'amd64', os.version: '4.4.0-210-generic', java.version: '1.8.0_292'
12-Oct-2021 13:25:19 Driver info: org.openqa.selenium.chrome.ChromeDriver
12-Oct-2021 13:25:19 Capabilities {acceptInsecureCerts: false, browserName: chrome, browserVersion: 90.0.4430.72, chrome: {chromedriverVersion: 90.0.4430.24 (4c6d850f087da..., userDataDir: /tmp/.com.google.Chrome.AtZEcK}, goog:chromeOptions: {debuggerAddress: localhost:34457}, javascriptEnabled: true, networkConnectionEnabled: false, pageLoadStrategy: normal, platform: LINUX, platformName: LINUX, proxy: Proxy(), setWindowRect: true, strictFileInteractability: false, timeouts: {implicit: 0, pageLoad: 300000, script: 30000}, unhandledPromptBehavior: dismiss and notify, webauthn:extension:largeBlob: true, webauthn:virtualAuthenticators: true}
12-Oct-2021 13:25:19 Session ID: 9b0c50fec05e6178a7e49ce8a45560d0
12-Oct-2021 13:25:19         at sun.reflect.NativeConstructorAccessorImpl.newInstance0(Native Method)
12-Oct-2021 13:25:19         at sun.reflect.NativeConstructorAccessorImpl.newInstance(NativeConstructorAccessorImpl.java:62)
12-Oct-2021 13:25:19         at sun.reflect.DelegatingConstructorAccessorImpl.newInstance(DelegatingConstructorAccessorImpl.java:45)
12-Oct-2021 13:25:19         at java.lang.reflect.Constructor.newInstance(Constructor.java:423)
12-Oct-2021 13:25:19         at org.openqa.selenium.remote.codec.w3c.W3CHttpResponseCodec.createException(W3CHttpResponseCodec.java:196)
12-Oct-2021 13:25:19         at org.openqa.selenium.remote.codec.w3c.W3CHttpResponseCodec.decode(W3CHttpResponseCodec.java:129)
12-Oct-2021 13:25:19         at org.openqa.selenium.remote.codec.w3c.W3CHttpResponseCodec.decode(W3CHttpResponseCodec.java:53)
12-Oct-2021 13:25:19         at org.openqa.selenium.remote.HttpCommandExecutor.execute(HttpCommandExecutor.java:160)
12-Oct-2021 13:25:19         at org.openqa.selenium.remote.service.DriverCommandExecutor.execute(DriverCommandExecutor.java:83)
12-Oct-2021 13:25:19         at org.openqa.selenium.remote.RemoteWebDriver.execute(RemoteWebDriver.java:582)
12-Oct-2021 13:25:19         at org.openqa.selenium.remote.RemoteWebElement.execute(RemoteWebElement.java:316)
12-Oct-2021 13:25:19         at org.openqa.selenium.remote.RemoteWebElement.click(RemoteWebElement.java:85)
12-Oct-2021 13:25:19         at org.openmrs.uitestframework.page.Page.clickOn(Page.java:210)
12-Oct-2021 13:25:19         at org.openmrs.reference.page.AppointmentBlocksPage.clickOnDay(AppointmentBlocksPage.java:124)
12-Oct-2021 13:25:19         at org.openmrs.reference.DeleteAppointmentBlockTest.deleteAppointmentBlockTest(DeleteAppointmentBlockTest.java:42)
12-Oct-2021 13:25:19
12-Oct-2021 13:25:19 deleteAppointmentBlockTest(org.openmrs.reference.DeleteAppointmentBlockTest)  Time elapsed: 4.437 sec  <<< ERROR!
12-Oct-2021 13:25:19 org.openqa.selenium.NoSuchSessionException: Session ID is null. Using WebDriver after calling quit()?
12-Oct-2021 13:25:19 Build info: version: '4.0.0-alpha-6', revision: '5f43a29cfc'
12-Oct-2021 13:25:19 System info: host: 'yue', ip: '127.0.0.1', os.name: 'Linux', os.arch: 'amd64', os.version: '4.4.0-210-generic', java.version: '1.8.0_292'
12-Oct-2021 13:25:19 Driver info: driver.version: RemoteWebDriver
12-Oct-2021 13:25:19         at org.openqa.selenium.remote.HttpCommandExecutor.execute(HttpCommandExecutor.java:127)
12-Oct-2021 13:25:19         at org.openqa.selenium.remote.service.DriverCommandExecutor.execute(DriverCommandExecutor.java:83)
12-Oct-2021 13:25:19         at org.openqa.selenium.remote.RemoteWebDriver.execute(RemoteWebDriver.java:582)
12-Oct-2021 13:25:19         at org.openqa.selenium.remote.RemoteWebDriver.execute(RemoteWebDriver.java:639)
12-Oct-2021 13:25:19         at org.openqa.selenium.remote.RemoteWebDriver.execute(RemoteWebDriver.java:643)
12-Oct-2021 13:25:19         at org.openqa.selenium.remote.RemoteWebDriver.getScreenshotAs(RemoteWebDriver.java:303)
12-Oct-2021 13:25:19         at org.openmrs.uitestframework.test.TestBase.takeScreenshot(TestBase.java:345)
12-Oct-2021 13:25:19         at org.openmrs.uitestframework.test.TestBase$1.failed(TestBase.java:84)
12-Oct-2021 13:25:19         at org.junit.rules.TestWatcher.failedQuietly(TestWatcher.java:90)
12-Oct-2021 13:25:19         at org.junit.rules.TestWatcher.access$300(TestWatcher.java:52)
12-Oct-2021 13:25:19         at org.junit.rules.TestWatcher$1.evaluate(TestWatcher.java:68)
12-Oct-2021 13:25:19         at org.junit.runners.ParentRunner$3.evaluate(ParentRunner.java:306)
12-Oct-2021 13:25:19         at org.junit.runners.BlockJUnit4ClassRunner$1.evaluate(BlockJUnit4ClassRunner.java:100)
12-Oct-2021 13:25:19         at org.junit.runners.ParentRunner.runLeaf(ParentRunner.java:366)
12-Oct-2021 13:25:19         at org.junit.runners.BlockJUnit4ClassRunner.runChild(BlockJUnit4ClassRunner.java:103)
12-Oct-2021 13:25:19         at org.junit.runners.BlockJUnit4ClassRunner.runChild(BlockJUnit4ClassRunner.java:63)
12-Oct-2021 13:25:19         at org.junit.runners.ParentRunner$4.run(ParentRunner.java:331)
12-Oct-2021 13:25:19         at org.junit.runners.ParentRunner$1.schedule(ParentRunner.java:79)
12-Oct-2021 13:25:19         at org.junit.runners.ParentRunner.runChildren(ParentRunner.java:329)
12-Oct-2021 13:25:19         at org.junit.runners.ParentRunner.access$100(ParentRunner.java:66)
12-Oct-2021 13:25:19         at org.junit.runners.ParentRunner$2.evaluate(ParentRunner.java:293)
12-Oct-2021 13:25:19         at org.junit.runners.ParentRunner$3.evaluate(ParentRunner.java:306)
12-Oct-2021 13:25:19         at org.junit.runners.ParentRunner.run(ParentRunner.java:413)
12-Oct-2021 13:25:19         at org.apache.maven.surefire.junit4.JUnit4Provider.execute(JUnit4Provider.java:275)
12-Oct-2021 13:25:19         at org.apache.maven.surefire.junit4.JUnit4Provider.executeWithRerun(JUnit4Provider.java:183)
12-Oct-2021 13:25:19         at org.apache.maven.surefire.junit4.JUnit4Provider.executeTestSet(JUnit4Provider.java:153)
12-Oct-2021 13:25:19         at org.apache.maven.surefire.junit4.JUnit4Provider.invoke(JUnit4Provider.java:128)
12-Oct-2021 13:25:19         at org.apache.maven.surefire.booter.ForkedBooter.invokeProviderInSameClassLoader(ForkedBooter.java:203)
12-Oct-2021 13:25:19         at org.apache.maven.surefire.booter.ForkedBooter.runSuitesInProcess(ForkedBooter.java:155)
12-Oct-2021 13:25:19         at org.apache.maven.surefire.booter.ForkedBooter.main(ForkedBooter.java:103)
12-Oct-2021 13:25:19
12-Oct-2021 13:25:19 Running org.openmrs.reference.DeletePersonTest
12-Oct-2021 13:25:19 Running locally...
12-Oct-2021 13:25:19 Starting ChromeDriver 90.0.4430.24 (4c6d850f087da467d926e8eddb76550aed655991-refs/branch-heads/4430@{#429}) on port 12969
12-Oct-2021 13:25:19 Only local connections are allowed.
12-Oct-2021 13:25:19 Please see https://chromedriver.chromium.org/security-considerations for suggestions on keeping ChromeDriver safe.
12-Oct-2021 13:25:19 ChromeDriver was started successfully.
12-Oct-2021 13:25:20 Oct 12, 2021 1:25:20 PM org.openqa.selenium.remote.ProtocolHandshake createSession
12-Oct-2021 13:25:20 INFO: Detected dialect: W3C
12-Oct-2021 13:25:24 Tests run: 1, Failures: 0, Errors: 0, Skipped: 0, Time elapsed: 4.844 sec - in org.openmrs.reference.DeletePersonTest
12-Oct-2021 13:25:24 Running org.openmrs.reference.DeleteProviderTest
12-Oct-2021 13:25:24 Running locally...
12-Oct-2021 13:25:24 Starting ChromeDriver 90.0.4430.24 (4c6d850f087da467d926e8eddb76550aed655991-refs/branch-heads/4430@{#429}) on port 23244
12-Oct-2021 13:25:24 Only local connections are allowed.
12-Oct-2021 13:25:24 Please see https://chromedriver.chromium.org/security-considerations for suggestions on keeping ChromeDriver safe.
12-Oct-2021 13:25:24 ChromeDriver was started successfully.
12-Oct-2021 13:25:24 Oct 12, 2021 1:25:24 PM org.openqa.selenium.remote.ProtocolHandshake createSession
12-Oct-2021 13:25:24 INFO: Detected dialect: W3C
12-Oct-2021 13:25:30 Tests run: 1, Failures: 0, Errors: 0, Skipped: 0, Time elapsed: 5.73 sec - in org.openmrs.reference.DeleteProviderTest
12-Oct-2021 13:25:30 Running org.openmrs.reference.DeleteRequestAppointmentTest
12-Oct-2021 13:25:30 Running locally...
12-Oct-2021 13:25:30 Starting ChromeDriver 90.0.4430.24 (4c6d850f087da467d926e8eddb76550aed655991-refs/branch-heads/4430@{#429}) on port 24507
12-Oct-2021 13:25:30 Only local connections are allowed.
12-Oct-2021 13:25:30 Please see https://chromedriver.chromium.org/security-considerations for suggestions on keeping ChromeDriver safe.
12-Oct-2021 13:25:30 ChromeDriver was started successfully.
12-Oct-2021 13:25:30 Oct 12, 2021 1:25:30 PM org.openqa.selenium.remote.ProtocolHandshake createSession
12-Oct-2021 13:25:30 INFO: Detected dialect: W3C
12-Oct-2021 13:25:47 Tests run: 1, Failures: 0, Errors: 0, Skipped: 0, Time elapsed: 17.565 sec - in org.openmrs.reference.DeleteRequestAppointmentTest
12-Oct-2021 13:25:47 Running org.openmrs.reference.DeleteVisitTypeTest
12-Oct-2021 13:25:47 Running locally...
12-Oct-2021 13:25:47 Starting ChromeDriver 90.0.4430.24 (4c6d850f087da467d926e8eddb76550aed655991-refs/branch-heads/4430@{#429}) on port 25008
12-Oct-2021 13:25:47 Only local connections are allowed.
12-Oct-2021 13:25:47 Please see https://chromedriver.chromium.org/security-considerations for suggestions on keeping ChromeDriver safe.
12-Oct-2021 13:25:47 ChromeDriver was started successfully.
12-Oct-2021 13:25:48 Oct 12, 2021 1:25:48 PM org.openqa.selenium.remote.ProtocolHandshake createSession
12-Oct-2021 13:25:48 INFO: Detected dialect: W3C
12-Oct-2021 13:25:51 Tests run: 1, Failures: 0, Errors: 0, Skipped: 0, Time elapsed: 3.506 sec - in org.openmrs.reference.DeleteVisitTypeTest
12-Oct-2021 13:25:51 Running org.openmrs.reference.DuplicatePatientRegisterTest
12-Oct-2021 13:25:51 Running locally...
12-Oct-2021 13:25:51 Starting ChromeDriver 90.0.4430.24 (4c6d850f087da467d926e8eddb76550aed655991-refs/branch-heads/4430@{#429}) on port 22191
12-Oct-2021 13:25:51 Only local connections are allowed.
12-Oct-2021 13:25:51 Please see https://chromedriver.chromium.org/security-considerations for suggestions on keeping ChromeDriver safe.
12-Oct-2021 13:25:51 ChromeDriver was started successfully.
12-Oct-2021 13:25:51 Oct 12, 2021 1:25:51 PM org.openqa.selenium.remote.ProtocolHandshake createSession
12-Oct-2021 13:25:51 INFO: Detected dialect: W3C
12-Oct-2021 13:26:03 Tests run: 1, Failures: 0, Errors: 0, Skipped: 0, Time elapsed: 11.79 sec - in org.openmrs.reference.DuplicatePatientRegisterTest
12-Oct-2021 13:26:03 Running org.openmrs.reference.EditAllergyTest
12-Oct-2021 13:26:03 Running locally...
12-Oct-2021 13:26:03 Starting ChromeDriver 90.0.4430.24 (4c6d850f087da467d926e8eddb76550aed655991-refs/branch-heads/4430@{#429}) on port 15738
12-Oct-2021 13:26:03 Only local connections are allowed.
12-Oct-2021 13:26:03 Please see https://chromedriver.chromium.org/security-considerations for suggestions on keeping ChromeDriver safe.
12-Oct-2021 13:26:03 ChromeDriver was started successfully.
12-Oct-2021 13:26:03 Oct 12, 2021 1:26:03 PM org.openqa.selenium.remote.ProtocolHandshake createSession
12-Oct-2021 13:26:03 INFO: Detected dialect: W3C
12-Oct-2021 13:26:13 Tests run: 1, Failures: 0, Errors: 0, Skipped: 0, Time elapsed: 10.441 sec - in org.openmrs.reference.EditAllergyTest
12-Oct-2021 13:26:13 Running org.openmrs.reference.EditDemographicTest
12-Oct-2021 13:26:13 Running locally...
12-Oct-2021 13:26:13 Starting ChromeDriver 90.0.4430.24 (4c6d850f087da467d926e8eddb76550aed655991-refs/branch-heads/4430@{#429}) on port 15287
12-Oct-2021 13:26:13 Only local connections are allowed.
12-Oct-2021 13:26:13 Please see https://chromedriver.chromium.org/security-considerations for suggestions on keeping ChromeDriver safe.
12-Oct-2021 13:26:13 ChromeDriver was started successfully.
12-Oct-2021 13:26:13 Oct 12, 2021 1:26:13 PM org.openqa.selenium.remote.ProtocolHandshake createSession
12-Oct-2021 13:26:13 INFO: Detected dialect: W3C
12-Oct-2021 13:26:23 Tests run: 1, Failures: 0, Errors: 0, Skipped: 0, Time elapsed: 9.682 sec - in org.openmrs.reference.EditDemographicTest
12-Oct-2021 13:26:23 Running org.openmrs.reference.EditPersonTest
12-Oct-2021 13:26:23 Running locally...
12-Oct-2021 13:26:23 Starting ChromeDriver 90.0.4430.24 (4c6d850f087da467d926e8eddb76550aed655991-refs/branch-heads/4430@{#429}) on port 21048
12-Oct-2021 13:26:23 Only local connections are allowed.
12-Oct-2021 13:26:23 Please see https://chromedriver.chromium.org/security-considerations for suggestions on keeping ChromeDriver safe.
12-Oct-2021 13:26:23 ChromeDriver was started successfully.
12-Oct-2021 13:26:23 Oct 12, 2021 1:26:23 PM org.openqa.selenium.remote.ProtocolHandshake createSession
12-Oct-2021 13:26:23 INFO: Detected dialect: W3C
12-Oct-2021 13:26:28 Tests run: 1, Failures: 0, Errors: 0, Skipped: 0, Time elapsed: 5.164 sec - in org.openmrs.reference.EditPersonTest
12-Oct-2021 13:26:28 Running org.openmrs.reference.EditProviderTest
12-Oct-2021 13:26:28 Running locally...
12-Oct-2021 13:26:28 Starting ChromeDriver 90.0.4430.24 (4c6d850f087da467d926e8eddb76550aed655991-refs/branch-heads/4430@{#429}) on port 27419
12-Oct-2021 13:26:28 Only local connections are allowed.
12-Oct-2021 13:26:28 Please see https://chromedriver.chromium.org/security-considerations for suggestions on keeping ChromeDriver safe.
12-Oct-2021 13:26:28 ChromeDriver was started successfully.
12-Oct-2021 13:26:28 Oct 12, 2021 1:26:28 PM org.openqa.selenium.remote.ProtocolHandshake createSession
12-Oct-2021 13:26:28 INFO: Detected dialect: W3C
12-Oct-2021 13:26:34 Tests run: 1, Failures: 0, Errors: 0, Skipped: 0, Time elapsed: 5.496 sec - in org.openmrs.reference.EditProviderTest
12-Oct-2021 13:26:34 Running org.openmrs.reference.EditServiceTest
12-Oct-2021 13:26:34 Running locally...
12-Oct-2021 13:26:34 Starting ChromeDriver 90.0.4430.24 (4c6d850f087da467d926e8eddb76550aed655991-refs/branch-heads/4430@{#429}) on port 21756
12-Oct-2021 13:26:34 Only local connections are allowed.
12-Oct-2021 13:26:34 Please see https://chromedriver.chromium.org/security-considerations for suggestions on keeping ChromeDriver safe.
12-Oct-2021 13:26:34 ChromeDriver was started successfully.
12-Oct-2021 13:26:34 Oct 12, 2021 1:26:34 PM org.openqa.selenium.remote.ProtocolHandshake createSession
12-Oct-2021 13:26:34 INFO: Detected dialect: W3C
12-Oct-2021 13:26:39 Tests run: 1, Failures: 0, Errors: 0, Skipped: 0, Time elapsed: 5.932 sec - in org.openmrs.reference.EditServiceTest
12-Oct-2021 13:26:39 Running org.openmrs.reference.EditVisitTypeTest
12-Oct-2021 13:26:39 Running locally...
12-Oct-2021 13:26:39 Starting ChromeDriver 90.0.4430.24 (4c6d850f087da467d926e8eddb76550aed655991-refs/branch-heads/4430@{#429}) on port 5900
12-Oct-2021 13:26:39 Only local connections are allowed.
12-Oct-2021 13:26:39 Please see https://chromedriver.chromium.org/security-considerations for suggestions on keeping ChromeDriver safe.
12-Oct-2021 13:26:39 ChromeDriver was started successfully.
12-Oct-2021 13:26:40 Oct 12, 2021 1:26:40 PM org.openqa.selenium.remote.ProtocolHandshake createSession
12-Oct-2021 13:26:40 INFO: Detected dialect: W3C
12-Oct-2021 13:26:44 Tests run: 1, Failures: 0, Errors: 0, Skipped: 0, Time elapsed: 4.128 sec - in org.openmrs.reference.EditVisitTypeTest
12-Oct-2021 13:26:44 Running org.openmrs.reference.EndVisitTest
12-Oct-2021 13:26:44 Running locally...
12-Oct-2021 13:26:44 Starting ChromeDriver 90.0.4430.24 (4c6d850f087da467d926e8eddb76550aed655991-refs/branch-heads/4430@{#429}) on port 27547
12-Oct-2021 13:26:44 Only local connections are allowed.
12-Oct-2021 13:26:44 Please see https://chromedriver.chromium.org/security-considerations for suggestions on keeping ChromeDriver safe.
12-Oct-2021 13:26:44 ChromeDriver was started successfully.
12-Oct-2021 13:26:44 Oct 12, 2021 1:26:44 PM org.openqa.selenium.remote.ProtocolHandshake createSession
12-Oct-2021 13:26:44 INFO: Detected dialect: W3C
12-Oct-2021 13:26:56 Tests run: 1, Failures: 0, Errors: 0, Skipped: 0, Time elapsed: 12.321 sec - in org.openmrs.reference.EndVisitTest
12-Oct-2021 13:26:56 Running org.openmrs.reference.FindPatientByNameTest
12-Oct-2021 13:26:56 Running locally...
12-Oct-2021 13:26:56 Starting ChromeDriver 90.0.4430.24 (4c6d850f087da467d926e8eddb76550aed655991-refs/branch-heads/4430@{#429}) on port 20275
12-Oct-2021 13:26:56 Only local connections are allowed.
12-Oct-2021 13:26:56 Please see https://chromedriver.chromium.org/security-considerations for suggestions on keeping ChromeDriver safe.
12-Oct-2021 13:26:56 ChromeDriver was started successfully.
12-Oct-2021 13:26:56 Oct 12, 2021 1:26:56 PM org.openqa.selenium.remote.ProtocolHandshake createSession
12-Oct-2021 13:26:56 INFO: Detected dialect: W3C
12-Oct-2021 13:27:03 Tests run: 1, Failures: 0, Errors: 0, Skipped: 0, Time elapsed: 7.323 sec - in org.openmrs.reference.FindPatientByNameTest
12-Oct-2021 13:27:03 Running org.openmrs.reference.FindPatientRecordTest
12-Oct-2021 13:27:03 Running locally...
12-Oct-2021 13:27:03 Starting ChromeDriver 90.0.4430.24 (4c6d850f087da467d926e8eddb76550aed655991-refs/branch-heads/4430@{#429}) on port 10286
12-Oct-2021 13:27:03 Only local connections are allowed.
12-Oct-2021 13:27:03 Please see https://chromedriver.chromium.org/security-considerations for suggestions on keeping ChromeDriver safe.
12-Oct-2021 13:27:03 ChromeDriver was started successfully.
12-Oct-2021 13:27:04 Oct 12, 2021 1:27:04 PM org.openqa.selenium.remote.ProtocolHandshake createSession
12-Oct-2021 13:27:04 INFO: Detected dialect: W3C
12-Oct-2021 13:27:08 Tests run: 1, Failures: 0, Errors: 0, Skipped: 0, Time elapsed: 4.863 sec - in org.openmrs.reference.FindPatientRecordTest
12-Oct-2021 13:27:08 Running org.openmrs.reference.FormTest
12-Oct-2021 13:27:08 Running locally...
12-Oct-2021 13:27:08 Starting ChromeDriver 90.0.4430.24 (4c6d850f087da467d926e8eddb76550aed655991-refs/branch-heads/4430@{#429}) on port 3119
12-Oct-2021 13:27:08 Only local connections are allowed.
12-Oct-2021 13:27:08 Please see https://chromedriver.chromium.org/security-considerations for suggestions on keeping ChromeDriver safe.
12-Oct-2021 13:27:08 ChromeDriver was started successfully.
12-Oct-2021 13:27:08 Oct 12, 2021 1:27:08 PM org.openqa.selenium.remote.ProtocolHandshake createSession
12-Oct-2021 13:27:08 INFO: Detected dialect: W3C
12-Oct-2021 13:27:15 Running locally...
12-Oct-2021 13:27:15 Starting ChromeDriver 90.0.4430.24 (4c6d850f087da467d926e8eddb76550aed655991-refs/branch-heads/4430@{#429}) on port 18798
12-Oct-2021 13:27:15 Only local connections are allowed.
12-Oct-2021 13:27:15 Please see https://chromedriver.chromium.org/security-considerations for suggestions on keeping ChromeDriver safe.
12-Oct-2021 13:27:15 ChromeDriver was started successfully.
12-Oct-2021 13:27:15 Oct 12, 2021 1:27:15 PM org.openqa.selenium.remote.ProtocolHandshake createSession
12-Oct-2021 13:27:15 INFO: Detected dialect: W3C
12-Oct-2021 13:27:23 Running locally...
12-Oct-2021 13:27:23 Starting ChromeDriver 90.0.4430.24 (4c6d850f087da467d926e8eddb76550aed655991-refs/branch-heads/4430@{#429}) on port 27281
12-Oct-2021 13:27:23 Only local connections are allowed.
12-Oct-2021 13:27:23 Please see https://chromedriver.chromium.org/security-considerations for suggestions on keeping ChromeDriver safe.
12-Oct-2021 13:27:23 ChromeDriver was started successfully.
12-Oct-2021 13:27:23 Oct 12, 2021 1:27:23 PM org.openqa.selenium.remote.ProtocolHandshake createSession
12-Oct-2021 13:27:23 INFO: Detected dialect: W3C
12-Oct-2021 13:27:27 Running locally...
12-Oct-2021 13:27:27 Starting ChromeDriver 90.0.4430.24 (4c6d850f087da467d926e8eddb76550aed655991-refs/branch-heads/4430@{#429}) on port 24791
12-Oct-2021 13:27:27 Only local connections are allowed.
12-Oct-2021 13:27:27 Please see https://chromedriver.chromium.org/security-considerations for suggestions on keeping ChromeDriver safe.
12-Oct-2021 13:27:27 ChromeDriver was started successfully.
12-Oct-2021 13:27:27 Oct 12, 2021 1:27:27 PM org.openqa.selenium.remote.ProtocolHandshake createSession
12-Oct-2021 13:27:27 INFO: Detected dialect: W3C
12-Oct-2021 13:27:32 Tests run: 4, Failures: 0, Errors: 0, Skipped: 0, Time elapsed: 24.38 sec - in org.openmrs.reference.FormTest
12-Oct-2021 13:27:32 Running org.openmrs.reference.LoginTest
12-Oct-2021 13:27:32 Running locally...
12-Oct-2021 13:27:32 Starting ChromeDriver 90.0.4430.24 (4c6d850f087da467d926e8eddb76550aed655991-refs/branch-heads/4430@{#429}) on port 30680
12-Oct-2021 13:27:32 Only local connections are allowed.
12-Oct-2021 13:27:32 Please see https://chromedriver.chromium.org/security-considerations for suggestions on keeping ChromeDriver safe.
12-Oct-2021 13:27:32 ChromeDriver was started successfully.
12-Oct-2021 13:27:33 Oct 12, 2021 1:27:33 PM org.openqa.selenium.remote.ProtocolHandshake createSession
12-Oct-2021 13:27:33 INFO: Detected dialect: W3C
12-Oct-2021 13:27:35 Running locally...
12-Oct-2021 13:27:35 Starting ChromeDriver 90.0.4430.24 (4c6d850f087da467d926e8eddb76550aed655991-refs/branch-heads/4430@{#429}) on port 4106
12-Oct-2021 13:27:35 Only local connections are allowed.
12-Oct-2021 13:27:35 Please see https://chromedriver.chromium.org/security-considerations for suggestions on keeping ChromeDriver safe.
12-Oct-2021 13:27:35 ChromeDriver was started successfully.
12-Oct-2021 13:27:35 Oct 12, 2021 1:27:35 PM org.openqa.selenium.remote.ProtocolHandshake createSession
12-Oct-2021 13:27:35 INFO: Detected dialect: W3C
12-Oct-2021 13:27:37 Running locally...
12-Oct-2021 13:27:37 Starting ChromeDriver 90.0.4430.24 (4c6d850f087da467d926e8eddb76550aed655991-refs/branch-heads/4430@{#429}) on port 6831
12-Oct-2021 13:27:37 Only local connections are allowed.
12-Oct-2021 13:27:37 Please see https://chromedriver.chromium.org/security-considerations for suggestions on keeping ChromeDriver safe.
12-Oct-2021 13:27:37 ChromeDriver was started successfully.
12-Oct-2021 13:27:37 Oct 12, 2021 1:27:37 PM org.openqa.selenium.remote.ProtocolHandshake createSession
12-Oct-2021 13:27:37 INFO: Detected dialect: W3C
12-Oct-2021 13:27:40 Running locally...
12-Oct-2021 13:27:40 Starting ChromeDriver 90.0.4430.24 (4c6d850f087da467d926e8eddb76550aed655991-refs/branch-heads/4430@{#429}) on port 31070
12-Oct-2021 13:27:40 Only local connections are allowed.
12-Oct-2021 13:27:40 Please see https://chromedriver.chromium.org/security-considerations for suggestions on keeping ChromeDriver safe.
12-Oct-2021 13:27:40 ChromeDriver was started successfully.
12-Oct-2021 13:27:40 Oct 12, 2021 1:27:40 PM org.openqa.selenium.remote.ProtocolHandshake createSession
12-Oct-2021 13:27:40 INFO: Detected dialect: W3C
12-Oct-2021 13:27:42 Running locally...
12-Oct-2021 13:27:42 Starting ChromeDriver 90.0.4430.24 (4c6d850f087da467d926e8eddb76550aed655991-refs/branch-heads/4430@{#429}) on port 32059
12-Oct-2021 13:27:42 Only local connections are allowed.
12-Oct-2021 13:27:42 Please see https://chromedriver.chromium.org/security-considerations for suggestions on keeping ChromeDriver safe.
12-Oct-2021 13:27:42 ChromeDriver was started successfully.
12-Oct-2021 13:27:43 Oct 12, 2021 1:27:43 PM org.openqa.selenium.remote.ProtocolHandshake createSession
12-Oct-2021 13:27:43 INFO: Detected dialect: W3C
12-Oct-2021 13:27:45 Tests run: 5, Failures: 0, Errors: 0, Skipped: 0, Time elapsed: 12.65 sec - in org.openmrs.reference.LoginTest
12-Oct-2021 13:27:45 Running org.openmrs.reference.MergePatientTest
12-Oct-2021 13:27:45 Running locally...
12-Oct-2021 13:27:45 Starting ChromeDriver 90.0.4430.24 (4c6d850f087da467d926e8eddb76550aed655991-refs/branch-heads/4430@{#429}) on port 12607
12-Oct-2021 13:27:45 Only local connections are allowed.
12-Oct-2021 13:27:45 Please see https://chromedriver.chromium.org/security-considerations for suggestions on keeping ChromeDriver safe.
12-Oct-2021 13:27:45 ChromeDriver was started successfully.
12-Oct-2021 13:27:45 Oct 12, 2021 1:27:45 PM org.openqa.selenium.remote.ProtocolHandshake createSession
12-Oct-2021 13:27:45 INFO: Detected dialect: W3C
12-Oct-2021 13:27:53 Tests run: 1, Failures: 0, Errors: 0, Skipped: 0, Time elapsed: 7.912 sec - in org.openmrs.reference.MergePatientTest
12-Oct-2021 13:27:53 Running org.openmrs.reference.MergeVisitsTest
12-Oct-2021 13:27:53 Running locally...
12-Oct-2021 13:27:53 Starting ChromeDriver 90.0.4430.24 (4c6d850f087da467d926e8eddb76550aed655991-refs/branch-heads/4430@{#429}) on port 3769
12-Oct-2021 13:27:53 Only local connections are allowed.
12-Oct-2021 13:27:53 Please see https://chromedriver.chromium.org/security-considerations for suggestions on keeping ChromeDriver safe.
12-Oct-2021 13:27:53 ChromeDriver was started successfully.
12-Oct-2021 13:27:53 Oct 12, 2021 1:27:53 PM org.openqa.selenium.remote.ProtocolHandshake createSession
12-Oct-2021 13:27:53 INFO: Detected dialect: W3C
12-Oct-2021 13:28:05 Tests run: 1, Failures: 0, Errors: 0, Skipped: 0, Time elapsed: 12.261 sec - in org.openmrs.reference.MergeVisitsTest
12-Oct-2021 13:28:05 Running org.openmrs.reference.NamePatientAccentedLetterTest
12-Oct-2021 13:28:05 Running locally...
12-Oct-2021 13:28:05 Starting ChromeDriver 90.0.4430.24 (4c6d850f087da467d926e8eddb76550aed655991-refs/branch-heads/4430@{#429}) on port 16929
12-Oct-2021 13:28:05 Only local connections are allowed.
12-Oct-2021 13:28:05 Please see https://chromedriver.chromium.org/security-considerations for suggestions on keeping ChromeDriver safe.
12-Oct-2021 13:28:05 ChromeDriver was started successfully.
12-Oct-2021 13:28:06 Oct 12, 2021 1:28:06 PM org.openqa.selenium.remote.ProtocolHandshake createSession
12-Oct-2021 13:28:06 INFO: Detected dialect: W3C
12-Oct-2021 13:28:13 Tests run: 1, Failures: 0, Errors: 0, Skipped: 0, Time elapsed: 7.868 sec - in org.openmrs.reference.NamePatientAccentedLetterTest
12-Oct-2021 13:28:13 Running org.openmrs.reference.RecordMergeIssueTest
12-Oct-2021 13:28:13 Running locally...
12-Oct-2021 13:28:13 Starting ChromeDriver 90.0.4430.24 (4c6d850f087da467d926e8eddb76550aed655991-refs/branch-heads/4430@{#429}) on port 24703
12-Oct-2021 13:28:13 Only local connections are allowed.
12-Oct-2021 13:28:13 Please see https://chromedriver.chromium.org/security-considerations for suggestions on keeping ChromeDriver safe.
12-Oct-2021 13:28:13 ChromeDriver was started successfully.
12-Oct-2021 13:28:13 Oct 12, 2021 1:28:13 PM org.openqa.selenium.remote.ProtocolHandshake createSession
12-Oct-2021 13:28:13 INFO: Detected dialect: W3C
12-Oct-2021 13:28:26 Tests run: 1, Failures: 0, Errors: 0, Skipped: 0, Time elapsed: 13.094 sec - in org.openmrs.reference.RecordMergeIssueTest
12-Oct-2021 13:28:26 Running org.openmrs.reference.RegisterPatientTest
12-Oct-2021 13:28:26 Running locally...
12-Oct-2021 13:28:26 Starting ChromeDriver 90.0.4430.24 (4c6d850f087da467d926e8eddb76550aed655991-refs/branch-heads/4430@{#429}) on port 12082
12-Oct-2021 13:28:26 Only local connections are allowed.
12-Oct-2021 13:28:26 Please see https://chromedriver.chromium.org/security-considerations for suggestions on keeping ChromeDriver safe.
12-Oct-2021 13:28:26 ChromeDriver was started successfully.
12-Oct-2021 13:28:27 Oct 12, 2021 1:28:27 PM org.openqa.selenium.remote.ProtocolHandshake createSession
12-Oct-2021 13:28:27 INFO: Detected dialect: W3C
12-Oct-2021 13:28:34 Tests run: 1, Failures: 0, Errors: 0, Skipped: 0, Time elapsed: 7.827 sec - in org.openmrs.reference.RegisterPatientTest
12-Oct-2021 13:28:34 Running org.openmrs.reference.RegisterUnidentifiedPatientTest
12-Oct-2021 13:28:34 Running locally...
12-Oct-2021 13:28:34 Starting ChromeDriver 90.0.4430.24 (4c6d850f087da467d926e8eddb76550aed655991-refs/branch-heads/4430@{#429}) on port 9023
12-Oct-2021 13:28:34 Only local connections are allowed.
12-Oct-2021 13:28:34 Please see https://chromedriver.chromium.org/security-considerations for suggestions on keeping ChromeDriver safe.
12-Oct-2021 13:28:34 ChromeDriver was started successfully.
12-Oct-2021 13:28:34 Oct 12, 2021 1:28:34 PM org.openqa.selenium.remote.ProtocolHandshake createSession
12-Oct-2021 13:28:34 INFO: Detected dialect: W3C
12-Oct-2021 13:28:40 Tests run: 1, Failures: 0, Errors: 0, Skipped: 0, Time elapsed: 6.151 sec - in org.openmrs.reference.RegisterUnidentifiedPatientTest
12-Oct-2021 13:28:40 Running org.openmrs.reference.RetireLocationTest
12-Oct-2021 13:28:40 Running locally...
12-Oct-2021 13:28:40 Starting ChromeDriver 90.0.4430.24 (4c6d850f087da467d926e8eddb76550aed655991-refs/branch-heads/4430@{#429}) on port 12754
12-Oct-2021 13:28:40 Only local connections are allowed.
12-Oct-2021 13:28:40 Please see https://chromedriver.chromium.org/security-considerations for suggestions on keeping ChromeDriver safe.
12-Oct-2021 13:28:40 ChromeDriver was started successfully.
12-Oct-2021 13:28:41 Oct 12, 2021 1:28:41 PM org.openqa.selenium.remote.ProtocolHandshake createSession
12-Oct-2021 13:28:41 INFO: Detected dialect: W3C
12-Oct-2021 13:28:44 Tests run: 1, Failures: 0, Errors: 0, Skipped: 0, Time elapsed: 3.857 sec - in org.openmrs.reference.RetireLocationTest
12-Oct-2021 13:28:44 Running org.openmrs.reference.RetirePersonTest
12-Oct-2021 13:28:44 Running locally...
12-Oct-2021 13:28:44 Starting ChromeDriver 90.0.4430.24 (4c6d850f087da467d926e8eddb76550aed655991-refs/branch-heads/4430@{#429}) on port 9876
12-Oct-2021 13:28:44 Only local connections are allowed.
12-Oct-2021 13:28:44 Please see https://chromedriver.chromium.org/security-considerations for suggestions on keeping ChromeDriver safe.
12-Oct-2021 13:28:44 ChromeDriver was started successfully.
12-Oct-2021 13:28:44 Oct 12, 2021 1:28:44 PM org.openqa.selenium.remote.ProtocolHandshake createSession
12-Oct-2021 13:28:44 INFO: Detected dialect: W3C
12-Oct-2021 13:28:49 Tests run: 1, Failures: 0, Errors: 0, Skipped: 0, Time elapsed: 5.133 sec - in org.openmrs.reference.RetirePersonTest
12-Oct-2021 13:28:49 Running org.openmrs.reference.RetireProviderTest
12-Oct-2021 13:28:49 Running locally...
12-Oct-2021 13:28:49 Starting ChromeDriver 90.0.4430.24 (4c6d850f087da467d926e8eddb76550aed655991-refs/branch-heads/4430@{#429}) on port 15184
12-Oct-2021 13:28:49 Only local connections are allowed.
12-Oct-2021 13:28:49 Please see https://chromedriver.chromium.org/security-considerations for suggestions on keeping ChromeDriver safe.
12-Oct-2021 13:28:49 ChromeDriver was started successfully.
12-Oct-2021 13:28:50 Oct 12, 2021 1:28:50 PM org.openqa.selenium.remote.ProtocolHandshake createSession
12-Oct-2021 13:28:50 INFO: Detected dialect: W3C
12-Oct-2021 13:28:54 Tests run: 1, Failures: 0, Errors: 0, Skipped: 0, Time elapsed: 5.209 sec - in org.openmrs.reference.RetireProviderTest
12-Oct-2021 13:28:54 Running org.openmrs.reference.RetireVisitTypeTest
12-Oct-2021 13:28:54 Running locally...
12-Oct-2021 13:28:55 Starting ChromeDriver 90.0.4430.24 (4c6d850f087da467d926e8eddb76550aed655991-refs/branch-heads/4430@{#429}) on port 18110
12-Oct-2021 13:28:55 Only local connections are allowed.
12-Oct-2021 13:28:55 Please see https://chromedriver.chromium.org/security-considerations for suggestions on keeping ChromeDriver safe.
12-Oct-2021 13:28:55 ChromeDriver was started successfully.
12-Oct-2021 13:28:55 Oct 12, 2021 1:28:55 PM org.openqa.selenium.remote.ProtocolHandshake createSession
12-Oct-2021 13:28:55 INFO: Detected dialect: W3C
12-Oct-2021 13:28:59 Tests run: 1, Failures: 0, Errors: 0, Skipped: 0, Time elapsed: 4.044 sec - in org.openmrs.reference.RetireVisitTypeTest
12-Oct-2021 13:28:59 Running org.openmrs.reference.SearchActiveVisitsTest
12-Oct-2021 13:28:59 Running locally...
12-Oct-2021 13:28:59 Starting ChromeDriver 90.0.4430.24 (4c6d850f087da467d926e8eddb76550aed655991-refs/branch-heads/4430@{#429}) on port 13461
12-Oct-2021 13:28:59 Only local connections are allowed.
12-Oct-2021 13:28:59 Please see https://chromedriver.chromium.org/security-considerations for suggestions on keeping ChromeDriver safe.
12-Oct-2021 13:28:59 ChromeDriver was started successfully.
12-Oct-2021 13:28:59 Oct 12, 2021 1:28:59 PM org.openqa.selenium.remote.ProtocolHandshake createSession
12-Oct-2021 13:28:59 INFO: Detected dialect: W3C
12-Oct-2021 13:29:03 Tests run: 1, Failures: 0, Errors: 0, Skipped: 0, Time elapsed: 4.798 sec - in org.openmrs.reference.SearchActiveVisitsTest
12-Oct-2021 13:29:03 Running org.openmrs.reference.StartVisitTest
12-Oct-2021 13:29:03 Running locally...
12-Oct-2021 13:29:03 Starting ChromeDriver 90.0.4430.24 (4c6d850f087da467d926e8eddb76550aed655991-refs/branch-heads/4430@{#429}) on port 3697
12-Oct-2021 13:29:03 Only local connections are allowed.
12-Oct-2021 13:29:03 Please see https://chromedriver.chromium.org/security-considerations for suggestions on keeping ChromeDriver safe.
12-Oct-2021 13:29:03 ChromeDriver was started successfully.
12-Oct-2021 13:29:04 Oct 12, 2021 1:29:04 PM org.openqa.selenium.remote.ProtocolHandshake createSession
12-Oct-2021 13:29:04 INFO: Detected dialect: W3C
12-Oct-2021 13:29:13 Tests run: 1, Failures: 0, Errors: 0, Skipped: 0, Time elapsed: 9.228 sec - in org.openmrs.reference.StartVisitTest
12-Oct-2021 13:29:13 Running org.openmrs.reference.TransferToWardServiceTest
12-Oct-2021 13:29:13 Running locally...
12-Oct-2021 13:29:13 Starting ChromeDriver 90.0.4430.24 (4c6d850f087da467d926e8eddb76550aed655991-refs/branch-heads/4430@{#429}) on port 20369
12-Oct-2021 13:29:13 Only local connections are allowed.
12-Oct-2021 13:29:13 Please see https://chromedriver.chromium.org/security-considerations for suggestions on keeping ChromeDriver safe.
12-Oct-2021 13:29:13 ChromeDriver was started successfully.
12-Oct-2021 13:29:13 Oct 12, 2021 1:29:13 PM org.openqa.selenium.remote.ProtocolHandshake createSession
12-Oct-2021 13:29:13 INFO: Detected dialect: W3C
12-Oct-2021 13:29:27 Tests run: 1, Failures: 0, Errors: 0, Skipped: 0, Time elapsed: 14.362 sec - in org.openmrs.reference.TransferToWardServiceTest
12-Oct-2021 13:29:27 Running org.openmrs.reference.UnidentifiedPatientKeyboardTest
12-Oct-2021 13:29:27 Running locally...
12-Oct-2021 13:29:27 Starting ChromeDriver 90.0.4430.24 (4c6d850f087da467d926e8eddb76550aed655991-refs/branch-heads/4430@{#429}) on port 28856
12-Oct-2021 13:29:27 Only local connections are allowed.
12-Oct-2021 13:29:27 Please see https://chromedriver.chromium.org/security-considerations for suggestions on keeping ChromeDriver safe.
12-Oct-2021 13:29:27 ChromeDriver was started successfully.
12-Oct-2021 13:29:27 Oct 12, 2021 1:29:27 PM org.openqa.selenium.remote.ProtocolHandshake createSession
12-Oct-2021 13:29:27 INFO: Detected dialect: W3C
12-Oct-2021 13:29:33 Tests run: 1, Failures: 0, Errors: 0, Skipped: 0, Time elapsed: 5.815 sec - in org.openmrs.reference.UnidentifiedPatientKeyboardTest
12-Oct-2021 13:29:33 Running org.openmrs.reference.UsingBackButtonInMergePatientTest
12-Oct-2021 13:29:33 Running locally...
12-Oct-2021 13:29:33 Starting ChromeDriver 90.0.4430.24 (4c6d850f087da467d926e8eddb76550aed655991-refs/branch-heads/4430@{#429}) on port 9514
12-Oct-2021 13:29:33 Only local connections are allowed.
12-Oct-2021 13:29:33 Please see https://chromedriver.chromium.org/security-considerations for suggestions on keeping ChromeDriver safe.
12-Oct-2021 13:29:33 ChromeDriver was started successfully.
12-Oct-2021 13:29:33 Oct 12, 2021 1:29:33 PM org.openqa.selenium.remote.ProtocolHandshake createSession
12-Oct-2021 13:29:33 INFO: Detected dialect: W3C
12-Oct-2021 13:29:45 Tests run: 1, Failures: 0, Errors: 0, Skipped: 0, Time elapsed: 12.609 sec - in org.openmrs.reference.UsingBackButtonInMergePatientTest
12-Oct-2021 13:29:45 Running org.openmrs.reference.VisitNoteTest
12-Oct-2021 13:29:45 Running locally...
12-Oct-2021 13:29:45 Starting ChromeDriver 90.0.4430.24 (4c6d850f087da467d926e8eddb76550aed655991-refs/branch-heads/4430@{#429}) on port 6419
12-Oct-2021 13:29:45 Only local connections are allowed.
12-Oct-2021 13:29:45 Please see https://chromedriver.chromium.org/security-considerations for suggestions on keeping ChromeDriver safe.
12-Oct-2021 13:29:45 ChromeDriver was started successfully.
12-Oct-2021 13:29:46 Oct 12, 2021 1:29:46 PM org.openqa.selenium.remote.ProtocolHandshake createSession
12-Oct-2021 13:29:46 INFO: Detected dialect: W3C
12-Oct-2021 13:30:10 Tests run: 1, Failures: 0, Errors: 0, Skipped: 0, Time elapsed: 24.671 sec - in org.openmrs.reference.VisitNoteTest
12-Oct-2021 13:30:10 Running org.openmrs.reference.XSSOnPhoneNumberFieldTest
12-Oct-2021 13:30:10 Running locally...
12-Oct-2021 13:30:10 Starting ChromeDriver 90.0.4430.24 (4c6d850f087da467d926e8eddb76550aed655991-refs/branch-heads/4430@{#429}) on port 18924
12-Oct-2021 13:30:10 Only local connections are allowed.
12-Oct-2021 13:30:10 Please see https://chromedriver.chromium.org/security-considerations for suggestions on keeping ChromeDriver safe.
12-Oct-2021 13:30:10 ChromeDriver was started successfully.
12-Oct-2021 13:30:10 Oct 12, 2021 1:30:10 PM org.openqa.selenium.remote.ProtocolHandshake createSession
12-Oct-2021 13:30:10 INFO: Detected dialect: W3C
12-Oct-2021 13:30:21 Tests run: 1, Failures: 0, Errors: 0, Skipped: 0, Time elapsed: 10.95 sec - in org.openmrs.reference.XSSOnPhoneNumberFieldTest
12-Oct-2021 13:30:21
12-Oct-2021 13:30:21 Results :
12-Oct-2021 13:30:21
12-Oct-2021 13:30:21 Tests in error:
12-Oct-2021 13:30:21 org.openmrs.reference.DeleteAppointmentBlockTest.deleteAppointmentBlockTest(org.openmrs.reference.DeleteAppointmentBlockTest)
12-Oct-2021 13:30:21   Run 1: DeleteAppointmentBlockTest.deleteAppointmentBlockTest:42 » ElementClickIntercepted
12-Oct-2021 13:30:21   Run 2: DeleteAppointmentBlockTest>TestBase.takeScreenshot:345 » NoSuchSession Session...
12-Oct-2021 13:30:21   Run 3: DeleteAppointmentBlockTest.deleteAppointmentBlockTest:42 » ElementClickIntercepted
12-Oct-2021 13:30:21   Run 4: DeleteAppointmentBlockTest>TestBase.takeScreenshot:345 » NoSuchSession Session...
12-Oct-2021 13:30:21   Run 5: DeleteAppointmentBlockTest.deleteAppointmentBlockTest:42 » ElementClickIntercepted
12-Oct-2021 13:30:21   Run 6: DeleteAppointmentBlockTest>TestBase.takeScreenshot:345 » NoSuchSession Session...
12-Oct-2021 13:30:21
12-Oct-2021 13:30:21
12-Oct-2021 13:30:21 Tests run: 58, Failures: 0, Errors: 1, Skipped: 0
12-Oct-2021 13:30:21
12-Oct-2021 13:30:21 [WARNING] File encoding has not been set, using platform encoding UTF-8, i.e. build is platform dependent! The file encoding for reports output files should be provided by the POM property ${project.reporting.outputEncoding}.
12-Oct-2021 13:30:22 [INFO]
12-Oct-2021 13:30:22 [INFO] --- maven-failsafe-plugin:2.18.1:verify (default) @ referenceapplication-ui-tests ---
12-Oct-2021 13:30:22 [INFO] Failsafe report directory: /home/bamboo-agent/bamboo-agent/xml-data/build-dir/REFAPP-UI-FRAMEWORK/ui-tests/target/failsafe-reports
12-Oct-2021 13:30:22 [WARNING] File encoding has not been set, using platform encoding UTF-8, i.e. build is platform dependent! The file encoding for reports output files should be provided by the POM property ${project.reporting.outputEncoding}.
12-Oct-2021 13:30:22 [INFO] ------------------------------------------------------------------------
12-Oct-2021 13:30:22 [INFO] Reactor Summary:
12-Oct-2021 13:30:22 [INFO]
12-Oct-2021 13:30:22 [INFO] Reference Application Distribution ................. SUCCESS [  0.618 s]
12-Oct-2021 13:30:22 [INFO] Reference Application Distribution Package ......... SUCCESS [ 30.734 s]
12-Oct-2021 13:30:22 [INFO] Reference Application Distribution UI Tests ........ FAILURE [17:20 min]
12-Oct-2021 13:30:22 [INFO] ------------------------------------------------------------------------
12-Oct-2021 13:30:22 [INFO] BUILD FAILURE
12-Oct-2021 13:30:22 [INFO] ------------------------------------------------------------------------
12-Oct-2021 13:30:22 [INFO] Total time: 17:52 min
12-Oct-2021 13:30:22 [INFO] Finished at: 2021-10-12T13:30:22+00:00
12-Oct-2021 13:30:22 [INFO] Final Memory: 54M/389M
12-Oct-2021 13:30:22 [INFO] ------------------------------------------------------------------------
12-Oct-2021 13:30:22 [ERROR] Failed to execute goal org.apache.maven.plugins:maven-failsafe-plugin:2.18.1:verify (default) on project referenceapplication-ui-tests: There are test failures.
12-Oct-2021 13:30:22 [ERROR]
12-Oct-2021 13:30:22 [ERROR] Please refer to /home/bamboo-agent/bamboo-agent/xml-data/build-dir/REFAPP-UI-FRAMEWORK/ui-tests/target/failsafe-reports for the individual test results.
12-Oct-2021 13:30:22 [ERROR] -> [Help 1]
12-Oct-2021 13:30:22 org.apache.maven.lifecycle.LifecycleExecutionException: Failed to execute goal org.apache.maven.plugins:maven-failsafe-plugin:2.18.1:verify (default) on project referenceapplication-ui-tests: There are test failures.
12-Oct-2021 13:30:22
12-Oct-2021 13:30:22 Please refer to /home/bamboo-agent/bamboo-agent/xml-data/build-dir/REFAPP-UI-FRAMEWORK/ui-tests/target/failsafe-reports for the individual test results.
12-Oct-2021 13:30:22         at org.apache.maven.lifecycle.internal.MojoExecutor.execute(MojoExecutor.java:212)
12-Oct-2021 13:30:22         at org.apache.maven.lifecycle.internal.MojoExecutor.execute(MojoExecutor.java:153)
12-Oct-2021 13:30:22         at org.apache.maven.lifecycle.internal.MojoExecutor.execute(MojoExecutor.java:145)
12-Oct-2021 13:30:22         at org.apache.maven.lifecycle.internal.LifecycleModuleBuilder.buildProject(LifecycleModuleBuilder.java:116)
12-Oct-2021 13:30:22         at org.apache.maven.lifecycle.internal.LifecycleModuleBuilder.buildProject(LifecycleModuleBuilder.java:80)
12-Oct-2021 13:30:22         at org.apache.maven.lifecycle.internal.builder.singlethreaded.SingleThreadedBuilder.build(SingleThreadedBuilder.java:51)
12-Oct-2021 13:30:22         at org.apache.maven.lifecycle.internal.LifecycleStarter.execute(LifecycleStarter.java:128)
12-Oct-2021 13:30:22         at org.apache.maven.DefaultMaven.doExecute(DefaultMaven.java:307)
12-Oct-2021 13:30:22         at org.apache.maven.DefaultMaven.doExecute(DefaultMaven.java:193)
12-Oct-2021 13:30:22         at org.apache.maven.DefaultMaven.execute(DefaultMaven.java:106)
12-Oct-2021 13:30:22         at org.apache.maven.cli.MavenCli.execute(MavenCli.java:863)
12-Oct-2021 13:30:22         at org.apache.maven.cli.MavenCli.doMain(MavenCli.java:288)
12-Oct-2021 13:30:22         at org.apache.maven.cli.MavenCli.main(MavenCli.java:199)
12-Oct-2021 13:30:22         at sun.reflect.NativeMethodAccessorImpl.invoke0(Native Method)
12-Oct-2021 13:30:22         at sun.reflect.NativeMethodAccessorImpl.invoke(NativeMethodAccessorImpl.java:62)
12-Oct-2021 13:30:22         at sun.reflect.DelegatingMethodAccessorImpl.invoke(DelegatingMethodAccessorImpl.java:43)
12-Oct-2021 13:30:22         at java.lang.reflect.Method.invoke(Method.java:498)
12-Oct-2021 13:30:22         at org.codehaus.plexus.classworlds.launcher.Launcher.launchEnhanced(Launcher.java:289)
12-Oct-2021 13:30:22         at org.codehaus.plexus.classworlds.launcher.Launcher.launch(Launcher.java:229)
12-Oct-2021 13:30:22         at org.codehaus.plexus.classworlds.launcher.Launcher.mainWithExitCode(Launcher.java:415)
12-Oct-2021 13:30:22         at org.codehaus.plexus.classworlds.launcher.Launcher.main(Launcher.java:356)
12-Oct-2021 13:30:22 Caused by: org.apache.maven.plugin.MojoFailureException: There are test failures.
12-Oct-2021 13:30:22
12-Oct-2021 13:30:22 Please refer to /home/bamboo-agent/bamboo-agent/xml-data/build-dir/REFAPP-UI-FRAMEWORK/ui-tests/target/failsafe-reports for the individual test results.
12-Oct-2021 13:30:22         at org.apache.maven.plugin.surefire.SurefireHelper.reportExecution(SurefireHelper.java:82)
12-Oct-2021 13:30:22         at org.apache.maven.plugin.failsafe.VerifyMojo.execute(VerifyMojo.java:195)
12-Oct-2021 13:30:22         at org.apache.maven.plugin.DefaultBuildPluginManager.executeMojo(DefaultBuildPluginManager.java:134)
12-Oct-2021 13:30:22         at org.apache.maven.lifecycle.internal.MojoExecutor.execute(MojoExecutor.java:207)
12-Oct-2021 13:30:22         ... 20 more
12-Oct-2021 13:30:22 [ERROR]
12-Oct-2021 13:30:22 [ERROR] Re-run Maven using the -X switch to enable full debug logging.
12-Oct-2021 13:30:22 [ERROR]
12-Oct-2021 13:30:22 [ERROR] For more information about the errors and possible solutions, please read the following articles:
12-Oct-2021 13:30:22 [ERROR] [Help 1] http://cwiki.apache.org/confluence/display/MAVEN/MojoFailureException
12-Oct-2021 13:30:22 [ERROR]
12-Oct-2021 13:30:22 [ERROR] After correcting the problems, you can resume the build with the command
12-Oct-2021 13:30:22 [ERROR]   mvn <goals> -rf :referenceapplication-ui-tests
12-Oct-2021 13:30:22 Failing task since return code of [/usr/share/apache-maven-3.3.9/bin/mvn --batch-mode -Djava.io.tmpdir=/home/bamboo-agent/bamboo-agent/.agent_tmp/REFAPP-UI-FRAMEWORK clean install -DskipTests=false -e] was 1 while expected 0
12-Oct-2021 13:30:22 Parsing test results under /home/bamboo-agent/bamboo-agent/xml-data/build-dir/REFAPP-UI-FRAMEWORK...
12-Oct-2021 13:30:23 Finished task 'Build distribution' with result: Failed
12-Oct-2021 13:30:23 Running post build plugin 'Docker Container Cleanup'
12-Oct-2021 13:30:23 Running post build plugin 'NCover Results Collector'
12-Oct-2021 13:30:23 Running post build plugin 'Clover Results Collector'
12-Oct-2021 13:30:23 Running post build plugin 'Sauce OnDemand Post Runner'
12-Oct-2021 13:30:23 Running post build plugin 'npm Cache Cleanup'
12-Oct-2021 13:30:23 Running post build plugin 'Artifact Copier'
12-Oct-2021 13:30:23 Finalising the build...
12-Oct-2021 13:30:23 Stopping timer.
12-Oct-2021 13:30:23 Build REFAPP-UI-FRAMEWORK-647 completed.
12-Oct-2021 13:30:23 Running on server: post build plugin 'NCover Results Collector'
12-Oct-2021 13:30:23 Running on server: post build plugin 'Build Hanging Detection Configuration'
12-Oct-2021 13:30:23 Running on server: post build plugin 'Clover Delta Calculator'
12-Oct-2021 13:30:23 Running on server: post build plugin 'Maven Dependencies Postprocessor'
12-Oct-2021 13:30:23 All post build plugins have finished
12-Oct-2021 13:30:23 Generating build results summary...
12-Oct-2021 13:30:23 Saving build results to disk...
12-Oct-2021 13:30:23 Logging substituted variables...
12-Oct-2021 13:30:23 Indexing build results...
12-Oct-2021 13:30:23 Finished building REFAPP-UI-FRAMEWORK-647.